##TITLE=G04-51-SE $$ Begin of the data block
##JCAMP-DX=5.00 $$ ACD/SpecManager v 10.08
##SPECTROMETER/DATA SYSTEM=Alpha
##DATE=22 Oct 2013 09:34:14
##DATA TYPE=INFRARED SPECTRUM
##DATA CLASS=XYDATA
##ORIGIN=
##OWNER=
##NPOINTS=1765
##FIRSTX=399.75695801
##LASTX=3997.56933594
##MAXX=3997.56933594
##MINX=399.75695801
##MAXY=0.81341684
##MINY=0.25573030
##XFACTOR=1.0000000000
##YFACTOR=1.000000000000000e-9
##FIRSTY=0.50602227
##DELTAX=2.03957629
##XUNITS=1/CM
##YUNITS=ARBITRARY UNITS
##XYDATA=(X++(Y..Y))
$$ plain form
399.8 506022274 503893197 502631605 502102256 501945913 502142549 502851963 503287971 502493024 501193821
418.1 501193821 500687957 499971241 498346835 497141331 496442735 494990915 493317515 492606312 492222071
436.5 492222071 491731256 492431760 494709134 496894360 497998118 498873144 499536842 498780727 497039258
454.8 497039258 495610595 494160742 491943717 489565641 487703174 485623598 482925206 480589271
471.1 480589271 478754878 476700425 475015491 474443704 474176377 473444939 472837180 472692698 472001642
489.5 472001642 470335007 468764395 467584014 465746850 463261753 461213827 459357113 456622869
505.8 456622869 453633815 451405168 449208856 446418524 443775922 441828042 440167010 438707978
522.1 438707978 438055038 438146919 438195348 438385457 439668983 441647470 443399489 445609510 448759347
$$ packed form
399.8E06022274k129077j261592n29349j56343J96636P09414M36008p94947j299203
418.1E01193821n05864p16716j624406j205504o98596j451820j673400p11203l84241
436.5D92222071m90815P00504K277374K185226J103758Q75026O63698p56115j741469
454.8D97039258j428663j449853k217025k378076j862467k079576k698392k335935
471.1D80589271j834393k054453j684934n71787k67327p31438o07759j44482o91056
489.5D72001642j666635j570612j180381j837164k485097k047926j856714k734244
505.8D56622869k989054k228647k196312k790332k642602j947880j661032j459032
522.1D38707978o52940R1881M8429J90109J283526J978487J752019K210021L149837
$$ plain form
540.5 448759347 451322168 452150792 452198237 452264667 451650023 450281709 449060857 447759628 445655107
558.8 445655107 443294466 441302717 439032584 436120003 433752000 432724744 432276398 432192981 433477700
577.2 433477700 436041057 438717008 441556603 445078552 448336452 450230449 451408386 452658296
593.5 452658296 453404725 453317940 453296661 453841150 454194427 454236269 454884320 455996275 456571162 456948310
613.9 456948310 458078027 459622353 460975111 462820798 465766788 468842745 471284389 473767757
630.2 473767757 476498127 478577167 479910314 481478721 483379155 484749109 485810369 487283558
646.5 487283558 488509923 488881260 489331841 490381390 491062343 491136521 491672367 492742181 493380904
664.9 493380904 493747920 495085388 496628284 497570395 498704672 500596106 502447069 503521264 504589975
$$ packed form
540.5D48759347K562821Q28624M7445O6430o14644j368314j220852j301229k104521
558.8D45655107k360641j991749k270133k912581k368003j027256m48346q3417J284719
577.2D33477700K563357K675951K839595L521949L257900J893997J177937J249910
593.5D52658296P46429q6785k1279N44489L53277M1842O48051J111955N74887L77148
613.9D56948310J129717J544326J352758J845687K945990L075957K441644K483368
630.2D73767757K730370K079040J333147J568407J900434J369954J061260J473189
646.5D87283558J226365L71337M50581J049549O80953P4178N35846J069814O38723
664.9D93380904L67016J337468J542896R42111J134277J891434J850963J074195J068711
$$ plain form
683.3 504589975 506095648 507104754 507287264 507396281 507423520 506591856 505139589 504356444 504547894
701.6 504547894 505006135 505859017 507681549 510051906 512420833 515311301 519094586 523092508 527052462
720 527052462 531662762 536873698 541648805 545705497 549713731 553481102 556143761 557954550 559686840
738.3 559686840 561036110 561348915 561152697 561076760 560551286 559161961 557675242 556419849 554683626
756.7 554683626 552626669 551409841 551226556 551496267 552620709 555462837 559766293 564622343 569952667
775 569952667 575901330 581617594 586408675 590645432 594553292 597654104 599892199 601988137 604309738
793.4 604309738 606542468 608829439 611779809 615232468 618396521 621151745 623822391 625962198
809.7 625962198 627103746 627814710 628568292 628747940 627947927 626667738 625025928 622492313 619215965
$$ packed form
683.3E04589975J505673J009106J82510J09017K7239q31664j452267p83145J91450
701.6E04547894M58241Q52882J822532K370357K368927K890468L783285L997922L959954
720E27052462M610300N210936M775107M056692M008234L767371K662659J810789J732290
738.3E59686840J349270L12805j96218p5937n25474j389325j486719j255393j736223
756.7E54683626k056957j216828j83285K69711J124442K842128M303456M856050N330324
775E69952667N948663N716264M791081M236757L907860L100812K238095K095938K321601
793.4F04309738K232730K286971K950370L452659L164053K755224K670646K139807
809.7F25962198J141548P10964P53582J79648q00013j280189j641810k533615l276348
$$ plain form
828.1 619215965 616020977 612990737 609622240 606092632 603023410 600291312 597504973 595020413
844.4 595020413 593216300 591709375 590125978 588831484 588049471 587331951 586851239 587830067 591022193
862.7 591022193 595947444 601870656 608392477 614673674 619512856 622541964 623930573 623373210 620628357
881.1 620628357 616327882 611276567 605705678 599830151 594225466 589147508 584274471 579419553
897.4 579419553 574665189 569713533 564091861 557866156 551377118 544690073 537793696 531050265
913.7 531050265 525007963 519913614 515895247 513229847 511902988 511287928 510750294 510309100 510165691
932.1 510165691 510094285 509909451 509787679 509596467 508563638 505826533 500868201 493566126 484326810
950.4 484326810 474119306 463863343 453797609 443803698 434085757 424934179 416207820 407801181
$$ packed form
828.1F19215965l194988l030240l368497l529608l069222k732098k786339k484560
844.4E95020413j804113j506925j583397j294494p82013p17520m80712R78828L192126
862.7E91022193M925251N923212O521821O281197M839182L029108J388609n57363k744853
881.1F20628357m300475n051315n570889n875527n604685n077958m873037m854918
897.4E79419553m754364m951656n621672o225705o489038o687045o896377o743431
913.7E31050265o042302n094349m018367k665400j326859o15060n37634m41194j43409
932.1E10165691p1406j84834j21772j91212j032829k737105m958332p302075r239316
950.4D84326810j0207504j0255963j0065734r993911r717941r151578q726359q406639
$$ plain form
966.8 407801181 400114119 393549174 388081759 383674383 380545169 378589869 377254188 376203209
983.1 376203209 375393242 374631822 373652697 372532487 371562213 370772958 370076060 369676918 369764119 370031863
1003.5 370031863 370008498 369596034 368850261 367658556 366146803 364726007 363466501 362097979 360604197
1021.8 360604197 359185964 357727319 356003970 354212910 352629602 351067811 349252641 347331166
1038.1 347331166 345547706 343809158 342069983 340612233 339567721 338813901 338437438 338713408 339594454
1056.5 339594454 340780914 342234850 344149709 346402645 348392814 349422067 349131674 347818822
1072.8 347818822 346390575 345874965 346748620 348799497 351706803 355369061 359546423 363781065 367857456
1091.2 367857456 371810168 375485778 378559202 380965114 382861406 384338945 385575205 387002319
$$ packed form
966.8D07801181p687062o564945n467415m407376l129214j955300j335681j050979
983.1C76203209q09967p61420r79125j120210r70274p89255o96898l99142Q7201K67744
1003.5C70031863k3365m12464p45773j191705j511753j420796j259506j368522j493782
1021.8C60604197j418233j458645j723349j791060j583308j561791j815170j921475
1038.1C47331166j783460j738548j739175j457750j044512p53820l76463K75970Q81046
1056.5C39594454J186460J453936J914859K252936J990169J029253k90393j312852
1072.8C47818822j428247n15610Q73655K050877K907306L662258M177362M234642M076391
1091.2C67857456L952712L675610L073424K405912J896292J477539J236260J427114
$$ plain form
1107.5 387002319 388922811 391167253 393473357 395854473 398266315 400378138 402033091 403502077
1123.8 403502077 405047596 406738162 408786446 411346734 414008141 416130722 417454153 418053776
1140.1 418053776 417998135 417365760 416485369 415721685 415110618 414631367 414537311 415088236 416273355 418054134
1160.5 418054134 420542240 423677921 427132666 430770934 434809446 439382464 444371551 449733466
1176.8 449733466 455548197 461646676 467715979 473712832 479605138 484969109 489364982 492731839
1193.1 492731839 495095491 496370435 496722251 496621072 496305019 495768338 495258272 495138258 495341182
1211.5 495341182 495587558 495875359 496228576 496363103 496008009 495288908 494371921 493124068 491533220
1229.9 491533220 489925057 488504648 487259746 486284375 485794336 485866278 486399919 487432927 489070803
$$ packed form
1107.5C87002319J920492K244442K306104K381116K411842K111823J654953J468986
1123.8D03502077J545519J690566K048284K560288K661407K122581J323431N99623
1140.1D18053776n5641o32375q80391p63684o11067m79251r4056N50925J185119J780779
1160.5D18054134K488106L135681L454745L638268M038512M573018M989087N361915
1176.8D49733466N814731O098479O069303N996853N892306N363971M395873L366857
1193.1D92731839K363652J274944L51816j01179l16053n36681n10066j20014K02924
1211.5D95341182K46376K87801L53217J34527l55094p19101r16987j247853j590848
1229.9D91533220j608163j420409j244902r75371m90039P1942N33641J033008J637876
$$ plain form
1248.2 489070803 491129458 493311197 495595455 498009294 500362277 502532303 504612982 506711483
1264.5 506711483 508805096 510840535 512854636 514785290 516383886 517636299 518773079 519857645
1280.8 519857645 520829320 521783113 522846937 523821712 524404109 524572432 524377465 523654997 522358418
1299.2 522358418 520777941 519132078 517371953 515513480 513825238 512461007 511358202 510607898
1315.5 510607898 510413170 510700941 511105776 511252999 510899186 509806335 507932961 505672991 503427744
1333.9 503427744 501322269 499470055 498192191 497554541 497113526 496550202 495889068 495086670 493982196
1352.2 493982196 492589891 491061419 489339173 487114847 484320939 481280446 478114843 474857181
1368.5 474857181 471951604 469392061 466720432 463850051 460766852 457336962 453714937 450503498
$$ packed form
1248.2D89070803K058655K181739K284258K413839K352983K170026K080679K098501
1264.5E06711483K093613K035439K014101J930654J598596J252413J136780J084566
1280.8E19857645R71675R53793J063824R74775N82397J68323j94967p22468j296579
1299.2E22358418j580477j645863j760125j858473j688242j364231j102805p50304
1315.5E10607898j94728K87771M04835J47223l53813j092851j873374k259970k245247
1333.9E03427744k105475j852214j277864o37650m41015n63324o61134q02398j104474
1352.2D93982196j392305j528472j722246k224326k793908l040493l165603l257662
1368.5D74857181k905577k559543k671629k870381l083199l429890l622025l211439
$$ plain form
1384.9 450503498 448332638 447344601 446866393 446277142 445738852 445555776 445634633 446063280 446911305 448142022
1405.3 448142022 449609071 451101810 452638119 454176933 455558985 456973433 459080547 461594403
1421.6 461594403 463879079 465982378 467707843 468802273 469324052 469271630 468647718 468149334 468281418
1439.9 468281418 468698621 469093621 469331145 469567955 469889224 469915003 469585836 469788760 471892387 474866837
1460.3 474866837 477323472 479719728 482891023 486773163 491601825 498552144 506745458 513974488
1476.6 513974488 519708157 524025738 526976526 528281331 527868271 526077569 523475289 520409763
1493 520409763 516286969 510975122 505837917 501250088 496354342 489429891 480091691 472463638 466196388
1511.3 466196388 459639996 453465760 448772192 445843220 443577349 441479266 439373314 437068850
$$ packed form
1384.9D50503498k170860r88037m78208n89251n38290j83076P8857M28647Q48025J230717
1405.3D48142022J467049J492739J536309J538814J382052J414448K107114K513856
1421.6D61594403K284676K103299J725465J094430N21779n2422o23912m98384J32084
1439.9D68281418M17203L95000K37524K36810L21269K5779l29167K02924K103627K974450
1460.3D74866837K456635K396256L171295L882140M828662O950319Q193314P229030
1476.6E13974488N733669M317581K950788J304805m13060j790702k602280l065526
1493E20409763m122794n311847n137205m587829m895746o924451r338200p628053o267250
1511.3D66196388o556392o174236m693568k928972k265871k098083k105952k304464
$$ plain form
1527.6 437068850 434879869 432527810 430080861 428286046 426562786 424500674 423825711 424768806 426302165
1546 426302165 428178102 430623710 433714569 437066972 440178424 444054902 449937284 454926819 458646864
1564.3 458646864 461938351 464854658 467720598 470159322 471820176 473307729 474819392 475838661
1580.7 475838661 476256728 476233929 475781292 474937618 473582834 471526325 468716115 465346992 461353600
1599 461353600 456412613 450554162 444037944 436815321 428605258 419789016 410814613 400696874
1615.3 400696874 389102370 378954262 369327456 358117938 347004265 336777955 327111304 318588942
1631.6 318588942 310595840 302711815 297575533 295327902 294362009 294153154 294841379 296722710 298807502
1650 298807502 301149279 305319667 310026258 314399987 319345891 325466752 332467616 339182913 346342921
$$ packed form
1527.6D37068850k188981k352059k446949j794815j723260k062112o74963R43095J533359
1546D26302165J875937K445608L090859L352403L111452L876478N882382M989535L720045
1564.3D58646864L291487K916307K865940K438724J660854J487553J511663J019269
1580.7D75838661M18067k2799m52637q43674j354784k056509k810210l369123l993392
1599D61353600m940987n858451o516218p222623q210063q816242q974403j0117739
1615.3D00696874j1594504j0148108r626806j1209518j1113673j0226310r666651q522362
1631.6C18588942p993102p884025n136282k247631r65893k08855O88225J881331K084792
1650B98807502K341777M170388M706591M373729M945904O120861P000864O715297P160008
$$ plain form
1668.4 346342921 354745477 362892985 371232629 380464554 389173478 397079408 405658066 417097092
1684.7 417097092 428799272 439208031 450337678 461748987 474775493 489667267 504703104
1699 504703104 521419525 535829365 547542155 558992565 568919122 577000082 583773613 589769065
1715.3 589769065 595941544 602222800 607569635 611968994 615718603 618781209 621393621 623502016
1731.6 623502016 625485957 628207088 630999446 633641601 636704504 640315354 644393265 648904383
1747.9 648904383 654203176 660548866 666834950 672594368 678111672 683365464 688729584 693849027
1764.2 693849027 698179841 702012539 705478549 708997309 712959647 716656566 719672978 722219706
1780.5 722219706 724659503 727120399 729436219 731257439 732612312 734365106 736590326 738469481
$$ packed form
1668.4C46342921Q402556Q147508Q339644R231925Q708924P905930Q578658J1439026
1684.7D17097092J1702180J0408759J1129647J1411309J3026506J4891774J5035837
1699E04703104J6716421J4409840J1712790J1450410R926557Q080960O773531N995452
1715.3E89769065O172479O281256N346835M399359L749609L062606K612412K108395
1731.6F23502016J983941K721131K792358K642155L062903L610850M077911M511118
1747.9F48904383N298793O345690O286084N759418N517304N253792N364120N119443
1764.2F93849027M330814L832698L466010L518760L962338L696919L016412K546728
1780.5G22219706K439797K460896K315820J821220J354873J752794K225220J879155
$$ plain form
1796.9 738469481 740016639 741734922 743586063 745263636 746770501 748138726 749455094 750883520
1813.2 750883520 752413571 753857970 755119205 756189287 757129431 758087695 758989751 759904325 761259615
1831.5 761259615 762682080 763666332 764561832 765501380 766014338 766248226 767126739 768412948 769368291
1849.9 769368291 770070910 770784199 771481037 772039175 772601604 773268461 773793757 773914576 774013996 774754226
1870.3 774754226 775786102 776514411 777083874 777727246 778298855 778752923 779272735 779822946 780215740
1888.6 780215740 780664325 781308830 781895936 782357097 782805383 783321381 783794403 784100413 784345329 784676552
1909 784676552 785077393 785403848 785564840 785667002 785931528 786283016 786676288 787180543 787559450 787755132
1929.4 787755132 788002968 788300097 788488507 788638294 788782477 788803816 788854301 789134443 789526939 789850533
$$ packed form
1796.9G38469481J547158J718283J851141J677573J506865J368225J316368J428426
1813.2G50883520J530051J444399J261235J070082R40144R58264R02056R14574J355290
1831.5G61259615J422465R84252Q95500R39548N12958K33888Q78513J286209R55343
1849.9G69368291P02619P13289O96838N58138N62429O66857N25296J20819R9420P40230
1870.3G74754226J031876P28309N69463O43372N71609M54068N19812N50211L92794
1888.6G80215740M48585O44505N87106M61161M48286N15998M73022L06010K44916L31223
1909G84676552M00841L26455J60992J02162K64526L51488L93272N04255L78907J95682
1929.4G87755132K47836K97129J88410J49787J44183K1339N0485K80142L92496L23594
$$ plain form
1949.8 789850533 790058851 790262997 790545404 790777802 790926278 791142166 791383743 791503251 791641355 791939080
1970.2 791939080 792220175 792358994 792494535 792743206 792963922 793040991 793080211 793183625 793262243 793245256
1990.6 793245256 793312550 793534100 793692946 793759286 793864667 793960631 793960035 793881536 793813705 793747663 793601215
2013 793601215 793399215 793245375 793129742 792933702 792716146 792570710 792407751 792164564 791925967 791723132
2033.4 791723132 791499138 791254461 791040301 790866971 790711284 790584683 790501535 790473282 790460050 790436864
2053.8 790436864 790466070 790558398 790633857 790678382 790768802 790908456 791025043 791109920 791241348 791397512 791507244
2076.3 791507244 791619301 791787267 791932881 792008042 792112648 792294085 792488217 792646170 792809010 793002307
2096.7 793002307 793187559 793355286 793566883 793818474 793997645 794107497 794270635 794483662 794646025 794784188
$$ packed form
1949.8G89850533K08318K04146K82407K32398J48476K15888K41577J19508J38104K97725
1970.2G91939080K81095J38819J35541K48671K20716P7069L9220J03414P8618j6987
1990.6G93245256O7294K21550J58846O6340J05381R5964n96p8499o7831o6042j46448
2013G93601215k02000j53840j15633j96040k17556j45436j62959k43187k38597k02835
2033.4G91723132k23994k44677k14160j73330j55687j26601q3148k8253j3232k3186
2053.8G90436864K9206R2328P5459M4525R0420J39654J16587Q4877J31428J56164J09732
2076.3G91507244J12057J67966J45614P5161J04606J81437J94132J57953J62840J93297
2096.7G93002307J85252J67727K11597K51591J79171J09852J63138K13027J62363J38163
$$ plain form
2117.1 794784188 794955730 795105577 795191169 795281053 795415580 795534015 795609295 795696855 795845807 795987964
2137.5 795987964 796078980 796204567 796371758 796498299 796608269 796768486 796953499 797116935 797279596 797480702
2157.9 797480702 797706187 797946393 798237622 798597515 798969269 799327374 799741566 800229430 800686121 801051378
2178.2 801051378 801403880 801805854 802219808 802609921 803023636 803480566 803894460 804253817 804633439 804996967
2198.6 804996967 805290639 805618465 806036174 806412995 806694686 807011783 807414770 807789266 808090806 808405995
2219 808405995 808750391 809032381 809265971 809539139 809800148 809973121 810134470 810356796 810571373 810719490
2239.4 810719490 810861766 811042368 811197996 811318398 811473787 811667562 811792433 811831713 811935961 812115073
2259.8 812115073 812233686 812295973 812422037 812591612 812697649 812794149 812954903 813090920 813116968 813133240
$$ packed form
2117.1G94784188J71542J49847Q5592Q9884J34527J18435P5280Q7560J48952J42157
2137.5G95987964R1016J25587J67191J26541J09970J60217J85013J63436J62661K01106
2157.9G97480702K25485K40206K91229L59893L71754L58105M14192M87864M56691L65257
2178.2H01051378L52502M01974M13954L90113M13715M56930M13894L59357L79622L63528
2198.6H04996967K93672L27826M17709L76821K81691L17097M02987L74496L01540L15189
2219H08405995L44396K81990K33590K73168K61009J72973J61349K22326K14577J48117
2239.4H10719490J42276J80602J55628J20402J55389J93775J24871L9280J04248J79112
2259.8H12115073J18613O2287J26064J69575J06037R6500J60754J36017K6048J6272
$$ plain form
2280.2 813133240 813231170 813317478 813336194 813376486 813416839 813342988 813241482 813244045 813267052 813199878 813112020
2302.7 813112020 813097715 813063443 812900364 812736571 812663794 812554240 812359691 812124252 811836720 811521769
2323.1 811521769 811248899 810980856 810675919 810343623 810031831 809772670 809480369 809137106 808875084 808755934
2343.5 808755934 808735430 808830678 808859706 808594763 808106601 807644367 807241738 806829572 806486130 806251049
2363.8 806251049 806075215 805925071 805787265 805724204 805751622 805790424 805779517 805726349 805640399 805485785 805259168
2386.3 805259168 805031180 804805517 804497302 804121733 803780138 803439319 802998841 802517056 802089334 801670909
2406.7 801670909 801186204 800657690 800157189 799669623 799120367 798546791 798008263 797434807 796784103 796151280
2427.1 796151280 795558214 794903338 794213176 793591738 792998552 792332888 791643798 791022182 790401042 789696276
$$ packed form
2280.2H13133240R7930Q6308J8716M0292M0353p3851j01506K563K3007o7174q7858
2302.7H13112020j4305l4272j63079j63793p2777j09554j94549k35439k87532l14951
2323.1H11521769k72870k68043l04937l32296l11792k59161k92301l43263k62022j19150
2343.5H08755934k0504R5248K9028k64943m88162m62234m02629m12166l43442k35081
2363.8H06251049j75834j50144j37806o3061K7418L8802j0907n3168q5950j54614k26617
2386.3H05259168k27988k25663l08215l75569l41595l40819m40478m81785m27722m18425
2406.7H01670909m84705n28514n00501m87566n49256n73576n38528n73456o50704o32823
2427.1G96151280n93066o54876o90162o21438n93186o65664o89090o21616o21140p04766
$$ plain form
2447.5 789696276 788968325 788311064 787689567 787046790 786418140 785801709 785131335 784430385 783794343 783213794
2467.9 783213794 782617271 781986833 781345189 780703545 780057013 779432654 778851509 778278232 777682483 777077019
2488.3 777077019 776471972 775854111 775239289 774688482 774193585 773658812 773068726 772514284 772007346 771465421
2508.7 771465421 770911157 770392656 769846022 769252181 768656552 768066227 767477572 766889691 766288638 765669346
2529 765669346 765012503 764319897 763655365 763032377 762385368 761668682 760912120 760191798 759548783 758944213
2549.4 758944213 758306682 757647336 756995380 756317973 755648434 755036235 754435539 753802299 753165901 752569437
2569.8 752569437 751973987 751330674 750694096 750086129 749458849 748815954 748175442 747520566 746849835 746219099
2590.2 746219099 745646000 745070219 744464934 743854702 743239164 742569804 741843104 741102576 740339756 739531875
$$ packed form
2447.5G89696276p27951o57261o21497o42777o28650o16431o70374p00950o36042n80549
2467.9G83213794n96523o30438o41644To46532o24359n81145n73277n95749o05464
2488.3G77077019o05047o17861o14822n50807m94897n34773n90086n54442n06938n41925
2508.7G71465421n54264n18501n46634n93841n95629n90325n88655n87881o01053o19292
2529G65669346o56843o92606o64532o22988o47009p16686p56562p20322o43015o04570
2549.4G58944213o37531o59346o51956o77407o69539o12199o00696o33240o36398n96464
2569.8G52569437n95450o43313o36578o07967o27280o42895o40512o54876o70731o30736
2590.2G46219099n73099n75781o05285o10232o15538o69360p26700p40528p62820q07881
$$ plain form
2610.6 739531875 738688350 737830698 736956477 736040175 735065341 734052956 733027756 731969655 730856776
2629 730856776 729715586 728573978 727425158 726267576 725115240 723967433 722802520 721639812 720481217
2647.3 720481217 719286621 718096077 716962337 715865254 714741051 713565111 712410331 711307585
2663.7 711307585 710205197 709105253 708050013 707025826 705991745 704958379 703943908 702938139
2680 702938139 701947033 700993180 700061321 699090302 698074579 697060764 696054161 695021808 693965554
2698.3 693965554 692911625 691817999 690663934 689508140 688340962 687118053 685883820 684705436
2714.6 684705436 683561087 682363749 681119084 679927886 678821385 677734196 676629245 675569654
2731 675569654 674575567 673572004 672555745 671570599 670595407 669601858 668618917 667683721 666772485 665848851
$$ packed form
2610.6G39531875q43525q57652q74221r16302r74834j012385j025200j058101j112879
2629G30856776j141190j141608j148820j157582j152336j147807j164913j162708j158595
2647.3G20481217j194596j190544j133740j097083j124203j175940j154780j102746
2663.7G11307585j102388j099944j055240j024187j034081j033366j014471j005769
2680G02938139r91106r53853r31859r71019j015723j013815j006603j032353j056254
2698.3F93965554j053929j093626j154065j155794j167178j222909j234233j178384
2714.6F84705436j144349j197338j244665j191198j106501j087189j104951j059591
2731F75569654r94087j003563j016259r85146r75192r93549r82941r35196r11236r23634
$$ plain form
2751.4 665848851 664947093 664083302 663196206 662269413 661369145 660504639 659602463 658664405 657740176 656783164
2771.8 656783164 655730009 654630840 653563559 652476966 651278555 650022268 648786128 647510052
2788.1 647510052 646147609 644760728 643366039 641898453 640338182 638720155 637075424 635404706
2804.4 635404706 633697212 631956518 630156815 628246784 626249492 624254465 622243047 620118260
2820.7 620118260 617902637 615645349 613272488 610741317 608108103 605345845 602354050 599091053
2837 599091053 595497906 591356575 586441040 580770016 574562728 568205476 562343121 557661176 554427147
2855.4 554427147 552332342 550715387 548910618 546480060 543255210 539424658 535461009 531787276
2871.7 531787276 528648674 526175141 524361551 523039460 521966338 520952702 519881964 518677473
$$ packed form
2751.4F65848851r01758q63791q87096r26793r00268q64506r02176r38058r24229r57012
2771.8F56783164j053155j099169j067281j086593j198411j256287j236140j276076
2788.1F47510052j362443j386881j394689j467586j560271j618027j644731j670718
2804.4F35404706j707494j740694j799703j910031j997292j995027k011418k124787
2820.7F20118260k215623k257288k372861k531171k633214k762258k991795l262997
2837E99091053l593147m141331m915535n671024o207288o357252n862355m681945l234029
2855.4E54427147k094805j616955j804769k430558l224850l830552l963649l673733
2871.7E31787276l138602k473533j813590j322091j073122j013636j070738j204491
$$ plain form
2888 518677473 517320573 515827656 514196455 512390792 510339677 508036971 505532622 502759933 499589860
2906.4 499589860 495978922 491900355 487279326 482119083 476649344 471267432 466386884 462377429
2922.7 462377429 459470183 457729846 457153469 457706064 459327936 461930305 465384454 469508559 473999321
2941 473999321 478411913 482322335 485522419 487992376 489767611 490984797 491995364 493228108 494994104
2959.4 494994104 497467220 500684083 504603803 509146571 514160633 519498110 525007069 530458510
2975.7 530458510 535714984 540767133 545491159 549746752 553557396 556933880 559816062 562181711
2992 562181711 564029157 565311790 565969825 566049993 565680861 564917922 563829362 562632263 561497569
3010.4 561497569 560398877 559295952 558232725 557154059 555874825 554311275 552538872 550610960
$$ packed form
2888E18677473j356900j492917j631201j805663k051115k302706k504349k772689l170073
2906.4D99589860l610938m078567m621029n160243n469739n381912m880548m009455
2922.7D62377429k907246j740337n76377N52595J621872K602369L454149M124105M490762
2941D73999321M412592L910422L200084K469957J775235J217186J010567J232744J765996
2959.4D94994104K473116L216863L919720M542768N014062N337477N508959N451441
2975.7E30458510N256474N052149M724026M255593L810644L376484K882182K365649
2992E62181711J847446J282633O58035Q0168l69132p62939j088560j197099j134694
3010.4E61497569j098692j102925j063227j078666j279234j563550j772403j927912
$$ plain form
3026.7 550610960 548550844 546479523 544467211 542409241 540231526 537989557 535720766 533379972
3043 533379972 530939817 528436244 525947571 523506701 521034360 518487096 515943766 513496935 511164069
3061.4 511164069 508915842 506788015 504836082 502995789 501209080 499488533 497813851 496174008
3077.7 496174008 494570196 493006021 491506428 490081757 488731831 487446517 486179799 484900832
3094 484900832 483642548 482404441 481120110 479762018 478362948 476953954 475507349 473994792 472456694
3112.4 472456694 470901787 469307631 467681259 465964347 464125186 462275207 460455507 458566785
3128.7 458566785 456576675 454562157 452594340 450643867 448643744 446589172 444484979 442325622
3145 442325622 440158725 438047379 435969979 433830112 431579232 429295331 427052110 424839020 422643632
$$ packed form
3026.7E50610960k060116k071321k012312k057970k177715k241969k268791k340794
3043E33379972k440155k503573k488673k440870k472341k547264k543330k446831k332866
3061.4E11164069k248227k127827j951933j840293j786709j720547j674682j639843
3077.7D96174008j603812j564175j499593j424671j349926j285314j266718j278967
3094D84900832j258284j238107j284331j358092j399070j408994j446605j512557j538098
3112.4D72456694j554907j594156j626372j716912j839161j849979j819700j888722
3128.7D58566785j990110k014518j967817j950473k000123k054572k104193k159357
3145D42325622k166897k111346k077400k139867k250880k283901k243221k213090k195388
$$ plain form
3163.4 422643632 420451999 418220162 415966421 413743496 411504894 409222156 406948268 404710799
3179.7 404710799 402477771 400237858 398037255 395892739 393733293 391515523 389331847 387207180
3196 387207180 385071009 382960826 380918860 378924310 376983374 375077188 373165667 371249169 369347960
3214.3 369347960 367493033 365696371 363891482 362025231 360144973 358268708 356384218 354514927
3230.7 354514927 352652013 350720167 348682761 346600890 344511688 342405140 340281963 338133186
3247 338133186 335927427 333694965 331491292 329288960 327040255 324756801 322505713 320341051 318256110
3265.3 318256110 316222221 314248621 312361896 310576379 308919907 307402670 305995136 304690868
3281.6 304690868 303494185 302399039 301406235 300506085 299704462 299003750 298365891 297740310 297111005
$$ packed form
3163.4D22643632k191633k231837k253741k222925k238602k282738k273888k237469
3179.7D04710799k233028k239913k200603k144516k159446k217770k183676k124667
3196C87207180k136171k110183k041966j994550j940936j906186j911521j916498j901209
3214.3C69347960j854927j796662j804889j866251j880258j876265j884490j869291
3230.7C54514927j862914j931846k037406k081871k089202k106548k123177k148777
3247C38133186k205759k232462k203673k202332k248705k283454k251088k164662k084941
3265.3C18256110k033889j973600j886725j785517j656472j517237j407534j304268
3281.6C04690868j196683j095146r92804r00150q01623p00712o37859o25581o29305
$$ plain form
3300 297111005 296521693 296013355 295549423 295073748 294581324 294087797 293616056 293169260 292705476 292206913
3320.4 292206913 291689485 291141719 290539324 289912701 289295197 288653791 287990689 287313402 286569327 285728157
3340.8 285728157 284799248 283804864 282795906 281810462 280783504 279675901 278558344 277470261 276381612
3359.1 276381612 275248379 274094731 272996038 271923304 270781428 269543380 268319130 267232180
3375.5 267232180 266236126 265279204 264375091 263547510 262824625 262213409 261669099 261041701 260273755 259566814
3395.9 259566814 259113431 258812726 258387119 257782221 257236063 256840765 256532371 256289005 256073028 255891800
3416.3 255891800 255786240 255730301 255738914 255912423 256257176 256722987 257254213 257864416 258583963 259250104
3436.6 259250104 259741902 260231704 260918766 261834532 262903243 263998866 265114754 266268522 267446756
$$ packed form
3300B97111005n89312n08338m63932m75675m92424m93527m71741m46796m63784m98563
3320.4B92206913n17428n47766o02395o26623o17504o41406o63102o77287p44075q41170
3340.8B85728157r28909r94384j008958r85444j026958j107603j117557j088083j088649
3359.1B76381612j133233j153648j098693j072734j141876j238048j224250j086950
3375.5B67232180r96054r56922r04113q27581p22885o11216n44310o27398p67946p06941
3395.9B59566814m53383l00705m25607o04898n46158l95298l08394k43366k15977j81228
3416.3B55891800j05560n5939Q613J73509L44753M65811N31226O10203P19547O66141
3436.6B59250104M91798M89802O87062R15766J068711J095623J115888J153768J178234
$$ plain form
3455 267446756 268724412 270145029 271610171 273111373 274764746 276497871 278050393 279352993 280713052
3473.4 280713052 282338560 284189403 286081851 287817270 289546639 291456580 293378353 295231581
3489.7 295231581 297158390 299166679 301221877 303265214 305286139 307347000 309357822 311271995
3506 311271995 313273013 315477014 317833304 320178360 322356343 324506491 326854527 329420894 331952512
3524.4 331952512 334310502 336710393 339289308 341962725 344712555 347532094 350298703 353087604
3540.7 353087604 356039256 359040946 361894757 364704937 367689967 370877475 374142557 377412170
3557 377412170 380774081 384200394 387508512 390732855 394384861 398616940 402819306 406781286 410822302
3575.3 410822302 415045202 419365138 423791170 428248465 432612687 437079102 441915751 446781844
$$ packed form
3455B67446756J277656J420617J465142J501202J653373J733125J552522J302600J360059
3473.4B80713052J625508J850843J892448J735419J729369J909941J921773J853228
3489.7B95231581J926809K008289K055198K043337K020925K060861K010822J914173
3506C11271995K001018K204001K356290K345056K177983K150148K348036K566367K531618
3524.4C31952512K357990K399891K578915K673417K749830K819539K766609K788901
3540.7C53087604K951652L001690K853811K810180K985030L187508L265082L269613
3557C77412170L361911L426313L308118L224343L652006M232079M202366L961980M041016
3575.3D10822302M222900M319936M426032M457295M364222M466415M836649M866093
$$ plain form
3591.7 446781844 451535434 456429809 461520791 466690451 471841305 476802766 481498122 486269504
3608 486269504 491332412 496559352 501866519 507003367 512035847 517486930 522991836 527885497 532130778
3626.3 532130778 536562204 542048812 547596097 552672327 557514787 562152982 566679120 571055830
3642.6 571055830 574955583 578338981 582038939 586771488 591618776 595787108 599833071 604084969
3659 604084969 608019948 611513734 614707470 617408276 619771540 622552335 625267267 627628088 630780220
3677.3 630780220 634350657 637509525 640348911 642812967 644748569 646636784 649163306 651993692
3693.6 651993692 654502630 656528473 658145130 659613192 661325634 663055122 664256513 664975405
3709.9 664975405 666130841 668236077 670298398 671702385 672714353 673696041 674739838 675890625
$$ packed form
3591.7D46781844M753590M894375N090982N169660N150854M961461M695356M771382
3608D86269504N062908N226940N307167N136848N032480N451083N504906M893661M245281
3626.3E32130778M431426N486608N547285N076230M842460M638195M526138M376710
3642.6E71055830L899753L383398L699958M732549M847288M168332M045963M251898
3659F04084969L934979L493786L193736K700806K363264K780795K714932K360821L152132
3677.3F30780220L570437L158868K839386K464056J935602J888215K526522K830386
3693.6F51993692K508938K025843J616657J468062J712442J729488J201391P18892
3709.9F64975405J155436K105236K062321J403987J011968R81688J043797J150787
$$ plain form
3726.3 675890625 677205324 678214610 678657770 679085970 680206001 681954622 683366060 683633804 683575928
3744.6 683575928 684606910 685574293 685988724 687244058 689120293 690504134 691385686 692395031 693443000
3763 693443000 694156587 694735169 695351899 696239352 697413623 698400259 699006319 699472785 700165570 700973213
3783.4 700973213 701723754 702522039 703338087 704056919 704425573 704447389 704605460 704732656 704907656 705836833
3803.8 705836833 706731796 707419395 708534181 709480762 709572732 709287047 709474146 709655941 710149109 711376131
3824.2 711376131 712321639 712849796 713180840 713365018 713669777 713813901 713779330 714271843 715191662 716137111
3844.6 716137111 716979504 717431366 716940522 715569913 715588748 717351377 718702435 719139397 719137907 719300389
3865 719300389 719642818 719677031 719816446 720423520 721210837 721910059 722074389 722105205 722382426 722583890
$$ packed form
3726.3F75890625J314699J009286M43160M28200J120031J748621J411438K67744n7876
3744.6F83575928J030982R67383M14431J255334J876235J383841Q81552J009345J047969
3763F93443000P13587N78582O16730Q87453J174271R86636O06060M66466O92785Q07643
3783.4G00973213P50541P98285Q16048P18832L68654K1816J58071J27196J75000R29177
3803.8G05836833Q94963O87599J114786R46581R1970k85685J87099J81795M93168J227022
3824.2G11376131R45508N28157L31044J84178L04759J44124l4571M92513R19819R45449
3844.6G16137111Q42393M51862m90844j370609J8835J762629J351058M36962j490J62482
3865G19300389L42429L4213J39415O07074P87317O99222J64330L0816K77221K01464
$$ plain form
3885.4 722583890 723001957 723420262 723573029 724029958 724580884 724554181 724092364 723790646 723986983 724729240
3905.7 724729240 725602806 726179421 726481438 726610959 726541042 726435900 726596355 726876020 727055728 727288067
3926.1 727288067 727506995 727516711 727583945 727941751 728316665 728517652 728565335 728548944 728712082 728976130
3946.5 728976130 729096830 729208112 729450345 729704618 729852915 729974568 730145216 730305612 730428219 730533481
3966.9 730533481 730686545 730904400 731099010 731239498 731334090 731385171 731471181 731647253 731834412 731981635
3987.3 731981635 732149661 732320487 732457936 732624173 732778430
3997.5 732778430
$$ packed form
3885.4G22583890M18067M18305J52767M56929N50926k6703m61817l01718J96337P42257
3905.7G24729240Q73566N76615L02017J29521o9917j05142J60455K79665J79708K32339
3926.1G27288067K18928R716O7234L57806L74914K00987M7683j6391J63138K64048
3946.5G28976130J20700J11282K42233K54273J48297J21653J70648J60396J22607J05262
3966.9G30533481J53064K17855J94610J40488R4592N1081Q6010J76072J87159J47223
3987.3G31981635J68026J70826J37449J66237J54257
3997.5G32778430
##END=$$ End of the data block
