##TITLE=G04-51-CE $$ Begin of the data block
##JCAMP-DX=5.00 $$ ACD/SpecManager v 10.08
##SPECTROMETER/DATA SYSTEM=Alpha
##DATE=22 Oct 2013 10:53:20
##DATA TYPE=INFRARED SPECTRUM
##DATA CLASS=XYDATA
##ORIGIN=
##OWNER=
##NPOINTS=1765
##FIRSTX=399.75695801
##LASTX=3997.56933594
##MAXX=3997.56933594
##MINX=399.75695801
##MAXY=0.80827278
##MINY=0.23808028
##XFACTOR=1.0000000000
##YFACTOR=1.000000000000000e-9
##FIRSTY=0.50801826
##DELTAX=2.03957629
##XUNITS=1/CM
##YUNITS=ARBITRARY UNITS
##XYDATA=(X++(Y..Y))
399.8E08018255j667678k633333k424836j035035N05328P53224l19183j410067j448810
418.1D98337865m15504l45409j479000k097726j810521j317739j182646j474410j428127
436.5D86786783m29809J007676K050668J932174P77781j28985j53541J44601l29912
454.8D91657436j842380k854079k407580j826883j891434k428502k927184k948314
471.1D72531080k177119j036078p24941j157940j248002n52505J53691j89931j461505
489.5D64136750k371908k027183j187146j145721k124309l173232l254474k580195
505.8D46272582k178192k525509l174096l367663k911567k115190j544237j580865
522.1D26875263j799076j350403j99825P52747J078695J100004J525223K431929L006280
$$ plain form
399.8 508018255 506350577 503717244 501292408 500257373 500762701 501515925 501196742 499786675 498337865
418.1 498337865 497922361 497576952 496097952 494000226 492189705 490871966 489689320 488214910 486786783
436.5 486786783 486356974 487364650 489415318 491347492 492125273 491996288 491842747 491987348 491657436
454.8 491657436 489815056 486960977 484553397 482726514 480835080 478406578 475479394 472531080
471.1 472531080 470353961 469317883 468592942 467435002 466187000 465634495 465788186 465598255 464136750
489.5 464136750 461764842 459737659 458550513 457404792 455280483 452107251 448852777 446272582
505.8 446272582 444094390 441568881 438394785 435027122 432115555 430000365 428456128 426875263
522.1 426875263 425076187 423725784 423525959 424278706 425357401 426457405 427982628 430414557 433420837
540.5D33420837K506405J019090k40176n25803l71903m01795r66191j817018k125412
558.8D30498034j813948j648963j991957k582521k706289j881063m63188P89345J354515
577.2D19553965J501978J993686K992391L619343L135085J831979P58320N47081P55251
595.6D36689079O48916R4503m28379l80158K92033Q19355O12646L1621k03670L01123
616D38477069J315862K095491K193510K058566K307713K947986L238201K676219J758814
634.3D59069431J312762J599014K101332J994759J228511N29915M63188R27955J188606
652.7D70415473P59453M6104k06530K00301P83473Q02756K86966K76029J100451J702905
673.1D76167381K087623J900255J326174J117468J426905J738966J517415O26415l43681
$$ plain form
540.5 433420837 435927242 436946332 436706156 436180353 435808450 435406655 434440464 432623446 430498034
558.8 430498034 428684086 427035123 425043166 422460645 419754356 417873293 417410105 418199450 419553965
577.2 419553965 421055943 423049629 426042020 429661363 432796448 434628427 435386747 435933828 436689079
595.6 436689079 437337995 437432498 437004119 436623961 436915994 437735349 438347995 438379616 438175946 438477069
616 438477069 439792931 441888422 444081932 446140498 448448211 451396197 454634398 457310617 459069431
634.3 459069431 460382193 461981207 464082539 466077298 467305809 467835724 468298912 469226867 470415473
652.7 470415473 471174926 471221030 471014500 471214801 471998274 472801030 473087996 473364025 474464476 476167381
673.1 476167381 478255004 480155259 481481433 482598901 484025806 485764772 487282187 487908602 487564921
691.4D87564921o99192m44680j32740j57177k49058J64061J183898K285689K804249
709.8D92319971K699405K568931K967447L930866M825235M832804M173219L869057
726.1E22186935M137635M429519M063309K859532J595736J163542J431823J436889
742.4E43304920P00951l76165q87752n47766j05620m06682j384616k001941j534105
760.8E36761224l21984Q31544J493395J948595K981543M608512N803883N787671M816234
779.1E64710617L842831L539443L733039L584027K652407J598358J399219K198160
795.4E87258101L223478L499449L019929K638697K830327L264904L060758J909971
811.7F10705614N62966O9261N11646P46906n1320j399577k355992k413691j845777
$$ plain form
691.4 487564921 486865729 486421049 486288309 486131132 485882074 486046135 487230033 489515722 492319971
709.8 492319971 495019376 497588307 500555754 504486620 509311855 514144659 518317878 522186935
726.1 522186935 526324570 530754089 534817398 537676930 539272666 540436208 541868031 543304920
742.4 543304920 544005871 543629706 542741954 542194188 542088568 541681886 540297270 538295329 536761224
760.8 536761224 536439240 537270784 538764179 540712774 543694317 548302829 554106712 559894383 564710617
779.1 564710617 568553448 572092891 575825930 579409957 582062364 583660722 585059941 587258101
795.4 587258101 590481579 593981028 597000957 599639654 602469981 605734885 608795643 610705614
811.7 610705614 611268580 611337841 611849487 612596393 612545073 611145496 608789504 606375813 604530036
830.1F04530036j644790k324581l190935l252625k457857j647651j602292k063096
846.4E86346209k092838j376510m24802p0036n34117q48532L11435L003537N557359
864.8E89871705O418645N806267M964292M651785M372657K924263K10702k487301m000247
883.1F12732768m288971m324437m853189n587756n690575m893184l970444l899574
899.4E75224638m828036n962849o503224o464064o441712o858528p367551p098914
915.8E23699760n738318l934681k519786j891017j785338j470447p18295j12772j85013
934.1E05344093p21395j018942q25941q50678k119541m728645p565349r409756j0044127
952.5D68059719j0191083j0505230j0949105j1099457j0798604j0314643r978026r788126
$$ plain form
830.1 604530036 602885246 600560665 597369730 594117105 591659248 590011597 588409305 586346209
846.4 586346209 584253371 582876861 582452059 582382023 581847906 580999374 581310809 584314346 589871705
864.8 589871705 596290350 602096617 607060909 611712694 616085351 619009614 619220316 616733015 612732768
883.1 612732768 608443797 604119360 599266171 593678415 587987840 583094656 579124212 575224638
899.4 575224638 570396602 564433753 557930529 551466465 545024753 538166225 530798674 523699760
915.8 523699760 517961442 514026761 511506975 509615958 507830620 506360173 505641878 505529106 505344093
934.1 505344093 504622698 503603756 502777815 501927137 499807596 495078951 487513602 478103846 468059719
952.5 468059719 457868636 447363406 436414301 425314844 414516240 404201597 394223571 384435445
968.8C84435445r411514q512675p097900n543262m252553l345043k585381j777738
985.1C41909379j109809q87215j103461j432180j429200r54599m28378k43515l97891
1003.5C33923131p00354r52095j126707j364678j697242j971156j991063j757145j562536
1021.8C20800155j667797k030879k309055k209961j909643j792163j979619k290756
1038.1C04610282k340972k016127j637400j439958j333595j040429m12195L59088R34988
1056.5B95683682J215547J402557J766592K224714K244383J318574l59505j660556
1072.8C03835988j605451l93272J091868K264768L057092L632963M104793M437298
1089.1C20426047M491925M149526L579438L064543K636135K159864J643151J361399
$$ plain form
968.8 384435445 375023931 366511256 359413356 353870094 349617541 346272498 343687117 341909379
985.1 341909379 340799570 339912355 338808894 337376714 335947514 334992915 334564537 334321022 333923131
1003.5 333923131 333222777 332270682 331143975 329779297 328082055 326110899 324119836 322362691 320800155
1021.8 320800155 319132358 317101479 314792424 312582463 310672820 308880657 306901038 304610282
1038.1 304610282 302269310 300253183 298615783 297175825 295842230 294801801 294389606 294748694 295683682
1056.5 295683682 296899229 298301786 300068378 302293092 304537475 305856049 305496544 303835988
1072.8 303835988 302230537 301837265 302929133 305193901 308250993 311883956 315988749 320426047
1089.1 320426047 324917972 329067498 332646936 335711479 338347614 340507478 342150629 343512028
1105.4C43512028J547009K093315K701551L074437L061712K779335K512395K418280
1121.8C63700062K385676K324581K376944K706945L134608L250390K808780J841038
1138.1C84529024O69808k22058n93036o37293o52730p16239o00935p0244P90835J716494
1158.5C84213626K490402L106594L723472M428208N120069N664080O085754O494879
1174.8D21327084O961525P444113P710189P508904O874829O126583N433649M616975
1191.1D74003851L438086J943916N69463k57135n52863o40690p36058q20756p04109
1209.5D76243705l05415J21892K08557j23680n82367q97587j071870j245797j557439
1227.8D70789999j981914k175153j897752j373350r17674n94168k76477K47687J043082
$$ plain form
1105.4 343512028 345059037 347152352 349853903 352928340 355990052 358769387 361281782 363700062
1121.8 363700062 366085738 368410319 370787263 373494208 376628816 379879206 382687986 384529024
1138.1 384529024 385198832 384976774 384383738 383746445 383093715 382377476 381776541 381706297 382497132 384213626
1158.5 384213626 386704028 389810622 393534094 397962302 403082371 408746451 414832205 421327084
1174.8 421327084 428288609 435732722 443442911 450951815 457826644 463953227 469386876 474003851
1191.1 474003851 477441937 479385853 479955316 479698181 479145318 478504628 477768570 476947814 476243705
1209.5 476243705 475938290 476060182 476268739 476145059 475562692 474665105 473593235 472347438 470789999
1227.8 470789999 468808085 466632932 464735180 463361830 462444156 461849988 461573511 461821198 462864280
1246.2D62864280J806885K214283K280890K253890K323688K498984K594411K447576
1262.5D81284887K198696K150297K374887K567888K370476J743466J103103Q79407
1278.8D96673107J064479J285434J247824J043558Q91626Q32736O81341J95801o52611
1297.2E03263295j478136j830190j703412j595348j807987k010763j844883j249641
1313.5D89742935m93586N3674K74270K19673l0696m25875j033396j817882k474338
1331.8D84014779k699107k438157j864344j157075o91385o42627o87033o73175p94440
1350.2D72367436j203120j750588k092720k211123k468437k931744l387600l804088
1366.5D52518016l899574l334224k883405k964079l221184l655821m064501m050106
$$ plain form
1246.2 462864280 464671165 466885448 469166338 471420228 473743916 476242900 478837311 481284887
1262.5 481284887 483483583 485633880 488008767 490576655 492947131 494690597 495793700 496673107
1278.8 496673107 497737586 499023020 500270844 501314402 502206028 503038764 503720105 503915906 503263295
1297.2 503263295 501785159 499954969 498251557 496656209 494848222 492837459 490992576 489742935
1313.5 489742935 489249349 489303023 489577293 489796966 489766270 489340395 488306999 486489117 484014779
1331.8 484014779 481315672 478877515 477013171 475856096 475164711 474522084 473835051 473161876 472367436
1350.2 472367436 471164316 469413728 467321008 465109885 462641448 459709704 456322104 452518016
1366.5 452518016 448618442 445284218 442400813 439436734 436215550 432559729 428495228 424445122
1382.8D24445122l511250k520948j288325n82278n10543l47167j461K06411M85242
1401.2D16374803Q57979J434236J890213J786917J531273J410723J367062J573176
1417.5D28226382K389073K717048K347171K147228J846134J355619P06464k56002r43929
1435.9D40535188l07322O76155Q13186N34565K84701M44830P45892N11289N9187N73099
1456.2D44870770K810150L947944L493547L473580M062832M441797N387306Q021743
1472.6D80509669R656310Q499562O546647M658282L091156J410246n66661k446950
1488.9E11358261l497422l876388n058676o468117o279498n778402o354392q813083
1505.2D65232283j1367321r055078p630795q213342p717102n749107l531128k634287
$$ plain form
1382.8 424445122 420933872 418412924 417124599 416542321 416031778 415684611 415683150 415889561 416374803
1401.2 416374803 417232782 418667018 420557231 422344148 423875421 425286144 426653206 428226382
1417.5 428226382 430615455 433332503 435679674 437826902 439673036 441028655 441735119 441479117 440535188
1435.9 440535188 440227866 440904021 441717207 442251772 442536473 442981303 443727195 444238484 444297671 444870770
1456.2 444870770 447680920 451628864 455122411 458595991 462658823 467100620 472487926 480509669
1472.6 480509669 490165979 498665541 505212188 509870470 512961626 514371872 513805211 511358261
1488.9 511358261 507860839 503984451 498925775 492457658 486178160 480399758 474045366 465232283
1505.2 465232283 453864962 444809884 437179089 428965747 421248645 415499538 411968410 409334123
1521.5D09334123k398461k465486k624929k381862k517908k602250j971304j956255
1537.8C90415668k156823n02229J169532J718760J952350K428770L085673L377318
1554.1D01489019L012628L602445N811185N083650L721058L123611K606601K587140
1570.5D31037337K174884J402765J455575J579166Q41051P4387k01047l77297p95543
1588.8D37191278j515329k227128k781570l172814l732861m672825n637139o382525
1605.1D07069087p049620p831395q408785q825898j0085642j1401773r956628r669602
1621.4C33839744j1419922j1371434j0570257j0118992r038746q657604q807898n950928
1637.8B57903963k765387j383454o45458J52260J316011J596600J890063L907770M642665
$$ plain form
1521.5 409334123 406935662 404470176 401845247 399463385 396945477 394343227 392371923 390415668
1537.8 390415668 388258845 387756616 388926148 390644908 392597258 395026028 398111701 401489019
1554.1 401489019 404501647 408104092 413915277 418998927 422719985 425843596 428450197 431037337
1570.5 431037337 433212221 434614986 436070561 437649727 438490778 438565165 438364118 437986821 437191278
1588.8 437191278 435675949 433448821 430667251 427494437 423761576 419088751 413451612 407069087
1605.1 407069087 400019467 392188072 383779287 374953389 364867747 353465974 343509346 333839744
1621.4 333839744 322419822 311048388 300478131 290359139 281320393 272662789 263854891 257903963
1637.8 257903963 255138576 253755122 253109664 253261924 254577935 256174535 258064598 261972368 266615033
1656.1B66615033M265666M779995O056159P217646P058531P585466R041071Q834243
1672.4C21453810R130925J0269135R829521Q984476R778947J3234019J3700158J2377292
1688.8D08758283J3365358J3590425J5493631J7840058J8082708K0147979J7105580
1703E24384022J3510465J2931645J1093080R007573P282496N983829O057263O402373
1719.3E96652746N472124M483521L880024K961516K107501J576662K249003L713190
1735.7F23096287L379643K878130L407597M152417M676283N012989N721748O698429
1752F59023523O507039O141663O138623N612254N435944N319297M718661M243374L798783
1770.3G06939161L851712M220187L804088L267228L029585K688408K230406K019942
$$ plain form
1656.1 266615033 270880699 275660694 281716853 288934499 295993030 303578496 312619567 321453810
1672.4 321453810 330584735 340853870 350683391 359667867 369446814 382680833 396380991 408758283
1688.8 408758283 422123641 435714066 451207697 469047755 487130463 507278442 524384022
1703 524384022 537894487 550826132 561919212 570926785 578209281 584193110 590250373 596652746
1719.3 596652746 602124870 606608391 610488415 613449931 615557432 617134094 619383097 623096287
1735.7 623096287 626475930 629354060 632761657 636914074 641590357 646603346 652325094 659023523
1752 659023523 665530562 671672225 677810848 683423102 688859046 694178343 698897004 703140378 706939161
1770.3 706939161 710790873 715011060 718815148 722082376 725111961 727800369 730030775 732050717
1786.7G32050717J758516J462936J954079K312243J761257J373411J801550K270401
1803G46745110J917779J209319R38654J373231J845121J676858J188934R61840R14276
1821.3G58771122R41872J106680R34720O77585J166463J583278J358032J054526O18994
1839.7G68213272j2636K9623J150549J627326J088619N53548M26352O57678Q44717
1858G74579048P46250M28737P5995j43349K27154J077950J171588N80192L28720N55873
1878.4G79628158P61866O87719L98933J13905J55687O60062Q88705N47529K89797L09408
1898.8G84441769M63605N79834M57704J44243K1339K81989N01752K98560J6987R5606
1919.2G87303388K14040L65973O38246N55933K12014K980L4511K32697L38614P5995
$$ plain form
1786.7 732050717 733809233 735272169 737226248 739538491 741299748 742673159 744474709 746745110
1803 746745110 748662889 749872208 750810862 752184093 754029214 755706072 756895006 757856846 758771122
1821.3 758771122 759712994 760819674 761754394 762431979 763598442 765181720 766539752 767594278 768213272
1839.7 768213272 768200636 768230259 769380808 771008134 772096753 772650301 773076653 773734331 774579048
1858 774579048 775325298 775754035 775830030 775686681 775913835 776991785 778163373 778743565 779072285 779628158
1878.4 779628158 780390024 781077743 781476676 781590581 781746268 782406330 783295035 783842564 784132361 784441769
1898.8 784441769 784905374 785485208 785942912 786087155 786108494 786390483 786892235 787190795 787207782 787303388
1919.2 787303388 787517428 787883401 788521647 789077580 789289594 789292574 789327085 789559782 789898396 789974391
1939.6G89974391k44677n5134L63350M99606L93391J74343N603P4387K82764L88861
1960G91856885K72036j6809j67906Q9466M08173L86596J64568M77J2100J47640K53976
1982.5G93407202J65105o3062j98484j02341J97172L57867J53064r1970r2208N1618
2002.8G93783963J31309M530k00510k72870k22981j72675j42038j73807k93911l09646
2023.2G92131364j71423p5399j68205l46839m22478l13044j53541j32322k22385l04163
2043.6G89821565k54869q1957N6923K4378j12653j78516o9677J12295J42097K1815
2064G89481401p0273k0683J41442K47359J56522k2948r7335J7703J88470K03490O6698
2086.5G90291846m4644Q047J48952K41458K11418Q4579P689Q7142K24113K52366J44482
$$ plain form
1939.6 789974391 789729714 789674580 790037930 790537536 790930927 791105270 791110873 791185260 791468024 791856885
1960 791856885 792128921 792112112 791944206 792033672 792441845 792828441 792993009 792993486 793005586 793153226 793407202
1982.5 793407202 793572307 793509245 793310761 793208420 793405592 793763459 793916523 793824553 793732345 793783963
2002.8 793783963 793915272 793919802 793719292 793446422 793223441 793050766 792908728 792734921 792441010 792131364
2023.2 792131364 791959941 791884542 791716337 791369498 790947020 790633976 790480435 790348113 790125728 789821565
2043.6 789821565 789566696 789484739 789541662 789566040 789453387 789274871 789205194 789317489 789459586 789481401
2064 789481401 789411128 789390445 789531887 789779246 789935768 789912820 789815485 789833188 790021658 790225148 790291846
2086.5 790291846 790247202 790255249 790404201 790645659 790857077 790941656 790949345 791036487 791260600 791512966 791657448
2108.9G91657448J4067O079J12653K07305J69575L9935l6955J2279J37508K10166J45078
2131.3G92675138m530m5419P6711J93834J65522M9532r954O0677K09809K75373J84298
2153.8G93830991P0572Q2016K21848L67463L59595K37763J96337L05891M58241N13196
2174.2G96643913M26769K71678K40684M03583N47647M89354L11375K12371K82586M22656
2194.6H00252616M72606L71039K30252K02775K86222L92377M27365L45171K22266K16782
2215H03419471L53932M33803L19123J59323J59502K79129L31700K36988R5069M8459
2235.4H05836499J21474K23577K39015J65939P3135L2246R8586J90437J74403N6088
2255.8H07211399j4424N1856J56939J77681J03176K4676L2187Q7917J30415J30474
$$ plain form
2108.9 791657448 791671515 791677594 791790247 791997552 792167127 792207062 792170107 792182386 792319894 792530060 792675138
2131.3 792675138 792670608 792625189 792701900 792895734 793061256 793110788 793100834 793161511 793371320 793646693 793830991
2153.8 793830991 793901563 793983579 794205427 794572890 794932485 795170248 795366585 795672476 796130717 796643913
2174.2 796643913 797070682 797342360 797583044 797986627 798534274 799023628 799335003 799547374 799829960 800252616
2194.6 800252616 800725222 801096261 801326513 801529288 801815510 802207887 802635252 802980423 803202689 803419471
2215 803419471 803773403 804207206 804526329 804685652 804845154 805124283 805455983 805692971 805788040 805836499
2235.4 805836499 805957973 806181550 806420565 806586504 806659639 806691885 806790471 806980908 807155311 807211399
2255.8 807211399 807196975 807248831 807405770 807583451 807686627 807711303 807743490 807831407 807961822 808092296
2276.1H08092296P1287K3067K2233M2736K1160n4240j14620j42515j45256j43647j54019
2298.6H07518482j92106k49207k97486l35932l33011k67327k42591l17216m47571n71966
2319H04264069n33820m17471m26709m78566m44889l21209k18213k52128m16875m73320
2339.4H00280869k71082M5776L85523L50118k32041q83818j154542r60588o84559n62907
2359.8G96312749m30107p9751L16680M60505M47929M42088M54008N12779N54085M46916
2380.2G99437881K09927J4067m6432m9174j54138l72886n12839m50670l00825k37882
2400.6G97537029l42250n47409o30140m97401l27170l49701n73217p52449o90401m89593
2421G92337298m13894n64635p65383p94530o51896n19693n42283o85096q09371p71523
$$ plain form
2276.1 808092296 808163583 808186650 808208883 808251619 808272779 808218539 808103919 807961404 807816148 807672501 807518482
2298.6 807518482 807326376 807077169 806779683 806443751 806110740 805843413 805600822 805283606 804836035 804264069
2319 804264069 803730249 803312778 802886069 802407503 801962614 801641405 801423192 801171064 800754189 800280869
2339.4 800280869 800009787 800055563 800441086 800791204 800559163 799675345 798520803 797560215 796875656 796312749
2359.8 796312749 795882642 795802891 796119571 796580076 797028005 797470093 797924101 798436880 798990965 799437881
2380.2 799437881 799647808 799661875 799615443 799566269 799412131 799039245 798526406 798075736 797774911 797537029
2400.6 797537029 797194779 796647370 796017230 795519829 795192659 794842958 794269741 793517292 792826891 792337298
2421 792337298 791923404 791358769 790593386 789798856 789146960 788627267 788084984 787399888 786590517 785818994
2441.3G85818994n89907n00500o22034p91789q12232o66142n00082n17488p09355q33511
2461.7G79275954p66099n99205n01752n86808p62760p88033o25253m77195n20825p24554
2482.1G72923470q44419p29502n04017m20212n69344p45475p32303n42760l80218m23014
2502.5G67032206o13689p62701o88970m57347l88443n46217p02262o96659n51761m38392
2522.9G61185765n06937p13587q53777p64787n52952m89057o51538q41916q44240o95050
2543.3G54271924n74588n79894p11143q13424p40469n96285n52058o54161q01265p98106
2563.7G47450531o20783m71175m99308o70314q12768p97332o52134n20230n58733p19131
2584.1G41128623p82132o77049n29706n08309o53267q11576q02637o52551n75245o64591
$$ plain form
2441.3 785818994 785229087 784728587 784106553 783314764 782502532 781836390 781336308 780818820 780109465 779275954
2461.7 779275954 778509855 777910650 777408898 776822090 776059330 775271297 774646044 774168849 773648024 772923470
2482.1 772923470 772079051 771349549 770845532 770425320 769855976 769110501 768378198 767835438 767455220 767032206
2502.5 767032206 766418517 765655816 764966846 764509499 764121056 763574839 762872577 762175918 761624157 761185765
2522.9 761185765 760678828 759965241 759111464 758346677 757793725 757304668 756653130 755811214 754966974 754271924
2543.3 754271924 753697336 753117442 752406299 751592875 750852406 750256121 749704063 749049902 748248637 747450531
2563.7 747450531 746829748 746358573 745859265 745188951 744376183 743578851 742926717 742406487 741847754 741128623
2584.1 741128623 740346491 739669442 739139736 738631427 737978160 737166584 736363947 735711396 735136151 734471560
2604.5G34471560q36611r60946r19462p71641p65264r37820j085818j139462j078784
2622.9G25975752r51052r71377j183927j329839j248121j075506j029492j197934j390696
2641.2G15597808j365423j157224j013160j083851j272082j358509j249433j098156
2657.5G05999970j067936j158833j274050j248955j062513r61602j065790j210630
2673.9F96949661j219809j084745r37402r00329j026809j190185j175881j000285q80897
2692.2F87533319r61423j163423j272380j188696j045644j041532j212000j363397
2708.5F78284824j333237j200795j129329j192451j314401j344323j234949j089573
2724.8F68445766j038432j113773j196682j167834j055121r72867r99987j085997j124740
$$ plain form
2604.5 734471560 733634949 732674003 731754541 730982900 730217636 729279816 728193998 727054536 725975752
2622.9 725975752 725024700 724053323 722869396 721539557 720291436 719215930 718186438 716988504 715597808
2641.2 715597808 714232385 713075161 712062001 710978150 709706068 708347559 707098126 705999970
2657.5 705999970 704932034 703773201 702499151 701250196 700187683 699226081 698160291 696949661
2673.9 696949661 695729852 694645107 693707705 692807376 691780567 690590382 689414501 688414216 687533319
2692.2 687533319 686571896 685408473 684136093 682947397 681901753 680860221 679648221 678284824
2708.5 678284824 676951587 675750792 674621463 673429012 672114611 670770288 669535339 668445766
2724.8 668445766 667407334 666293561 665096879 663929045 662873924 661901057 660901070 659815073 658690333
2743.2F58690333j060068r44674r03011r69648j069367j075447r60409q82268r25899
2761.6F49899542j025200j088798j057446r73403r91881j125276j217127j244724j228690
2779.9F39946997j203954j265228j400888j507938j499235j430869j456142j605332
2796.2F28577411j756191j797915j755774j728773j806617j952588k017081k000570
2812.5F13761902j991570k022326k141237k317608k399325k355337k365649k509892
2828.9E95658958k714932k922535l119647l349185l650368m133701m872322n653799
2845.2E65242469o179869o276190n840302m897594l714562k694487k199888k390743
2861.5E31048834l055095l802359m357815m518628m187882l519953k794742k157510
$$ plain form
2743.2 658690333 657630265 656685591 655782580 654812932 653743565 652668118 651707709 650825441 649899542
2761.6 649899542 648874342 647785544 646728098 645754695 644762814 643637538 642420411 641175687 639946997
2779.9 639946997 638743043 637477815 636076927 634568989 633069754 631638885 630182743 628577411
2796.2 628577411 626821220 625023305 623267531 621538758 619732141 617779553 615762472 613761902
2812.5 613761902 611770332 609748006 607606769 605289161 602889836 600534499 598168850 595658958
2828.9 595658958 592944026 590021491 586901844 583552659 579902291 575768590 570896268 565242469
2845.2 565242469 559062600 552786410 546946108 542048514 538333952 535639465 533439577 531048834
2861.5 531048834 527993739 524191380 519833565 515314937 511127055 507607102 504812360 502654850
2877.8E02654850j633107j281619j130939j155883j320660j509815j652331j812577
2894.1D91157919j994341k184630k422750k662599k905458l254354l732711m264444
2910.4D67736632m773200n227774n525410n484611n059332m337102l378034k213329
2926.8D31737840r45568K49922J328797K364397L333330M115939M544079M511476M050046
2945.1D55290258L318012K567112J906693J322359R99123J164645J743614K496213
2961.4D70808029L265947L982246M572153N021572N410523N679875N695731N519747
2977.8E09955823N249501M902482M525423M109680L594161L002703K409756J868129
2994.1E39617658J357078P70271J07884m80353q79586j092613j200497j279771j361907
$$ plain form
2877.8 502654850 501021743 499740124 498609185 497453302 496132642 494622827 492970496 491157919
2894.1 491157919 489163578 486978948 484556198 481893599 478988141 475733787 472001076 467736632
2910.4 467736632 462963432 457735658 452210248 446725637 441666305 437329203 433951169 431737840
2926.8 431737840 430792272 431042194 432370991 434735388 438068718 442184657 446728736 451240212 455290258
2945.1 455290258 458608270 461175382 463082075 464404434 465403557 466568202 468311816 470808029
2961.4 470808029 474073976 478056222 482628375 487649947 493060470 498740345 504436076 509955823
2977.8 509955823 515205324 520107806 524633229 528742909 532337070 535339773 537749529 539617658
2994.1 539617658 540974736 541745007 541852891 541372538 540492952 539400339 538199842 536920071 535558164
3012.4E35558164j388013j346529j369774j545429j845956k137482k284408k279997
3028.7E21360576k200365k163827k239883k358020k437770k478480k515674k579510
3045.1E02387047k655655k673179k614647k602280k655387k657949k603233k489418
3061.4D81435299k290607k119034k027154j946300j873076j813978j744271j668751
3077.7D65952128j635432j629055j549393j414954j325727j278370j269907j310468
3094D54538822j337260j325756j343250j401425j437574j451999j499474j565129j567900
3112.4D41609055j593679j712054j782120j801133j841545j905739k001852k058715
3128.7D26912218k033174k026587k094895k147049k144933k182245k241462k251566
$$ plain form
3012.4 535558164 534170151 532823622 531453848 529908419 528062463 525924981 523640573 521360576
3028.7 521360576 519160211 516996384 514756501 512398481 509960711 507482231 504966557 502387047
3045.1 502387047 499731392 497058213 494443566 491841286 489185899 486527950 483924717 481435299
3061.4 481435299 479144692 477025658 474998504 473052204 471179128 469365150 467620879 465952128
3077.7 465952128 464316696 462687641 461138248 459723294 458397567 457119197 455849290 454538822
3094 454538822 453201562 451875806 450532556 449131131 447693557 446241558 444742084 443176955 441609055
3112.4 441609055 440015376 438303322 436521202 434720069 432878524 430972785 428970933 426912218
3128.7 426912218 424879044 422852457 420757562 418610513 416465580 414283335 412041873 409790307
3145D09790307k269268k299875k305895k314657k345443k361208k357721k368063k381265
3163.4C88786912k371311k350629k366006k411544k440036k403229k328903k306103
3179.7C69809151k343089k392888k390623k302855k235711k269149k303332k272308
3196C51299196k203315k107173k015978k001882k043635k041876j967996j880348j850754
3214.3C33186239j879394j903176j889825j874864j883597j920610j949668j925379
3230.7C17959726j891464j939356k071143k177030k203404k175242k146334k154946
3247C01200807k216697k316981k366185k351761k334029k347141k367705k309591k199978
3265.3B80390739k116829k039402j976520j906723j750708j574874j424610j256585
$$ plain form
3145 409790307 407521039 405221164 402915269 400600612 398255169 395893961 393536240 391168177 388786912
3163.4 388786912 386415601 384064972 381698966 379287422 376847386 374444157 372115254 369809151
3179.7 369809151 367466062 365073174 362682551 360379696 358143985 355874836 353571504 351299196
3196 351299196 349095881 346988708 344972730 342970848 340927213 338885337 336917341 335036993 333186239
3214.3 333186239 331306845 329403669 327513844 325638980 323755383 321834773 319885105 317959726
3230.7 317959726 316068262 314128906 312057763 309880733 307677329 305502087 303355753 301200807
3247 301200807 298984110 296667129 294300944 291949183 289615154 287268013 284900308 282590717 280390739
3265.3 280390739 278273910 276234508 274257988 272351265 270600557 269025683 267601073 266344488
3281.6B66344488j150906j115025j024216q75264p45029o50912n88030n34773m52786
3300B59207547l36767k54035k87354l39061k96413k45125k41428k26408j99497k11388
3320.4B56570071k56509k71976k57492k67416k80648k91497k99990l08514l83883m93467
3340.8B53458679n19544m98474n13196n40376n79118o31213o66589o43283n85690n75796
3361.2B47705400n94333n66751n57944o43328p42927p56129o74293n77047n15625n02184
3381.6B41574839m77299m20586l44142k37092k43306l83035m09543k32935p3985j47581
3402B38605335l04967k14517n573M2945K6286N0932P8306J17451J81138K79576M34085
3424.4B39290997N90489O95586O95228P46966Q95291Q48040O59034O60494Q39755R97096
$$ plain form
3281.6 266344488 265193582 264078557 263054341 262179077 261434048 260783136 260195106 259660333 259207547
3300 259207547 258870780 258616745 258329391 257990330 257693917 257448792 257207364 256980956 256781459 256570071
3320.4 256570071 256313562 256041586 255784094 255516678 255236030 254944533 254644543 254336029 253952146 253458679
3340.8 253458679 252939135 252440661 251927465 251387089 250807971 250176758 249510169 248866886 248281196 247705400
3361.2 247705400 247111067 246544316 245986372 245343044 244600117 243843988 243169695 242592648 242077023 241574839
3381.6 241574839 241097540 240676954 240332812 240095720 239852414 239469379 239059836 238826901 238752916 238605335
3402 238605335 238300368 238085851 238080278 238123223 238149509 238200441 238278747 238396198 238577336 238856912 239290997
3424.4 239290997 239881486 240577072 241272300 242019266 242914557 243762597 244421631 245082125 245921880 246918976
3444.8B46918976J102925J143172J177177J247793J314402J406878J472712J434415
3461.1B57218450J482994J681298J799225J683772J447797J441747J637250J828253
3477.4B70220786J910448J824886J791686J917034J982361J970530K022117K085090
3493.8B85724938K137065K126396K087593K094805K046704K005041K128064K299250
3510.1C02649856K423286K445221K323121K288937K373189K456039K458841K420127
3526.4C21838617K513558K704352K798885K837360K874345K850353K897084K975047
3542.7C44289601K971053K940863L017605L142118L227592L314227L389745L466636
3559C69759440L488303L313601L179133L694087M339218M257858M014283M083216M220546
$$ plain form
3444.8 246918976 248021901 249165073 250342250 251590043 252904445 254311323 255784035 257218450
3461.1 257218450 258701444 260382742 262181967 263865739 265313536 266755283 268392533 270220786
3477.4 270220786 272131234 273956120 275747806 277664840 279647201 281617731 283639848 285724938
3493.8 285724938 287862003 289988399 292075992 294170797 296217501 298222542 300350606 302649856
3510.1 302649856 305073142 307518363 309841484 312130421 314503610 316959649 319418490 321838617
3526.4 321838617 324352175 327056527 329855412 332692772 335567117 338417470 341314554 344289601
3542.7 344289601 347260654 350201517 353219122 356361240 359588832 362903059 366292804 369759440
3559 369759440 373247743 376561344 379740477 383434564 387773782 392031640 396045923 400129139 404349685
3577.4D04349685M313051M380316M245937M036456M314184M866898M779697M556835
3593.7D39843059M763215M987032M966288M933685M813433M490465M532099M883617
3610D78212893M966795M940868M791885M803062N384177N501985M795611M018963M345298
3628.4E21761537N731821N807101N184830M881024M707515M621148M411936L806293
3644.7E60913205L203154L769994N237758N292535M415690M365504M608870M152596
3661E95959306L619551L319502K790153K474010L016472K960801K676905L619074M007757
3679.4F24443531L464103K901196K255321J625597J692295K557874K966225K596617
3695.7F44502759K028882J628340J689672K087832J946628J232683Q31426J461446
$$ plain form
3577.4 404349685 408662736 413043052 417288989 421325445 425639629 430506527 435286224 439843059
3593.7 439843059 444606274 449593306 454559594 459493279 464306712 468797177 473329276 478212893
3610 478212893 483179688 488120556 492912441 497715503 503099680 508601665 513397276 517416239 521761537
3628.4 521761537 527493358 533300459 538485289 543366313 548073828 552694976 557106912 560913205
3644.7 560913205 564116359 567886353 573124111 578416646 582832336 587197840 591806710 595959306
3661 595959306 599578857 602898359 605688512 608162522 611178994 614139795 616816700 620435774 624443531
3679.4 624443531 627907634 630808830 633064151 634689748 636382043 638939917 641906142 644502759
3695.7 644502759 646531641 648159981 649849653 651937485 653884113 655116796 655948222 657409668
3712F57409668K417326K312422J621246J156092J029670J052260J168371J268863Q26598
3730.3F70262516J97172L86715J442074K075971J451730J75715j2756J164616R89794
3748.7F78133547M87268J540304K153635J489639R23276J128793J172125P49051N74887
3767.1F88352525O73652J029253J296461R89377N58734M94421P64966Q41617P84397
3785.4F95785403R09984R17852O87301K92957k3246M1187l0696J98305J064121R74238
3805.8G00817406Q34704J286566J005053Q7619l76165n7399K38N59390J420498J158833
3826.2G06736743O81997L86774J71662J24514j75476j90437O31034J199007J250804
3844.6G10816622J000404K73645r24528j605331L17156K166688J536846L10541k66195
$$ plain form
3712 657409668 659826994 662139416 663760662 664916754 665946424 666998684 668167055 669435918 670262516
3730.3 670262516 670459688 670846403 672288477 674364448 675816178 675991893 675979137 677143753 678133547
3748.7 678133547 678620815 680161119 682314754 683804393 684727669 685856462 687028587 687777638 688352525
3767.1 688352525 689026177 690055430 691351891 692341268 692900002 693394423 694159389 695001006 695785403
3785.4 695785403 696695387 697613239 698300540 698593497 698570251 698611438 698580742 698779047 699843168 700817406
3805.8 700817406 701652110 702938676 703943729 704031348 703655183 703597784 703598022 704157412 705577910 706736743
3826.2 706736743 707418740 707805514 707977176 708101690 707926214 707735777 708366811 709565818 710816622
3844.6 710816622 711817026 712090671 711166143 709560812 709877968 712044656 713581502 713892043 713625848
3862.9G13625848J05858L83914k3067J41859P76648R76742P30633O8188K6822L65377
3883.3G17178822K39253M52995M85063J94430M97341N88357j11699o57439m34518K31803
3903.7G18664408J012087J249373P82787L06249j8239k97785j42395L09884L51191
3922.1G22217560J45256K18571K53915J3590N8115M18424M99249K66492j7345o7115
3942.5G24006712J97232K93195J53363J68622K83599K97188K01822R8586J16706K36273
3962.9G26053298K50101J52468J23203J35124J25825J16229R3222P1704J27793K22623
3983.2G27471590K27869J42693Q1003J09792J88052K24412J79648
3997.5G28625059
$$ plain form
3862.9 713625848 713731706 714115620 714092553 714234412 715011060 715987802 716718435 716786623 716813445 717178822
3883.3 717178822 717418075 717871070 718356133 718550563 719047904 719636261 719524562 718867123 718432605 718664408
3903.7 718664408 719676495 720925868 721708655 722014904 721996665 721698880 721556485 721866369 722217560
3922.1 722217560 722362816 722581387 722835302 722848892 722907007 723325431 723824680 724091172 724073827 724006712
3942.5 724006712 724203944 724497139 724650502 724819124 725102723 725399911 725601733 725700319 725817025 726053298
3962.9 726053298 726303399 726455867 726579070 726714194 726840019 726956248 727049470 727121174 727248967 727471590
3983.2 727471590 727699459 727842152 727923155 728032947 728220999 728445411 728625059
3997.5 728625059
##END=$$ End of the data block
