##TITLE=G04-51-CE $$ Begin of the data block
##JCAMP-DX=5.00 $$ ACD/SpecManager v 10.08
##SPECTROMETER/DATA SYSTEM=Alpha
##DATE=22 Oct 2013 10:53:20
##DATA TYPE=INFRARED SPECTRUM
##DATA CLASS=XYDATA
##ORIGIN=
##OWNER=
##NPOINTS=1765
##FIRSTX=399.75695801
##LASTX=3997.56933594
##MAXX=3997.56933594
##MINX=399.75695801
##MAXY=0.80917662
##MINY=0.23746155
##XFACTOR=1.0000000000
##YFACTOR=1.000000000000000e-9
##FIRSTY=0.50730425
##DELTAX=2.03957629
##XUNITS=1/CM
##YUNITS=ARBITRARY UNITS
##XYDATA=(X++(Y..Y))
$$ plain form
399.8 507304251 505110323 501997173 499624997 499506295 500935197 501948059 501145482 498823196 497123450
418.1 497123450 497646749 497869372 496137500 493744791 491798639 490369439 489114970 487692326 486479104
436.5 486479104 486310393 487384468 489272743 490972877 491502225 491277367 491309196 491620600 491254091
454.8 491254091 489382356 486543685 484152347 482549965 480932325 478437990 475314468 472363561
471.1 472363561 470306844 469428331 468835860 467595041 466010362 465124398 465149879 465118319 464013100
489.5 464013100 461823136 459645718 458176136 456913322 454957128 451894492 448433250 445642948
505.8 445642948 443582237 441312015 438281387 434963644 432050079 429992110 428505629 426779926
522.1 426779926 424761295 423416346 423452497 424385041 425442040 426422328 427885473 430400908 433443755
$$ packed form
399.8E07304251k193928l113150k372176j18702J428902J012862q02577k322286j699746
418.1D97123450N23299K22623j731872k392709j946152j429200j254469j422644j213222
436.5D86479104j68711J074075J888275J700134N29348k24858L1829L11404l66509
454.8D91254091j871735k838671k391338j602382j617640k494335l123522k950907
471.1D72363561k056717q78513n92471j240819j584679q85964K5481l1560j105219
489.5D64013100k189964k177418j469582j262814j956194l062636l461242k790302
505.8D45642948k060711k270222l030628l317743k913565k057969j486481j725703
522.1D26779926k018631j344949L6151R32544J056999R80288J463145K515435L042847
$$ plain form
540.5 433443755 435808897 436798513 436660230 436163008 435733199 435188591 434123188 432345986 430215955
558.8 430215955 428287327 426680714 424943388 422542930 419865131 418034434 417615235 418335229 419649661
577.2 419649661 421218872 423268020 426215112 429751575 432894796 434805334 435535163 435945898 436626196
595.6 436626196 437326342 437573642 437288672 436946541 437145740 437898099 438610971 438731074 438498914 438751698
616 438751698 440011650 442008674 444157124 446256638 448556840 451413572 454647005 457462162 459319621
634.3 459319621 460662752 462279052 464341134 466320843 467640907 468220562 468615383 469533771 470775127
652.7 470775127 471534103 471577138 471414834 471643239 472362339 473068446 473367631 473821253 475031257 476709455
673.1 476709455 478724808 480577677 481891632 482941538 484221339 485884815 487468839 488234580 487999171
$$ packed form
540.5D33443755K365142R89616j38283m97222m29809n44608j065403j777202k130031
558.8D30215955j928628j606613j737326k400458k677799j830697m19199P19994J314432
577.2D19649661J569211K049148K947092L536463L143221J910538P29829M10735O80298
595.6D36626196P00146K47300k84970l42131J99199P52359P12872J20103k32160K52784
616D38751698J259952J997024K148450K099514K300202K856732L233433K815157J857459
634.3D59319621J343131J616300K062082J979709J320064N79655L94821R18388J241356
652.7D70775127P58976M3035j62304K28405P19100P06107K99185M53622J210004J678198
673.1D76709455K015353J852869J313955J049906J279801J663476J584024P65741k35409
$$ plain form
691.4 487999171 487312645 486803889 486548185 486299425 486051083 486249954 487495780 489884228 492804110
709.8 492804110 495544314 498078883 501077414 505090714 509951115 514790952 518929064 522707283
726.1 522707283 526796818 531264186 535319328 538031936 539499938 540661991 542141497 543587685
742.4 543587685 544214010 543771744 542918265 542509496 542574644 542167664 540571332 538405418 536878645
760.8 536878645 536618173 537506282 539031029 540977716 543936551 548512101 554264903 559968293 564728320
779.1 564728320 568587720 572249353 576154888 579787076 582362473 583879948 585235655 587450147
795.4 587450147 590729415 594304919 597396255 600002825 602728367 605931580 608974040 610835373
811.7 610835373 611365736 611474633 611981511 612712860 612683237 611202836 608756840 606403828 604649246
$$ packed form
691.4D87999171o86526n08756k55704k48760k48342J98871J245826K388448K919882
709.8D92804110K740204K534569K998531M013300M860401M839837M138112L778219
726.1E22707283M089535M467368M055142K712608J468002J162053J479506J446188
742.4E43587685O26325m42266q53479m08769O5148m06980j596332k165914j526773
760.8E36878645k60472Q88109J524747J946687K958835M575550N752802N703390M760027
779.1E64728320L859400L661633L905535L632188K575397J517475J355707K214492
795.4E87450147L279268L575504L091336K606570K725542L203213L042460J861333
811.7F10835373N30363J08897N06878P31349k9623j480401k445996k353012j754582
$$ plain form
830.1 604649246 603011072 600632250 597354233 594024122 591530740 589844346 588202655 586158097
846.4 586158097 584132671 582841754 582468987 582368314 581756651 580885172 581277907 584351361 589870334
864.8 589870334 596234202 602026045 606991827 611675203 616032958 618862689 619032979 616587400 612595081
883.1 612595081 608244658 603819847 598854482 593229771 587611854 582844794 578937888 574954510
899.4 574954510 570001841 564005256 557545483 551145077 544767797 537948549 530587375 523478925
915.8 523478925 517715275 513749838 511186242 509265780 507538021 506157696 505454481 505276144 504996896
934.1 504996896 504242957 503288627 502530038 501677752 499532372 494792312 487225533 477833480 467817724
952.5 467817724 457645655 447143167 436196446 425120980 414333075 403991640 393964738
$$ packed form
830.1F04649246j638174k378822l278017l330111k493382j686394j641691k044558
846.4E86158097k025426j290917l72767j00673o11663q71479L92735L073454N518973
864.8E89870334O363868N791843M965782M683376M357755K829731J70290k445579l992319
883.1F12595081m350423m424811m965365n624711n617917m767060l906906l983378
899.4E74954510m952669n996585o459773o400406o377280o819248p361174p108450
915.8E23478925n763650l965437k563596j920462j727759j380325p03215j78337k79248
934.1E04996896p53939r54330p58589q52286k145380m740060p566779r392053j0015756
952.5D67817724j0172069j0502488j0946721j1075466j0787905j0341435j0026902
$$ plain form
966.8 393964738 384126455 374710858 366251081 359227091 353731871 349474609 346116185 343531579
983.1 343531579 341762453 340685725 339821577 338703781 337279379 335894406 334958524 334528059 334291220
1001.4 334291220 333889008 333166748 332180828 331016272 329631150 327931404 325966656 323979318 322222590
1019.8 322222590 320677429 319016576 316982388 314696819 312496930 310586393 308796287 306776881
1036.1 306776881 304465026 302168727 300204128 298608750 297198862 295856327 294766545 294295073
1052.4 294295073 294640481 295624524 296876401 298259765 299995482 302213728 304467082 305769235 305400640
1070.8 305400640 303788543 302232623 301856071 302955002 305212259 308234662 311826169 315926969
1087.1 315926969 320385009 324858576 328972161 332555264 335635573 338281810 340470284 342141390
$$ packed form
966.8C93964738r838283r415597q459777p023990n495220m257262l358424k584606
983.1C43531579j769126j076728q64148j117796j424402j384973r35882m30465k36839
1001.4C34291220m02212p22260r85920j164556j385122j699746j964748j987338j756728
1019.8C22222590j545161j660853k034188k285569k199889j910537j790106k019406
1036.1C06776881k311855k296299j964599j595378j409888j342535j089782m71472
1052.4B94295073L45408R84043J251877J383364J735717K218246K253354J302153l68595
1070.8C05400640j612097j555920l76552J098931K257257L022403L591507M100800
1087.1C15926969M458040M473567M113585L583103L080309K646237K188474J671106
$$ plain form
1103.4 342141390 343513012 345055014 347130179 349834293 352937579 356013060 358785331 361298323
1119.7 361298323 363722920 366113424 368439496 370774567 373414844 376530319 379799157 382619530
1136 382619530 384467185 385165513 384981126 384406447 383779913 383113682 382357955 381750345 381712526 382534474
1156.4 382534474 384265065 386758655 389865100 393586725 398003429 403101206 408744663 414796174
1172.7 414796174 421229690 428150386 435597479 443303972 450783134 457628429 463737786 469175875
1189.1 469175875 473817348 477271378 479215771 479799181 479573309 479041547 478396863 477642447 476813197
1207.4 476813197 476124316 475841731 475963354 476144165 475987583 475389391 474500865 473452210 472214460
1225.8 472214460 470652968 468696117 466560423 464655340 463254005 462358505 461793721 461522937 461794585
$$ packed form
1103.4C42141390J371622J542002K075165K704114L103286L075481K772271K512992
1119.7C61298323K424597K390504K326072K335071K640277L115475L268838K820373
1136C82619530J847655O98328j84387n74679o26534o66231p55727o07610l7819Q21948
1156.4C82534474J730591K493590L106445L721625M416704N097777N643457O051511
1172.7D14796174O433516O920696P447093P706493P479162O845295O109357N438089
1189.1D69175875M641473L454030J944393N83410k25872n31762o44684p54416q29250
1207.4D76813197o88881k82585J21623J80811j56582n98192q88526j048655j237750
1225.8D72214460j561492j956851k135694j905083j401335q95500n64784k70784K71648
$$ plain form
1244.1 461794585 462849736 464636505 466842681 469136506 471410751 473746151 476235121 478832185
1260.4 478832185 481309205 483525723 485664696 488012731 490562409 492931098 494694114 495828539
1276.8 495828539 496708602 497739643 499016702 500294983 501341403 502201915 503026068 503702402 503861070
1295.1 503861070 503187597 501759231 500011981 498331010 496695548 494870752 492874891 491041362
1311.4 491041362 489801347 489315361 489362866 489615947 489825428 489809275 489393860 488368064 486575395
1329.8 486575395 484117031 481405705 478948861 477082521 475934088 475240856 474572986 473840952 473146856
1348.1 473146856 472380549 471208930 469458938 467352897 465128541 462642372 459693789 456294715
1364.5 456294715 452473104 448563486 445236295 442341268 439347029 436123848 432499528 428471237
$$ packed form
1244.1D61794585J055151J786769K206176K293825K274245K335400K488970K597064
1260.4D78832185K477020K216518K138973K348035K549678K368689J763016J134425
1276.8D95828539Q80063J031041J277059J278281J046420Q60512Q24153O76334J58668
1295.1E03861070o73473j428366j747250j680971j635462j824796j995861j833529
1311.4D91041362j240015m85986M7505K53081K09481j6153m15415j025796j792669
1329.8D86575395k458364k711326k456844j866340j148433o93232o67870p32034o94096
1348.1D73146856p66307j171619j749992k106041k224356k486169k948583l399074
1364.5D56294715l821611l909618l327191k895027k994239l223181l624320m028291
$$ plain form
1380.8 428471237 424462736 420987368 418449402 417113066 416517138 416025549 415689021 415686309 415918529
1399.1 415918529 416445225 417318583 418750346 420642257 422425419 423938930 425342321 426747739 428382874
1417.5 428382874 430795997 433500707 435838610 437991500 439834982 441160738 441853702 441599071 440630168
1435.9 440630168 440293968 440960765 441771150 442309231 442607105 443053573 443788379 444287986 444324762 444902837
1456.2 444902837 447765201 451733589 455203444 458627075 462637484 467070997 472477257 480478764
1472.6 480478764 490088135 498548329 505050719 509675741 512759805 514176428 513596416 511105955
1488.9 511105955 507558286 503631651 498556703 492114574 485846221 480076283 473752469 464972705
1505.2 464972705 453631282 444594145 436976969 428780526 421083808 415366590 411862940 409223884
$$ packed form
1380.8D28471237m008501l475368k537966j336336n95928m91589l36528k712K32220
1399.1D15918529N26696Q73358J431763J891911J783162J513511J403391J405418J635135
1417.5D28382874K413123K704710K337903K152890J843482J325756O92964k54631r68903
1435.9D40630168l36200O66797Q10385N38081K97874M46468P34806M99607L6776N78075
1456.2D44902837K862364L968388L469855L423631M010409M433513N406260Q001507
1472.6D80478764R609371Q460194O502390M625022L084064J416623n80012k490461
1488.9E11105955l547669l926635n074948o442129o268353n769938o323814q779764
1505.2D64972705j1341423r037137p617176q196443p696718n717218l503650k639056
$$ plain form
1521.5 409223884 406847507 404450446 401869059 399513155 397067606 394547731 392587632 390619576
1537.8 390619576 388507485 388054699 389207125 390902460 392859936 395300239 398397535 401790440
1554.1 401790440 404804200 408394933 414207995 419301718 423037767 426184326 428794444 431331098
1570.5 431331098 433452278 434853941 436304033 437827408 438640952 438722074 438504487 438099116 437281847
1588.8 437281847 435741872 433493495 430700928 427527696 423784703 419102758 413488179 407130778
1605.1 407130778 400077254 392228335 383821964 375028968 364973515 353557944 343561172 333874047
1621.4 333874047 322477698 311138511 300556749 290390998 281327844 272689492 263915122 257973731
1637.8 257973731 255219042 253868729 253258795 253441900 254770815 256350547 258235484 262168825 266830802
$$ packed form
1521.5D09223884k376377k397061k581387k355904k445549k519875j960099j968056
1537.8C90619576k112091m52786J152426J695335J957476K440303L097296L392905
1554.1D01790440L013760L590733N813062N093723L736049L146559K610118K536654
1570.5D31331098K121180J401663J450092J523375Q13544Q1122k17587m05371q17269
1588.8D37281847j539975k248377k792567l173232l742993m681945n614579o357401
1605.1D07130778p053524p848919q406371q792996j0055453j1415571r996772r687125
1621.4C33874047j1396349j1339187j0581762j0165751r063154q638352q774370n941391
1637.8B57973731k754689j350313o09934J83105J328915J579732J884937L933341M661977
$$ plain form
1656.1 266830802 271115780 275926977 282015890 289231598 296271205 303864896 312907457 321713239
1672.4 321713239 330829710 341110468 350941062 359910041 369676769 382903546 396599889 408965141
1688.8 408965141 422311217 435905039 451421440 469262242 487338394 507526696 524684608
1703 524684608 538211107 551138878 562243104 571287274 578610957 584632039 590745509 597175777
1719.3 597175777 602630436 607098937 610967994 613930166 616064727 617689669 619980812 623696566
1735.7 623696566 627058446 629926980 633363903 637556195 642234385 647238314 652955711 659622312
1752 659622312 666095078 672241509 678401291 684014976 689433932 694735885 699454486 703713298 707523108
1770.3 707523108 711386919 715622544 719420552 722675443 725717545 728427470 730653584 732652307
$$ packed form
1656.1B66830802M284978M811197O088913P215708P039607P593691R042561Q805782
1672.4C21713239R116471J0280758R830594Q968979R766728J3226777J3696343J2365252
1688.8D08965141J3346076J3593822J5516401J7840802J8076152K0188302J7157912
1703E24684608J3526499J2927771J1104226R044170P323683O021082O113470O430268
1719.3E97175777N454659M468501L869057K962172K134561J624942K291143L715754
1735.7F23696566L361880K868534L436923M192292M678190N003929N717397O666601
1752F59622312O472766O146431O159782N613685N418956N301953M718601M258812L809810
1770.3G07523108L863811M235625L798008L254891L042102K709925K226114J998723
$$ plain form
1786.7 732652307 734411001 735905290 737882495 740183175 741922796 743294001 745113492 747384191
1803 747384191 749283910 750479400 751409888 752788186 754639208 756308079 757493377 758466482 759399235
1821.3 759399235 760359585 761481881 762421608 763068199 764166296 765711665 767088175 768170059 768808484
1839.7 768808484 768825531 768880427 770018160 771617889 772696793 773252070 773686171 774340868 775167346
1858 775167346 775896311 776311040 776400864 776298583 776542008 777606249 778760314 779320896 779632568 780177474
1878.4 780177474 780930400 781609118 782011926 782148004 782321692 782977223 783853710 784407675 784702063 784994900
1898.8 784994900 785452604 786048293 786522448 786680877 786708117 786974728 787477791 787812889 787838876 787888527
1919.2 787888527 788063645 788422108 789052665 789599836 789807796 789818048 789889812 790151358 790489376 790570259
$$ packed form
1786.7G32652307J758694J494289J977205K300680J739621J371205J819491K270699
1803G47384191J899719J195490R30488J378298J851022J668871J185298R73105R32753
1821.3G59399235R60350J122296R39727O46591J098097J545369J376510J081884O38425
1839.7G68808484J7047N4896J137733J599729J078904N55277M34101O54697Q26478
1858G75167346P28965M14729Q9824j02281K43425J064241J154065N60582L11672N44906
1878.4G80177474P52926O78718M02808J36078J73688O55531Q76487N53965K94388K92837
1898.8G84994900M57704N95689M74155J58429K7240K66611N03063L35098K5987M9651
1919.2G87888527J75118L58463O30557N47171K07960J0252P1764K61546L38018Q0883
$$ plain form
1939.6 790570259 790327668 790260017 790619135 791120291 791512191 791692436 791717768 791801333 792053998 792394936
1960 792394936 792647421 792659104 792546213 792666078 793075562 793468416 793633401 793612242 793603599 793752730 794020176
1982.5 794020176 794184566 794119477 793934524 793832898 794023871 794394851 794551790 794434905 794317365 794366717
2002.8 794366717 794521391 794557035 794362664 794063330 793831468 793709695 793625712 793452799 793120444 792791486
2023.2 792791486 792633116 792561829 792370796 792006075 791598439 791303754 791159511 791047573 790825248 790495455
2043.6 790495455 790228784 790154934 790214300 790220797 790083885 789898217 789852023 789999187 790161908 790191114 790109694
2066.1 790109694 790055037 790172398 790428638 790597439 790582001 790508330 790545642 790733635 790938914 791011691
2086.5 791011691 790957153 790954292 791114390 791364253 791562557 791642487 791656733 791738451 791952729 792197764 792343378
$$ packed form
1939.6G90570259k42591o7651L59118N01156L91900J80245K5332Q3565K52665L40938
1960G92394936K52485J1683j12891J19865M09484L92854J64985k1159q643J49131K67446
1982.5G94020176J64390o5089j84953j01626J90973L70980J56939j16885j17540M9352
2002.8G94366717J54674L5644j94371k99334k31862j21773q3983j72913l32355l28958
2023.2G92791486j58370p1287j91033l64721m07636k94685j44243j11938k22325l29793
2043.6G90495455k66671p3850N9366O497j36912j85668m6194J47164J62721K9206q1420
2066.1G90109694n4657J17361K56240J68801j5438p3671L7312J87993K05279P2777
2086.5G91011691n4538k861J60098K49863J98304P9930J4246Q1718K14278K45035J45614
$$ plain form
2108.9 792343378 792376578 792405665 792522430 792727530 792916358 792970002 792908072 792895973 793054819 793296814
2129.3 793296814 793449342 793451905 793417096 793486893 793670118 793846905 793915510 793899894 793933272 794123173 794408739
2151.7 794408739 794618845 794692814 794767141 794987082 795336246 795674443 795918524 796129405 796445131 796926320
2172.1 796926320 797455907 797877491 798146904 798385680 798769116 799285054 799753189 800071776 800308526 800603032
2192.5 800603032 801039100 801544547 801944673 802177846 802366257 802658558 803068876 803484201 803793252 803996325
2212.9 803996325 804228842 804595649 805009961 805328786 805527449 805691481 805927813 806244016 806512058 806643248
2233.3 806643248 806715429 806839526 807034612 807246745 807403147 807479262 807541370 807673395 807877243 808047354
2253.7 808047354 808097899 808098555 808152735 808294058 808470666 808560431 808556378 808587432 808708847 808879435 809027493
$$ packed form
2108.9G92343378L3200K9087J16765K05100J88828N3644o1930j2099J58846K41995
2129.3G93296814J52528K563l4809O9797J83225J76787O8605j5616L3378J89901K85566
2151.7G94408739K10106P3969P4327K19941L49164L38197K44081K10881L15726M81189
2172.1G96926320N29587M21584K69413K38776L83436N15938M68135L18587K36750K94506
2192.5H00603032M36068N05447M00126K33173J88411K92301M10318M15325L09051K03073
2212.9H03996325K32517L66807M14312L18825J98663J64032K36332L16203K68042J31190
2233.3H06643248P2181J24097J95086K12133J56402P6115O2108J32025K03848J70111
2253.7H08047354N0545O56N4180J41323J76608Q9765m053L1054J21415J70588J48058
$$ plain form
2276.1 809027493 809091628 809094965 809091151 809125841 809176624 809156418 809036851 808871508 808726072 808609903 808506310
2298.6 808506310 808364093 808136106 807850599 807548106 807267010 807040334 806792378 806452632 806041837 805545270
2319 805545270 805061936 804655910 804206908 803731859 803355575 803110480 802877367 802506268 802038074 801618338
2339.4 801618338 801317394 801284730 801652908 801992595 801769912 800967276 799961507 799097717 798338652 797685385
2359.8 797685385 797317803 797302961 797562838 797914982 798243582 798574507 798986673 799522400 800069094 800438166
2380.2 800438166 800582588 800595820 800558150 800478339 800277412 799888551 799387753 798941314 798641860 798408866
2400.6 798408866 798063576 797517478 796892643 796396852 796072602 795720518 795153320 794417143 793720901 793207645
2421 793207645 792782962 792229176 791476727 790671885 790001750 789498687 789006770 788347363 787523031 786745727
$$ packed form
2276.1H09027493O4135L337l814L4690N0783k0206j19567j65343j45436j16169j03593
2298.6H08506310j42217k27987k85507l02493k81096k26676k47956l39746m10795m96567
2319H05545270m83334m06026m49002m75049l76284k45095k33113l71099m68194m19736
2339.4H01618338l00944l2664L68178L39687k22683q02636j005769q63790p59065o53267
2359.8G97685385l67582j4842K59877L52144L28600L30925M12166N35727N46694L69072
2380.2H00438166J44422J3232l7670p9811k00927l88861n00798m46439k99454k32994
2400.6G98408866l45290n46098o24835m95791l24250l52084n67198p36177o96242n13256
2421G93207645m24683n53786p52449q04842o70135n03063m91917o59407q24332p77304
$$ plain form
2441.3 786745727 786156178 785630941 784981072 784176409 783355594 782690465 782189906 781655431 780941010 780121267
2461.7 780121267 779368460 778784633 778303146 777729928 776961207 776144207 775500059 775027454 774512053 773808420
2482.1 773808420 772983491 772240520 771718025 771300793 770735264 769966602 769217730 768685997 768317044 767894328
2502.5 767894328 767277956 766536593 765882254 765425086 765036404 764527619 763845325 763120532 762536228 762092352
2522.9 762092352 761594176 760892034 760057926 759300709 758726597 758215725 757555306 756715536 755891919 755237997
2543.3 755237997 754713595 754148602 753408074 752557755 751794636 751199961 750660360 750019252 749227881 748432577
2563.7 748432577 747814536 747329593 746793211 746093571 745269954 744509220 743939638 743435681 742816389 742074430
2584.1 742074430 741316557 740641415 740076184 739524543 738852620 738072991 737317920 736669004 736070454 735389531
$$ packed form
2441.3G86745727n89549n25237o49869q04663q20815o65129n00559n34475p14421q19743
2461.7G80121267p52807n83827m81487n73218p68721q17000o44148m72605n15401p03633
2482.1G73808420q24929p42971n22495m17232n65529p68662p48872n31733l68953m22716
2502.5G67894328o16372p41363o54339m57168l88682n08785o82294p24793n84304m43876
2522.9G62092352m98176p02142q34108p57217n74112n10872o60419q39770q23617o53922
2543.3G55237997n24402n64993p40528q50319p63119n94675n39601o41108p91371p95304
2563.7G48432577o18041m84943n36382o99640q23617p60734n69582n03957o19292p41959
2584.1G42074430p57873o75142n65231n51641o71923p79629p55071o48916n98550o80923
$$ plain form
2604.5 735389531 734549105 733610332 732725322 731963754 731199384 730268836 729162455 727987349 726902008
2622.9 726902008 725950420 724957764 723769903 722467482 721246421 720169425 719123065 717948139 716611028
2641.2 716611028 715267956 714102268 713080227 711985826 710704803 709328890 708041906 706930876
2657.5 706930876 705895543 704771578 703503430 702227294 701119483 700161994 699158549 697982430
2673.9 697982430 696743906 695636868 694707155 693801582 692741990 691545129 690384030 689391792 688512921
2692.2 688512921 687546492 686379075 685108840 683920205 682887614 681876421 680695236 679342389
2708.5 679342389 677979350 676738024 675593793 674403191 673083007 671723843 670500576 669449627
2724.8 669449627 668411314 667248845 666026354 664868534 663807929 662836969 661866963 660786510 659665048
$$ packed form
2604.5G35389531q40426r38773q85010p61568p64370r30548j106381j175106j085341
2622.9G26902008r51588r92656j187861j302421j221061j076996j046360j174926j337111
2641.2G16611028j343072j165688j022041j094401j281023j375913j286984j111030
2657.5G06930876j035333j123965j268148j276136j107811r57489j003445j176119
2673.9F97982430j238524j107038r29713r05573j059592j196861j161099r92238q78871
2692.2F88512921r66429j167417j270235j188635j032591j011193j181185j352847
2708.5F79342389j363039j241326j144231j190602j320184j359164j223267j050949
2724.8F69449627j038313j162469j222491j157820j060605r70960r70006j080453j121462
$$ plain form
2743.2 659665048 658644438 657728553 656804740 655797422 654721677 653648674 652667224 651771307 650864840
2761.6 650864840 649855077 648746133 647662342 646692693 645736039 644633889 643404424 642138004 640886366
2779.9 640886366 639679670 638443768 637056172 635532260 634023845 632597983 631139159 629531801
2796.2 629531801 627776206 625965834 624222636 622540474 620767236 618826628 616796374 614758968
2812.5 614758968 612745464 610724628 608593404 606299937 603921056 601544261 599120021 596556842
2828.9 596556842 593811393 590861022 587731719 584412813 580782831 576644719 571780384 566132545
2845.2 566132545 559936047 553624034 547746599 542837381 539128959 536417484 534163415 531726599
2861.5 531726599 528661191 524843991 520461142 515951753 511792183 508275568 505457520 503270805
$$ packed form
2743.2F59665048j020610r15885r23813j007318j075745j073003r81450q95917r06467
2761.6F50864840j009763j108944j083791r69649r56654j102150j229465j266420j251638
2779.9F40886366j206696j235902j387596j523912j508415j425862j458824j607358
2796.2F29531801j755595j810372j743198j682162j773238j940608k030254k037406
2812.5F14758968k013504k020836k131224k293467k378881k376795k424240k563179
2828.9E96556842k745449k950371l129303l318906l629982m138112m864335n647839
2845.2E66132545o196498o312013n877435m909218l708422k711475k254069k436816
2861.5E31726599l065408l817200m382849m509389m159570l516615k818048k186715
$$ plain form
2877.8 503270805 501636565 500368297 499216080 498017877 496673793 495177597 493565798 491792977
2894.1 491792977 489815205 487616897 485164523 482477099 479562491 476312339 472610265 468380243
2910.4 468380243 463581204 458298743 452774942 447318792 442228943 437815219 434406251 432247847
2926.8 432247847 431366473 431629866 432937920 435259849 438576669 442716002 447263032 451755553 455813766
2945.1 455813766 459171474 461772501 463712871 465086460 466119349 467273235 468979806 471463889
2961.4 471463889 474751472 478748322 483318478 488343507 493768901 499457449 505175233 510754883
2977.8 510754883 516077042 521030605 525572360 529686689 533299804 536330998 538772881 540652692
2994.1 540652692 541985273 542741537 542881310 542462885 541619062 540508747 539279819 537992120 536665797
$$ packed form
2877.8E03270805j634240j268268j152217j198203j344084j496196j611799j772821
2894.1D91792977j977772k198308k452374k687424k914608l250152l702074m230022
2910.4D68380243m799039n282461n523801n456150n089849m413724l408968k158404
2926.8D32247847q81374K63393J308054K321929L316820M139333M547030M492521M058213
2945.1D55813766L357708K601027J940370J373589J032889J153886J706571K484083
2961.4D71463889L287583L996850M570156N025029N425394N688548N717784N579650
2977.8E10754883N322159M953563M541755M114329L613115L031194K441883J879811
2994.1E40652692J332581P56264J39773m18425q43823j110315j228928j287699j326323
$$ plain form
3012.4 536665797 535344541 534025967 532639325 531086981 529254615 527126968 524856746 522607982
3028.7 522607982 520410180 518183470 515872538 513520539 511151791 508712649 506175399 503572166
3045.1 503572166 500926793 498252362 495592356 492956340 490321875 487697363 485120863 482651740
3061.4 482651740 480334431 478157043 476083428 474105388 472227067 470435202 468700260 467029303
3077.7 467029303 465426803 463842392 462279916 460810870 459450871 458140343 456825316 455489397
3094 455489397 454150379 452841461 451538533 450177401 448743969 447259545 445725739 444154769 442573845
3112.4 442573845 440946907 439237624 437475353 435664266 433775634 431811333 429807246 427793682
3128.7 427793682 425777704 423739314 421621799 419411808 417197138 415011704 412807703 410561830
$$ packed form
3012.4E36665797j321256j318574j386642j552344j832366k127647k270222k248764
3028.7E22607982k197802k226710k310932k351999k368748k439142k537250k603233
3045.1E03572166k645373k674431k660006k636016k634465k624512k576500k469123
3061.4D82651740k317309k177388k073615j978040j878321j791865j734942j670957
3077.7D67029303j602500j584411j562476j469046j359999j310528j315027j335919
3094D55489397j339018j308918j302928j361132j433432j484424j533806j570970j580924
3112.4D42573845j626938j709283j762271j811087j888632j964301k004087k013564
3128.7D27793682k015978k038390k117515k209991k214670k185434k204001k245873
$$ plain form
3145 410561830 408264786 405942768 403638840 401361406 399068236 396712184 394302845 391879827 389479518
3163.4 389479518 387123197 384791613 382429987 380023152 377607316 375210017 372827351 370449185
3179.7 370449185 368067265 365685105 363310039 360964298 358678937 356411457 354112715 351829350
3196 351829350 349633694 347532958 345485985 343449146 341409504 339378268 337398976 335489452 333580732
3214.3 333580732 331664652 329780340 327907473 326028258 324140012 322212577 320224732 318237752
3230.7 318237752 316301584 314350158 312332451 310235173 308049887 305855483 303697258 301504850
3247 301504850 299233258 296914011 294563323 292174906 289797217 287457764 285117388 282805890 280595332
3265.3 280595332 278479367 276456386 274535984 272689879 270943910 269335806 267851353 266495496
$$ packed form
3145D10561830k297044k322018k303928k277434k293170k356052k409339k423018k400309
3163.4C89479518k356321k331584k361626k406835k415836k397299k382666k378166
3179.7C70449185k381920k382160k375066k345741k285361k267480k298742k283365
3196C51829350k195656k100736k046973k036839k039642k031236j979292j909524j908720
3214.3C33580732j916080j884312j872867j879215j888246j927435j987845j986980
3230.7C18237752j936168j951426k017707k097278k185286k194404k158225k192408
3247C01504850k271592k319247k350688k388417k377689k339453k340376k311498k210558
3265.3B80595332k115965k022981j920402j846105j745969j608104j484453j355857
$$ plain form
3281.6 266495496 265272737 264155567 263153315 262312889 261600584 260933608 260316730 259793520 259358346
3300 259358346 258994997 258700490 258423001 258111417 257804215 257545948 257311255 257060140 256801307 256565213
3320.4 256565213 256333530 256095767 255837500 255520970 255202651 254901141 254553258 254168928 253776729 253332973
3340.8 253332973 252809942 252252966 251714200 251209527 250645906 249924242 249138594 248469919 247931451 247398838
3361.2 247398838 246786565 246129036 245496064 244846746 244118080 243367374 242703840 242149353 241654187 241146758
3381.6 241146758 240629256 240175962 239846215 239629984 239375189 238984242 238595158 238389954 238314763 238115773
3402 238115773 237744108 237482980 237461552 237518653 237551659 237577379 237631336 237774089 238000527 238279954 238697410
3424.4 238697410 239270166 239933863 240636572 241413623 242281601 243069947 243712544 244387537 245245516 246267289
$$ packed form
3281.6B66495496j222759j117170j002252q40426p12305o66976o16878n23210m35174
3300B59358346l63349k94507k77489l11584l07202k58267k34693k51115k58833k36094
3320.4B56565213k31683k37763k58267l16530l18319l01510l47883l84330l92199m43756
3340.8B53332973n23031n56976n38766n04673n63621p21664p85648o68675n38468n32613
3361.2B47398838o12273o57529o32972o49318p28666p50706o63534n54487m95166n07429
3381.6B41146758n17502m53294l29747k16231k54795l90947l89084k05204p5191j98990
3402B38115773l71665k61128k1428N7101L3006K5720N3957J42753K26438K79427M17456
3424.4B38697410N72756O63697P02709P77051Q67978P88346O42597O74993Q57979J021773
$$ plain form
3444.8 246267289 247389063 248563528 249763504 250996053 252309620 253743619 255245447 256704330
3461.1 256704330 258211017 259935886 261765838 263431579 264844179 266266525 267900437 269713491
3477.4 269713491 271583676 273383498 275206298 277177632 279209077 281215727 283231884 285296351
3493.8 285296351 287453175 289634317 291741163 293799698 295843929 297883898 300008178 302296966
3510.1 302296966 304729491 307179213 309502661 311784983 314196914 316756248 319283426 321691573
3526.4 321691573 324187309 326900899 329719871 332605332 335529119 338390708 341295421 344320714
3542.7 344320714 347378701 350391865 353413641 356533140 359791547 363160819 366585702 370074034
3559 370074034 373533845 376788169 380002916 383819818 388263077 392588645 396609306 400657088 404864579
$$ packed form
3444.8B46267289J121774J174465J199976J232549J313567J433999J501828J458883
3461.1B56704330J506687J724869J829952J665741J412600J422346J633912J813054
3477.4B69713491J870185J799822J822800J971334K031445K006650K016157K064467
3493.8B85296351K156824K181142K106846K058535K044231K039969K124280K288788
3510.1C02296966K432525K449722K323448K282322K411931K559334K527178K408147
3526.4C21691573K495736K713590K818972K885461K923787K861589K904713L025293
3542.7C44320714L057987L013164L021776L119499L258407L369272L424883L488332
3559C70074034L459811L254324L214747L816902M443259M325568M020661M047782M207491
$$ plain form
3577.4 404864579 409212410 413692623 418067276 422173530 426501036 431416363 436244309 440794945
3593.7 440794945 445575505 450630426 455659091 460635483 465469211 469978034 474580556 479567051
3610 479567051 484601259 489569247 494346857 499131382 504587412 510200262 515062094 519164681 523602724
3628.4 523602724 529287755 534981549 540165603 545113623 549836159 554458380 558909416 562771678
3644.7 562771678 566007733 569725037 574898481 580218852 584687650 589072406 593666255 597806633
3661 597806633 601456702 604823470 607612967 610049665 613066435 616060495 618733704 622297049 626276016
3679.4 626276016 629751205 632652760 634918749 636611938 638372838 640915871 643835604 646413803
3695.7 646413803 648444533 650081217 651753485 653783798 655688882 656923652 657777429 659280002
$$ packed form
3577.4D04864579M347831M480213M374653M106254M327506M915327M827946M550636
3593.7D40794945M780560N054921N028665M976392M833728M508823M602522M986495
3610D79567051N034208M967988M777610M784525N456030N612850M861832M102587M438043
3628.4E23602724N685031N693794N184054M948020M722536M622221M451036L862262
3644.7E62771678L236055L717304N173444N320371M468798M384756M593849M140378
3661E97806633L650069L366768K789497K436698L016770K994060K673209L563345L978967
3679.4F26276016L475189K901555K265989J693189J760900K543033K919733K578199
3695.7F46413803K030730J636684J672268K030313J905084J234770Q53777J502573
$$ plain form
3712 659280002 661760330 664111435 665722907 666851640 667858481 668920219 670143127 671426833 672206044
3730.3 672206044 672417521 672893286 674319744 676310241 677727759 677888215 677862942 679009438 679981947
3748.7 679981947 680464208 681972027 684096754 685589373 686517060 687624872 688770711 689520419 690115571
3767.1 690115571 690838695 691926420 693240345 694235444 694811165 695327401 696110010 696922243 697640419
3785.4 697640419 698529243 699492931 700227678 700490832 700407088 700450182 700404346 700526774 701592207 702663720
3805.8 702663720 703560054 704833388 705804348 705825925 705385327 705329895 705375969 706010163 707461357 708571672
3826.2 708571672 709216475 709602177 709761202 709876299 709701657 709504426 710160494 711415112 712662935
3844.6 712662935 713626385 713939905 713116944 711520016 711692929 713769495 715319455 715674996 715436757
$$ packed form
3712F59280002K480328K351105J611472J128733J006841J061738J222908J283706P79211
3730.3F72206044K11477M75765J426458J990497J417518J60456k5273J146496R72509
3748.7F79981947M82261J507819K124727J492619R27687J107812J145839P49708N95152
3767.1F90115571P23124J087725J313925R95099N75721N16236P82609Q12233P18176
3785.4F97640419Q88824R63688P34747K63154q3744M3094m5836J22428J065433J071513
3805.8G02663720Q96334J273334R70960K1577m40598n5432M6074O34194J451194J110315
3826.2G08571672O44803L85702J59025J15097j74642j97231O56068J254618J247823
3844.6G12662935R63450L13520q22961j596928J72913K076566J549960L55541k38239
$$ plain form
3862.9 715436757 715536296 715902627 715903699 716125607 716955662 717914045 718603373 718652487 718674779 719059169
3883.3 719059169 719321072 719734848 720127404 720265687 720796764 721413195 721287072 720627308 720222890 720533550
3903.7 720533550 721582890 722765207 723490715 723812401 723831415 723523438 723316252 723589003 723962843
3922.1 723962843 724164188 724448085 724741459 724765003 724803746 725150943 725547731 725756705 725773036 725764513
3942.5 725764513 725964189 726213932 726340353 726555347 726872623 727079213 727178752 727316916 727517843 727735877
3962.9 727735877 727954268 728142321 728293777 728397727 728489399 728630185 728768706 728849053 728941202 729105115
3983.2 729105115 729292631 729462922 729608774 729771197 729976475 730157912 730265856
3997.5 730265856
$$ packed form
3862.9G15436757R9539L66331J072K21908Q30055R58383O89328M9114K2292L84390
3883.3G19059169K61903M13776L92556J38283N31077O16431j26123o59764m04418L10660
3903.7G20533550J049340J182317P25508L21686J9014l07977k07186K72751L73840
3922.1G23962843K01345K83897K93374K3544L8743L47197L96788K08974J6331q523
3942.5G25764513J99676K49743J26421K14994L17276K06590R9539J38164K00927K18034
3962.9G27735877K18391J88053J51456J03950R1672J40786J38521Q0347R2149J63913
3983.2G29105115J87516J70291J45852J62423K05278J81437J07944
3997.5G30265856
##END=$$ End of the data block
