##TITLE=G04-51-CE $$ Begin of the data block
##JCAMP-DX=5.00 $$ ACD/SpecManager v 10.08
##SPECTROMETER/DATA SYSTEM=Alpha
##DATE=22 Oct 2013 10:53:20
##DATA TYPE=INFRARED SPECTRUM
##DATA CLASS=XYDATA
##ORIGIN=
##OWNER=
##NPOINTS=1765
##FIRSTX=399.75695801
##LASTX=3997.56933594
##MAXX=3997.56933594
##MINX=399.75695801
##MAXY=0.80999523
##MINY=0.23732464
##XFACTOR=1.0000000000
##YFACTOR=1.000000000000000e-9
##FIRSTY=0.51020390
##DELTAX=2.03957629
##XUNITS=1/CM
##YUNITS=ARBITRARY UNITS
##XYDATA=(X++(Y..Y))
399.8E10203898j796782k635658k558887q42690P64429N67794o64830j445353j428187
418.1E00163734n83649l16024j393109k197892j932114j457363j228959j272440j354545
436.5D88427639o59078R11086K255142K065212N94973l62873j67995J92224l40521
454.8D92915809j795709k772421k385318j781613j770526k401501l058821l052264
471.1D73897636k203167j115202p99180j205056j434833p90954O3092r2239j152843
489.5D65167254k064317k007813j398533j412004k248347l093004l222317k661168
505.8D47059751k080977k293021l138900l461629k966940k171487j691520j833379
522.1D27421898j845718j065314j9759O18548Q96155R98885J381576K373338L151536
$$ plain form
399.8 510203898 508407116 505771458 503212571 502369881 503134310 503702104 503037274 501591921 500163734
418.1 500163734 499580085 499264061 497870952 495673060 493740946 492283583 491054624 489782184 488427639
436.5 488427639 487768561 488679647 490934789 493000001 493594974 493232101 493064106 493256330 492915809
454.8 492915809 491120100 488347679 485962361 484180748 482410222 480008721 476949900 473897636
471.1 473897636 471694469 470579267 469780087 468575031 467140198 466349244 466412336 466320097 465167254
489.5 465167254 463102937 461095124 459696591 458284587 456036240 452943236 449720919 447059751
505.8 447059751 444978774 442685753 439546853 436085224 433118284 430946797 429255277 427421898
522.1 427421898 425576180 424510866 424491107 425109655 426005810 427004695 428386271 430759609 433911145
540.5D33911145K623558J038313k55376n23121k69234l20941j020908j947850k260834
558.8D30974752j834661j530379j878113k557754k763003j881212l37810Q54910J274645
577.2D20321375J466334K123058L079414L473520K970309J854151P56353M15713P18862
595.6D37179089Q28206K96563l88086l84658K83301Q26209O94067O6191k27571K97993
616D39471304J308680J993835K030462K030224K434373L038018L262043K751589J889318
634.3D60209846J434714J609892J964420J917779J312405O12736M79758Q95887J090348
652.7D71527785O22839j4305r8318L62187Q73566Q89063M50879L82632J053512J634479
673.1D77684319K050757J931757J309395R89169J351774J743137J492411O36995k79933
$$ plain form
540.5 433911145 436534703 437573016 437317640 436794519 436525285 436204344 435183436 433235586 430974752
558.8 430974752 429140091 427609712 425731599 423173845 420410842 418529630 418191820 419046730 420321375
577.2 420321375 421787709 423910767 426990181 430463701 433434010 435288161 436044514 436460227 437179089
595.6 437179089 438007295 438303858 437915772 437531114 437814415 438640624 439334691 439400882 439173311 439471304
616 439471304 440779984 442773819 444804281 446834505 449268878 452306896 455568939 458320528 460209846
634.3 460209846 461644560 463254452 465218872 467136651 468449056 469061792 469541550 470437437 471527785
652.7 471527785 472150624 472136319 472038001 472400188 473273754 474162817 474613696 474996328 476049840 477684319
673.1 477684319 479735076 481666833 482976228 483965397 485317171 487060308 488552719 489189714 488909781
691.4D88909781p03126n08219k57194l01421k75880K02179J211941K395541K976209
709.8D93649811K727121K452224K914757L965139M857183M869282M188180L846347
726.1E23470044M177451M516721M041195K731979J572072J249075J450777J358986
742.4E44568300N55873m37260p68780m35472j70529o01351j558006k064526j479387
760.8E37608862j89424R55522J525283J906216K915442M567266N835354N841792M826188
779.1E65792501L813148L548920L824055L634512K558887J433492J318157K330601
795.4E88254273L446281L595889L019392K611160K787292L242433L047824J865208
811.7F11869752N57721Q6367M16696O88255L1829j376450k423644k450884j881361
$$ plain form
691.4 488909781 488206655 487698436 487441242 487139821 486863941 487066120 488278061 490673602 493649811
709.8 493649811 496376932 498829156 501743913 505709052 510566235 515435517 519623697 523470044
726.1 523470044 527647495 532164216 536205411 538937390 540509462 541758537 543209314 544568300
742.4 544568300 545124173 544686913 543918133 543482661 543312132 542710781 541152775 539088249 537608862
760.8 537608862 537419438 538374960 539900243 541806459 544721901 549289167 555124521 560966313 565792501
779.1 565792501 569605649 573154569 576978624 580613136 583172023 584605515 585923672 588254273
795.4 588254273 591700554 595296443 598315835 600926995 603714287 606956720 610004544 611869752
811.7 611869752 612427473 612513840 612930536 613618791 613650620 612274170 609850526 607399642 605518281
830.1F05518281j707017k364337l234446l365040k584815j726210j612604j974642
846.4E86949170k022505j402021m19616k7120n62966q61287L80873L021956N550027
864.8E90606511O477356N821943M919767M619062M236043K704858J23859k426088l935039
883.1F13148272m308462m426003m969060n628705n692303m927099m010200l916920
899.4E75269520m818320n935609o445945o400406o461143o927073p363260p043898
915.8E23873866n713225l946781k575457j949430j788735j448631p01189j29640k70248
934.1E05350530q08537j026273p81893p94053k051563m727303p637918r409518r981215
952.5D68132257j0173201j0493845j0921925j1103064j0831565j0352850j0000228
$$ plain form
830.1 605518281 603811264 601446927 598212481 594847441 592262626 590536416 588923812 586949170
846.4 586949170 584926665 583524644 583105028 583077908 582514942 581653655 582034528 585056484 590606511
864.8 590606511 597083867 602905810 607825577 612444639 616680682 619385540 619509399 617083311 613148272
883.1 613148272 608839810 604413807 599444747 593816042 588123739 583196640 579186440 575269520
899.4 575269520 570451200 564515591 558069646 551669240 545208097 538281024 530917764 523873866
915.8 523873866 518160641 514213860 511638403 509688973 507900238 506451607 505750418 505620778 505350530
934.1 505350530 504541993 503515720 502733827 501939774 499888211 495160908 487522990 478113472 468132257
952.5 468132257 457959056 447465211 436543286 425440222 414608657 404255807 394255579
966.8C94255579r800882r418994q495211p072747n518347m209966l306389k584785
983.1C43848258j792371j095802q64416j109898j413912j381844r75460m74304k30908
1001.4C34509343l59386o79225r69529j174897j409710j714438j972765j989692j717120
1019.8C22522581j489610j641542k044320k304047k231032j963824j828849j998544
1036.1C07020813k254545k250076j933366j583546j449764j392484j073241m18812
1052.4B94664979L58760R38148J216620J419246J794577K258241K260327J282215l76463
1070.8C05816650j612514j569986m12315J064807K263069L052503L607929M085391
1087.1C16295534M410953M430055M118741L618657L111274K657681K171457J664370
$$ plain form
966.8 394255579 384454697 375035703 366540492 359467745 353949398 349739432 346433043 343848258
983.1 343848258 342055887 340960085 340095669 338985771 337571859 336190015 335214555 334740251 334509343
1001.4 334509343 334149957 333470732 332501203 331326306 329916596 328202158 326229393 324239701 322522581
1019.8 322522581 321032971 319391429 317347109 315043062 312812030 310848206 309019357 307020813
1036.1 307020813 304766268 302516192 300582826 298999280 297549516 296157032 295083791 294664979
1052.4 294664979 295023739 295961887 297178507 298597753 300392330 302650571 304910898 306193113 305816650
1070.8 305816650 304204136 302634150 302221835 303286642 305549711 308602214 312210143 316295534
1087.1 316295534 320706487 325136542 329255283 332873940 335985214 338642895 340814352 342478722
1103.4C42478722J376480J533747K083033K721012L118038L107905K807260K531171
1119.7C61757368K421647K356678K265871K303302K681107L190130L317952K835512
1136C83129567J835167O51002k23368n85348o37412o44892p12425o09219n9098Q24869
1156.4C82968843J711845K439231L085733L760218M464299N106926N604505N999506
1172.7D15141106O427705O930590P412195P670343P490366O880254O130546N436749
1189.1D69519854M618942L417433J912623N73039k21371n39601o68585p69765q18580
1207.4D77023989o64204k66970J06782J43170j61618n60790q58962j040668j234740
1225.8D72485989j554608j931608k095014j871913j394958r31501o06954k79039K80410
$$ plain form
1103.4 342478722 343855202 345388949 347471982 350192994 353311032 356418937 359226197 361757368
1119.7 361757368 364179015 366535693 368801564 371104866 373785973 376976103 380294055 383129567
1136 383129567 384964734 385615736 385392368 384807020 384169608 383524716 382812291 382203072 382143974 382968843
1156.4 382968843 384680688 387119919 390205652 393965870 398430169 403537095 409141600 415141106
1172.7 415141106 421568811 428499401 435911596 443581939 451072305 457952559 464083105 469519854
1189.1 469519854 474138796 477556229 479468852 480041891 479820520 479280919 478612334 477842569 477023989
1207.4 477023989 476359785 476092815 476199597 476342767 476181149 475620359 474761397 473720729 472485989
1225.8 472485989 470931381 468999773 466904759 465032846 463637888 462706387 462099433 461820394 462100804
1244.1D62100804J067728J798451K220779K301693K253860K321125K505511K617091
1260.4D79187042K481102K202183K115161K325594K535463K365708J755595J119047
1276.8D96086895Q88348J077980J316845J268834J031637Q73566Q28087O80149J92463
1295.1E04244804o49154j449287j782536j690418j612216j799464j999408j832456
1311.4D91429865j209706m76479K2083K43724K43663K0862m17322j059145j846849
1329.8D86950696k509296k728731k436638j819938j123011p21544p06822p32601o66648
1348.1D73505467p60019j199215j776606k116710k216190k452940k931237l416777
1364.5D56635773l828376l902883l334284k902120k990752l235758l648817m032701
$$ plain form
1244.1 462100804 463168532 464966983 467187762 469489455 471743315 474064440 476569951 479187042
1260.4 479187042 481668144 483870327 485985488 488311082 490846545 493212253 494967848 496086895
1276.8 496086895 496975243 498053223 499370068 500638902 501670539 502544105 503372192 504052341 504244804
1295.1 504244804 503595650 502146363 500363827 498673409 497061193 495261729 493262321 491429865
1311.4 491429865 490220159 489743680 489765763 490009487 490253150 490274012 489856690 488797545 486950696
1329.8 486950696 484441400 481712669 479276031 477456093 476333082 475611538 474904716 474172115 473505467
1348.1 473505467 472745448 471546233 469769627 467652917 465436727 462983787 460052550 456635773
1364.5 456635773 452807397 448904514 445570230 442668110 439677358 436441600 432792783 428760082
1380.8D28760082m003972l478617k527147j304269n67168m71592l36200k8938K19613
1399.1D16261792N45949Q99494J424312J856745J777291J541108J428187J411795J637340
1417.5D28784013K402574K666622K302766K130300J835823J334429O99192k13176q85755
1435.9D41056788l31968N97864P67350N24462L04132M71503P36296M81934P7277O46204
1456.2D45331842K817511L886313L470331L462315L991782M384458N419582Q058697
1472.6D80822831R599924Q393229O440728M576922L051460J405239n76616k493500
1488.9E11220217l572524l944516n073011o436437o277263n788088o297380q684874
1505.2D65146124j1278122r078890p663817q196681p649660n651921l449411k598524
$$ plain form
1380.8 428760082 424756110 421277493 418750346 417446077 416878909 416407317 416071117 416042179 416261792
1399.1 416261792 416807741 417707235 419131547 420988292 422765583 424306691 425734878 427146673 428784013
1417.5 428784013 431186587 433853209 436155975 438286275 440122098 441456527 442155719 441942543 441056788
1435.9 441056788 440724820 441322684 442090034 442614496 442918628 443390131 444126427 444608361 444685638 445331842
1456.2 445331842 448149353 452035666 455505997 458968312 462960094 467344552 472764134 480822831
1472.6 480822831 490422755 498815984 505256712 509833634 512885094 514290333 513713717 511220217
1488.9 511220217 507647693 503703177 498630166 492193729 485916466 480128378 473830998 465146124
1505.2 465146124 453868002 444789112 437125295 428928614 421278954 415627033 412177622 409579098
1521.5D09579098k363473k406269k588570k344638k405376k453834j898050j923680
1537.8C91195208k099008m67538J153677J695574J968056K473801L107727L373950
1554.1D02401447L015548L622055N791992N041898L709793L125786K597183K549947
1570.5D31855649K140224J406252J430214J473754P40171L3647j96845l72737q20250
1588.8D37690079j570850k290845k802790l147244l726572m692852n643636o366909
1605.1D07448381p028818p824451q405476q814395j0067314j1392712r972632r682328
1621.4C34260255j1424571j1388630j0590196j0135263r039998q635342q795857n962015
1637.8B58288383k755403j345187n90176K27690J381010J648277J966446L931553M600256
$$ plain form
1521.5 409579098 407215625 404809356 402220786 399876148 397470772 395016938 393118888 391195208
1537.8 391195208 389096200 388628662 389782339 391477913 393445969 395919770 399027497 402401447
1554.1 402401447 405416995 409039050 414831042 419872940 423582733 426708519 429305702 431855649
1570.5 431855649 433995873 435402125 436832339 438306093 439046264 439079911 438883066 438510329 437690079
1588.8 437690079 436119229 433828384 431025594 427878350 424151778 419458926 413815290 407448381
1605.1 407448381 400419563 392595112 384189636 375375241 365307927 353915215 343942583 334260255
1621.4 334260255 322835684 311447054 300856858 290721595 281681597 273046255 264250398 258288383
1637.8 258288383 255532980 254187793 253597617 253825307 255206317 256854594 258821040 262752593 267352849
1656.1B67352849M257709M812181O098956P233798P062942P615894R062678Q807033
1672.4C22304040R083957J0236919R816765Q996874R829849J3265461J3662786J2310683
1688.8D09507334J3286919J3561129J5549630J7908037J8116981K0149201J7076790
1703E25156021J3509214J2955308J1128783R078622P356048O051004O159842O457269
1719.3E97852111N460083M460335L837526K945900K161920J692176K367020L710091
1735.7F24487162L319919K869904L460884M225552M728913N042196N713939O637216
1752F60485685O457686O146074O139755N581736N394757N273819M723489M294634L802002
1770.3G08299637L831267M233420L812313L273845L041923K689779K232790K039551
$$ plain form
1656.1 267352849 271610558 276422739 282521695 289755493 296818435 304434329 313497007 322304040
1672.4 322304040 331387997 341624916 351441681 360438555 370268404 383533865 397196651 409507334
1688.8 409507334 422794253 436355382 451905012 469813049 487930030 508079231 525156021
1703 525156021 538665235 551620543 562749326 571827948 579183996 585235000 591394842 597852111
1719.3 597852111 603312194 607772529 611610055 614555955 616717875 618410051 620777071 624487162
1735.7 624487162 627807081 630676985 634137869 638363421 643092334 648134530 653848469 660485685
1752 660485685 666943371 673089445 679229200 684810936 690205693 695479512 700203001 704497635 708299637
1770.3 708299637 712130904 716364324 720176637 723450482 726492405 729182184 731414974 733454525
1786.7G33454525J791537J500666J977444K301455J728356J350343J788556K233267
1803G48126149J875937J202822R58085J386940J829863J647115J176178R80020R53793
1821.3G60136902R79901J133322R38476O45816J113415J546919J349270J058936O19293
1839.7G69522250N185J01328J194239J581609J032829N51641M58658O74486Q50380
1858G75972605P52210M27008Q2493j18733K47956J043081J103997N55575L29614N50508
1878.4G80946314P68423O91593L89218J10448J52469O40988Q79049N67198L12269L22938
1898.8G85780907M60505N61297M54426J48535J4543K77579N05447L17514L3915P6652
1919.2G88631320J85907L57151O48141N61774J95622R656O7413K28882L06487O2763
$$ plain form
1786.7 733454525 735246062 736746728 738724172 741025627 742753983 744104326 745892882 748126149
1803 748126149 750002086 751204908 752162993 753549933 755379796 757026911 758203089 759183109 760136902
1821.3 760136902 761116803 762250125 763188601 763834417 764947832 766494751 767844021 768902957 769522250
1839.7 769522250 769527435 769628763 770823002 772404611 773437440 773989081 774447739 775122225 775972605
1858 775972605 776724815 777151823 777234316 777115583 777363539 778406620 779510617 780066192 780395806 780946314
1878.4 780946314 781714737 782406330 782795548 782905996 783058465 783699453 784578502 785145700 785457969 785780907
1898.8 785780907 786241412 786802709 787257135 787405670 787420213 787697792 788203239 788520753 788554668 788631320
1919.2 788631320 788817227 789174378 789822519 790384293 790579915 790589571 790656984 790885866 791192353 791255116
1939.6G91255116k32696l7909L80457N10216L74496J47044J5617J07109K94447L56078
1960G93169975K17974j1384r1612J43230M03404L78132J61409k2769j4305J45912K73287
1982.5G94753253J60933q5950j92702p6353K12490L56794J42991j00493r0659N8592
2002.8G95138896J43766J2994k19643k99752k07544j22547j09672j72973l21269l43382
2023.2G93498874j60873k9743j58369l84152m59254l26395j25826q3327k16126l31343
2043.6G91223466k65836p7486N7459K2411j09851j80841o9201J34766J62065K0504
2064G90917456o6280n96J51872K34723J16289o4909q8930N4478J97888J98900R3520
2086.5G91744411j4722N602J47224K35200J90377R3818L7312R3341K12789K30193J21236
$$ plain form
1939.6 791255116 791022420 790984511 791364968 791875184 792249680 792396724 792412341 792519450 792813897 793169975
1960 793169975 793387949 793376565 793284953 793428183 793831587 794209719 794371128 794348359 794334054 794479966 794753253
1982.5 794753253 794914186 794828236 794635534 794559181 794771671 795128465 795271456 795170963 795080304 795138896
2002.8 795138896 795282662 795295656 795076013 794776261 794568717 794446170 794336498 794163525 793842256 793498874
2023.2 793498874 793338001 793308258 793149889 792765737 792306483 791980088 791854262 791770935 791554809 791223466
2043.6 791223466 790957630 790880144 790937603 790960014 790850163 790669322 790600121 790734887 790896952 790917456
2064 790917456 790851176 790850580 791002452 791237175 791353464 791288555 791199625 791254103 791451991 791650891 791744411
2086.5 791744411 791729689 791735291 791882515 792117715 792308092 792401910 792439222 792532563 792745352 792975545 793096781
2108.9G93096781J9371M0889J44541K11358J64152L6895n8174j371J69039K44259J36435
2131.3G94204175j4543j9848J06155K11537J78874M7386l2723K9146J77205K58088
2151.7G95145452K03609J04189J01448K31266L69787L59475K30134J73509L04580M90904
2172.1G97714353N32865M19617K59220K38777M12464N58853N01394L14295J98842K64346
2192.5H01415026M20332M94421L90350K21491J92404L17097M29451L91901K70247K19822
2212.9H04762542K75791L70264M08292L19183J71005J50383K68996L47018K74420J21295
2233.3H07469189M1962R2208K02179K50757J84536P9036N3703J24515J89125J71185
2253.7H08858395Q3148L100K1755J27495J75952R7573K5213N1916J09553J47402J20700
$$ plain form
2108.9 793096781 793116152 793157041 793301582 793512940 793677092 793713987 793655813 793654442 793823481 794067740 794204175
2131.3 794204175 794189632 794169784 794275939 794487476 794666350 794713736 794681013 794710159 794887364 795145452
2151.7 795145452 795349061 795453250 795554698 795785964 796155751 796515226 796745360 796918869 797223449 797714353
2172.1 797714353 798247218 798666835 798926055 799164832 799577296 800136149 800637543 800951838 801150680 801415026
2192.5 801415026 801835358 802329779 802720129 802941620 803134024 803451121 803880572 804272473 804542720 804762542
2212.9 804762542 805038333 805408597 805816889 806136072 806307077 806457460 806726456 807073474 807347894 807469189
2233.3 807469189 807511151 807603359 807805538 808056295 808240831 808319867 808373570 808498085 808687210 808858395
2253.7 808858395 808941543 808944643 808966398 809093893 809269845 809367418 809392631 809444547 809554100 809701502 809822202
2276.1H09822202K3901k3722J2040P8797Q2016l2067j55270j66655r2268o1095r9361
2298.6H09388518j62065k24352k66373k89499k69950k19703k29120k97606l77238m36723
2319H06615889m14073m18246m84765m19914k49863k24471l27409l98397m26054l80337
2339.4H02872360k55406k206L26634K55167k87830q17299r68755p90357o48201n99920
2359.8G99084187l93987N4002L62932L07083K15650K55883L47912M40359M47214L09288
2380.2H01430523Q9288o9976j18732j03772j57952l40879m76599m46260l30448k58565
2400.6G99216628l60608n67853o20604m61280l03984l71516o04272p35938o58572m90487
2421G94041514m22239n59688p72178q08656o31630m80295n28335o91652q15511p78973
$$ plain form
2276.1 809822202 809846103 809822381 809834421 809913218 809995234 809963167 809807897 809641242 809548974 809487879 809388518
2298.6 809388518 809226453 809002101 808735728 808446229 808176279 807956576 807727456 807429850 807052612 806615889
2319 806615889 806201816 805783570 805298805 804878891 804629028 804404557 804077148 803678751 803252697 802872360
2339.4 802872360 802616954 802614748 802941382 803196549 802908719 802091420 801122665 800332308 799684107 799084187
2359.8 799084187 798690200 798744202 799107134 799414217 799629867 799885750 800233662 800674021 801121235 801430523
2380.2 801430523 801519811 801449835 801331103 801227331 801069379 800728500 800251901 799805641 799475193 799216628
2400.6 799216628 798856020 798288167 797667563 797206283 796902299 796530783 795926511 795190573 794532001 794041514
2421 794041514 793619275 793059587 792287409 791478753 790847123 790366828 789838493 789146841 788331330 787552357
2441.3G87552357o07789n26070o48797q09014q06689o39200m81904n26488p28070q45015
2461.7G80933321p50125n57005m76778o02007p82251p89344o25790m86135n36442p16448
2482.1G74610996q10265p09355m95315m11391n73397p60197p28667n23031l89516m77135
2502.5G68732727o58930p41124o43492m38094l67284n26845p17402p31229n60701m16994
2522.9G62930632m90785o93738q12591p55667n96047n24044o52134q33035q43107o81281
2543.3G56048203n36979n61535p23302q22306p33853n87880n63383o80268q06332p65443
2563.7G49266922n99801n10216n62072o95526p88093p36356n93960n20348n97895p46488
2584.1G42916167p93278o66202n15937n26786o88195q15869p73549o40511n90384o79076
$$ plain form
2441.3 787552357 786944568 786418498 785769701 784960687 784153998 783514798 783032894 782506406 781778336 780933321
2461.7 780933321 780183196 779626191 779149413 778547406 777765155 776975811 776350021 775863886 775327444 774610996
2482.1 774610996 773800731 773091376 772596061 772184670 771611273 770851076 770122409 769599378 769209862 768732727
2502.5 768732727 768073797 767332673 766689181 766251087 765883803 765356958 764639556 763908327 763347626 762930632
2522.9 762930632 762439847 761746109 760933518 760177851 759581804 759057760 758405626 757572591 756729484 756048203
2543.3 756048203 755511224 754949689 754226387 753404081 752670228 752082348 751518965 750838697 750032365 749266922
2563.7 749266922 748667121 748156905 747594833 746899307 746111214 745374858 744780898 744260550 743662655 742916167
2584.1 742916167 742122889 741456687 740940750 740413964 739725769 738909900 738136351 737495840 736905456 736226380
2604.5G36226380q39830r40382q78930p60496p86543r46402j096666j147151j045942
2622.9G27784038r22323r96113j232981j366317j258910j061738j006186j183033j397490
2641.2G17358947j371265j142203j001657j083433j274944j373529j254082j074552
2657.5G07783282j056493j167416j269400j246393j075506r53913j037598j213491
2673.9F98763072j267194j104057q85904q67784j057386j214087j168311r79424q63850
2692.2F89355075r65654j176000j270473j178563j046955j051486j201570j343071
2708.5F80121303j340986j221060j146555j206577j322270j345515j212239j073599
2724.8F70252502j071334j160979j210571j143693j024902r45628r75132j099825j158118
$$ plain form
2604.5 736226380 735386550 734446168 733567238 732806742 732020199 731073797 729977131 728829980 727784038
2622.9 727784038 726861715 725865602 724632621 723266304 722007394 720945656 719939470 718756437 717358947
2641.2 717358947 715987682 714845479 713843822 712760389 711485445 710111916 708857834 707783282
2657.5 707783282 706726789 705559373 704289973 703043580 701968074 701014161 699976563 698763072
2673.9 698763072 697495878 696391821 695505917 694638133 693580747 692366660 691198349 690218925 689355075
2692.2 689355075 688389421 687213421 685942948 684764385 683717430 682665944 681464374 680121303
2708.5 680121303 678780317 677559257 676412702 675206125 673883855 672538340 671326101 670252502
2724.8 670252502 669181168 668020189 666809618 665665925 664641023 663695395 662720263 661620438 660462320
2743.2F60462320j047015q86798q69632j002848j104176j070917r59396q80659r13203
2761.6F51727676j027822j103938j055538r57668r79722j117527j213908j233221j218915
2779.9F41819417j211226j278817j422882j519919j475930j412451j472831j616359
2796.2F30409002j747310j791179j742303j710356j800477j955450k024650k017677
2812.5F15619600k002835k013505k135873k321601k411902k392232k414763k556384
2828.9E97370505k763509k962947l106952l303230l648281m177570m908920n665004
2845.2E66834092o198048o306887n864859m921973l731667k712369k253712k440631
2861.5E32403946l072620l832876m369021m481315m169882l563165k855480k180398
$$ plain form
2743.2 660462320 659415305 658528507 657658875 656656027 655551851 654480934 653521538 652640879 651727676
2761.6 651727676 650699854 649595916 648540378 647582710 646602988 645485461 644271553 643038332 641819417
2779.9 641819417 640608191 639329374 637906492 636386573 634910643 633498192 632025361 630409002
2796.2 630409002 628661692 626870513 625128210 623417854 621617377 619661927 617637277 615619600
2812.5 615619600 613616765 611603260 609467387 607145786 604733884 602341652 599926889 597370505
2828.9 597370505 594606996 591644049 588537097 585233867 581585586 577408016 572499096 566834092
2845.2 566834092 560636044 554329157 548464298 543542325 539810658 537098289 534844577 532403946
2861.5 532403946 529331326 525498450 521129429 516648114 512478232 508915067 506059587 503879189
2877.8E03879189j624941j276732j147270j191109j370907j554758j643717j745313
2894.1D92324442j937628k168507k429813k709180k961278l267675l713221m240483
2910.4D68896657m781127n251914n499750n463869n127787m404605l356606k170056
2926.8D32840943r52929K27571J330584K371907L361970M174114M580438M498571M018277
2945.1D56451446L306269K570272J930743J392872J064002J167357J712024K479613
2961.4D72074598L281981M016399M622430N096376N487799N736143N733967N551993
2977.8E11601686N297840M967094M581749M145920L596008L001571K455652J932680
2994.1E41580200J392544P87556J44124m28438q50916j094878j201809j259386j331389
$$ plain form
2877.8 503879189 502254248 500977516 499830246 498639137 497268230 495713472 494069755 492324442
2894.1 492324442 490386814 488218307 485788494 483079314 480118036 476850361 473137140 468896657
2910.4 468896657 464115530 458863616 453363866 447899997 442772210 438367605 435010999 432840943
2926.8 432840943 431888014 432115585 433446169 435818076 439180046 443354160 447934598 452433169 456451446
2945.1 456451446 459757715 462327987 464258730 465651602 466715604 467882961 469594985 472074598
2961.4 472074598 475356579 479372978 483995408 489091784 494579583 500315726 506049693 511601686
2977.8 511601686 516899526 521866620 526448369 530594289 534190297 537191868 539647520 541580200
2994.1 541580200 542972744 543760300 543904424 543475986 542625070 541530192 540328383 539068997 537737608
3012.4E37737608j375258j342893j346290j512170j837015k169370k312601k262294
3028.7E23579717k181709k170146k243459k363324k445757k488077k539694k579213
3045.1E04568338k617299k672583k662540k607047k612740k646357k614677k489507
3061.4D83645588k324670k198369k077162j934051j834482j786322j742929j676023
3077.7D68071580j646966j658082j588702j449406j343817j301676j304537j326471
3094D56451923j323432j294166j325160j408905j471758j506716j511961j539081j603485
3112.4D43467259j639604j681775j770526j847506j877427j908153j978368k043545
3128.7D28720355k072036k092630k113253k147466k208441k251864k246707k252013
$$ plain form
3012.4 537737608 536362350 535019457 533673167 532160997 530323982 528154612 525842011 523579717
3028.7 523579717 521398008 519227862 516984403 514621079 512175322 509687245 507147551 504568338
3045.1 504568338 501951039 499278456 496615916 494008869 491396129 488749772 486135095 483645588
3061.4 483645588 481320918 479122549 477045387 475111336 473276854 471490532 469747603 468071580
3077.7 468071580 466424614 464766532 463177830 461728424 460384607 459082931 457778394 456451923
3094 456451923 455128491 453834325 452509165 451100260 449628502 448121786 446609825 445070744 443467259
3112.4 443467259 441827655 440145880 438375354 436527848 434650421 432742268 430763900 428720355
3128.7 428720355 426648319 424555689 422442436 420294970 418086529 415834665 413587958 411335945
3145D11335945k294332k299368k250433k251983k342730k420336k444983k426177k377302
3163.4C90228301k353430k374738k415091k439588k432436k395719k361119k354354
3179.7C71101826k388835k413630k373785k315432k279192k278805k290725k270460
3196C52490962k204955k121598k070307k047330k028108k014041j972079j924485j928538
3214.3C34179521j946748j946479j923680j877129j861870j901657j930803j919895
3230.7C18871260j911998j987130k101063k156019k182514k188206k191364k223909
3247C01929057k260119k310902k376974k400964k367318k340734k368063k361088k243102
3265.3B80899793k104610k016783j959384j880943j754135j607418j456708j306236
$$ plain form
3145 411335945 409041613 406742245 404491812 402239829 399897099 397476763 395031780 392605603 390228301
3163.4 390228301 387874871 385500133 383085042 380645454 378213018 375817299 373456180 371101826
3179.7 371101826 368712991 366299361 363925576 361610144 359330952 357052147 354761422 352490962
3196 352490962 350286007 348164409 346094102 344046772 342018664 340004623 338032544 336108059 334179521
3214.3 334179521 332232773 330286294 328362614 326485485 324623615 322721958 320791155 318871260
3230.7 318871260 316959262 314972132 312871069 310715050 308532536 306344330 304152966 301929057
3247 301929057 299668938 297358036 294981062 292580098 290212780 287872046 285503983 283142895 280899793
3265.3 280899793 278795183 276778400 274819016 272938073 271183938 269576520 268119812 266813576
3281.6B66813576j215368j167327j028777q15332o72757o31303o10262n53042m73141
3300B59646267l86268k99126k95073l60101l57867k93433k48671k49445k72096k79158
3320.4B56605029k70128k39402k28077k76089l15726l35872l47227l52114m12137m95195
3340.8B53333062n14418n37157n89639n60611n60254o70731p21276o72937o16207o09637
3361.2B47280195o42329o22392n91248o55279p49707p78824p19711n84364m84690n12466
3381.6B40939185n35935m44189l03477k56434l38525m19735l67493j78367n4061j57163
3402B37883806l09884k17647l1635R373J3068L0160L8535J06424K14040L08409M44785
3424.4B38489434O00889O74159O63116P44105Q72507Q09908O63177O88806Q57606J004249
$$ plain form
3281.6 266813576 265598208 264430881 263402104 262586772 261914015 261282712 260672450 260119408 259646267
3300 259646267 259259999 258960873 258665800 258305699 257947832 257654399 257405728 257156283 256884187 256605029
3320.4 256605029 256334901 256095499 255867422 255591333 255275607 254939735 254592508 254240394 253828257 253333062
3340.8 253333062 252818644 252281487 251691848 251131237 250570983 249900252 249178976 248506039 247889832 247280195
3361.2 247280195 246637866 246015474 245424226 244768947 244019240 243240416 242520705 241936341 241451651 240939185
3381.6 240939185 240403250 239959061 239655584 239399150 239060625 238640890 238273397 238095030 238040969 237883806
3402 237883806 237573922 237356275 237324640 237334013 237347081 237377241 237415776 237522200 237736240 238044649 238489434
3424.4 238489434 239090323 239764482 240427598 241171703 242044210 242854118 243517295 244206101 245063707 246067956
3444.8B46067956J105324J172199J224310J260206J318723J435697J488268J418293
3461.1B56490976J465886J701445J832962J679271J428247J456290J692742J862824
3477.4B69610643J884371J825691J866638J995504J994521J934737K022296K126127
3493.8B85260528K152801K124518K106428K097845K042920K017796K131849K329439
3510.1C02264124K490640K504825K348662K288818K417296K570957K546758K422422
3526.4C21854502K484381K700567K859921K968430K984196K877683K935856L076762
3542.7C44742298L065765K983838K997965L099978L259689L403067L461182L524781
3559C70538563L519594L343284L284127L849059M439533M287600M029185M119188M278212
$$ plain form
3444.8 246067956 247173280 248345479 249569789 250829995 252148718 253584415 255072683 256490976
3461.1 256490976 257956862 259658307 261491269 263170540 264598787 266055077 267747819 269610643
3477.4 269610643 271495014 273320705 275187343 277182847 279177368 281112105 283134401 285260528
3493.8 285260528 287413329 289537847 291644275 293742120 295785040 297802836 299934685 302264124
3510.1 302264124 304754764 307259589 309608251 311897069 314314365 316885322 319432080 321854502
3526.4 321854502 324338883 327039450 329899371 332867801 335851997 338729680 341665536 344742298
3542.7 344742298 347808063 350791901 353789866 356889844 360149533 363552600 367013782 370538563
3559 370538563 374058157 377401441 380685568 384534627 388974160 393261760 397290945 401410133 405688345
3577.4D05688345M371226M436314M324884M167080M450976M942626M836172M633933
3593.7D41851556M846603N054444N038619N033046M890293M543066M661947N083234
3610D81002808N090952M969328M804820M827380N427599N559027M848004M109263M472137
3628.4E25111318N784988N768955N134165M865766M742324M689157M464269L847480
3644.7E64408422L259778L789305N202055N277336M444063M400193M606128M143834
3661E99531114L631115L305674K760410K467871K998829K932310K703368L663898L997385
3679.4F27991974L410519K802729K187073J714528J854062K564013K849758K534508
3695.7F47909164K069593J693725J708448K054155J921952J244783Q27730J458526
$$ plain form
3577.4 405688345 410059571 414495885 418820769 422987849 427438825 432381451 437217623 441851556
3593.7 441851556 446698159 451752603 456791222 461824268 466714561 471257627 475919574 481002808
3610 481002808 486093760 491063088 495867908 500695288 506122887 511681914 516529918 520639181 525111318
3628.4 525111318 530896306 536665261 541799426 546665192 551407516 556096673 560560942 564408422
3644.7 564408422 567668200 571457505 576659560 581936896 586380959 590781152 595387280 599531114
3661 599531114 603162229 606467903 609228313 611696184 614695013 617627323 620330691 623994589 627991974
3679.4 627991974 631402493 634205222 636392295 638106823 639960885 642524898 645374656 647909164
3695.7 647909164 649978757 651672482 653380930 655435085 657357037 658601820 659429550 660888076
3712F60888076K474963K353609J579762J082778R76622J033008J221418J360357Q79765
3730.3F73850358K20835M10974J426875J981616J342118J45197M6015J206338R61721
3748.7F81592047M30465J499712K128482J473010R23455J149058J202643P98523O10710
3767.1F91808105O65366J002729J258433R80139O01172N37753P72834Q25703P65682
3785.4F99217916Q88168Q88169O62565K87772M410J06812N4419K22087R77099Q90851
3805.8G04200268Q35895J316011R81689K0146m09305l9935M4823O16610J432359J140177
3826.2G10138738O57797L33428J40608J74641q2910j32560O07132J135827J173257
3844.6G14145958R35674K97308p72655j436829K63929K000213J467287L53515j96337
$$ plain form
3712 660888076 663363039 665716648 667296410 668379188 669355810 670388818 671610236 672970593 673850358
3730.3 673850358 674071193 674482167 675909042 677890658 679232776 679377973 679423988 680630326 681592047
3748.7 681592047 682022512 683522224 685650706 687123716 688047171 689196229 690398872 691197395 691808105
3767.1 691808105 692473471 693476200 694734633 695714772 696315944 696853697 697626531 698452234 699217916
3785.4 699217916 700106084 700994253 701656818 701944590 701949000 702055812 702110231 702332318 703309417 704200268
3805.8 704200268 705036163 706352174 707333863 707354009 706944704 706904769 706949592 707566202 708998561 710138738
3826.2 710138738 710796535 711129963 711270571 711445212 711362302 711229742 711836874 712972701 714145958
3844.6 714145958 715081632 715378940 714606285 713169456 713433385 715433598 716900885 717254400 717058063
3862.9G17058063Q4042K58088o6101K82764Q82089R69053P19189N5194m2617K97785
3883.3G20497549K67684M91083M42147J67429N37634N99683j30237o23524l76284K45452
3903.7G22118616R64940J178801P55727L25918j2934l11911j42217L00408L65376K07663
3924.1G25750387K29895K31206N1558R1017L91662M65095K44498J0073m17K03371K33769
3946.5G27902114J02163J72913L03387K84315J83463Q8274J02401K10106K36750J82509
3966.9G29768395J51754J00911O5624J15812J57058R4593Q4579J92523K41160K09987
3987.3G31182396J49668J15513J27972J46389J62303
3997.5G31884241
$$ plain form
3862.9 717058063 717142105 717400193 717334092 717616856 718498945 719467998 720187187 720242381 720199764 720497549
3883.3 720497549 720765233 721256316 721698463 721865892 722403526 723003209 722872972 722249448 721873164 722118616
3903.7 722118616 723083556 724262357 725018084 725344002 725331068 725019157 724876940 725177348 725542724 725750387
3924.1 725750387 725980282 726211488 726263046 726354063 726745725 727210820 727455318 727465391 727464974 727668345 727902114
3946.5 727902114 728004277 728177190 728480577 728764892 728948355 729036629 729139030 729349136 729585886 729768395
3966.9 729768395 729920149 730021060 730086684 730202496 730359554 730454147 730538726 730731249 730972409 731182396
3987.3 731182396 731332064 731447577 731575549 731721938 731884241
3997.5 731884241
##END=$$ End of the data block
