##TITLE=$$ Begin of the data block
##JCAMP-DX=5.00 $$ ACD/SpecManager v 10.08
##SPECTROMETER/DATA SYSTEM=Varian
##DATE=15 Jan 2013 11:10:30
##DATA TYPE=INFRARED SPECTRUM
##DATA CLASS=XYDATA
##ORIGIN=
##OWNER=
##NPOINTS=3735
##FIRSTX=399.26403809
##LASTX=4000.35498047
##MAXX=4000.35498047
##MINX=399.26403809
##MAXY=70.54898834
##MINY=16.24881172
##XFACTOR=1.0000000000
##YFACTOR=0.000000100000000
##FIRSTY=38.33480835
##DELTAX=0.96440572
##XUNITS=1/CM
##YUNITS=TRANSMITTANCE
##XYDATA=(X++(Y..Y))
399.3 383348083 379014015 367794685 364481850 367093735 367043228 370691147 378170891 372622681 367507286
407.9 367507286 364315720 358593292 362398567 361244431 360082703 368868179 372697601 368035393
415.7 368035393 366516495 373015327 381359100 374981651 366654205 367620316 367341309 363095627 361194878
424.3 361194878 358257370 359264908 360262756 357481232 359499054 364420738 361252022 357778854 357568665
433 357568665 355952568 359830246 362788696 361732674 360273819 358519897 359238205 360707054 362803116
441.7 362803116 363090935 359927444 354554863 351733131 353369064 356597672 355557938 355408745 359900398
450.4 359900398 355771523 351989021 355562592 355439568 356502762 356458092 355456390 352204132 353242722
459.1 353242722 357514572 353977432 348613205 349234467 350277519 348442154 349521141 351642342 348940277
467.7 348940277 345306168 345744133 349168549 349085579 347735786 346714630 344068260 344026680 348626862
476.4 348626862 351036034 346487045 343676643 342225151 341315041 339863853 335264282 336545639 339131317
485.1 339131317 338183975 338660126 339996567 339608574 338103485 339439011 341366119 340181999 338314743
493.8 338314743 338733101 339709244 339430656 337287788 335490456 336851120 336171646 334347954 333684807
502.5 333684807 332484665 333402214 335857124 334866333 330712128 331406059 333777847 331322441 327018242
511.1 327018242 328448753 331202583 328710899 327183266 327352486 327712173 328065643 324702644 321011925
519.8 321011925 321946487 325217705 325510330 322732277 320613289 320286102 322078857 322910843 321150322
528.5 321150322 319500084 320245399 320958138 321260414 321609726 320678329 320496025 321238937 320986443 320427895
538.1 320427895 318691025 316879292 317726364 317970123 316681271 315874443 315002556 315484276 316131325
546.8 316131325 314758492 312596722 311254902 312400608 313872681 313294659 312013931 310594959 310348129
555.5 310348129 310988598 309634762 307828503 306583672 306628990 307812500 308034687 308879395 309493790
564.2 309493790 309525776 308740883 307691422 308169212 308988724 310385342 309191990 306857338 306773510
572.9 306773510 306952572 307979431 308681755 308093452 307284489 306800098 306145725 305080929 305813522
581.5 305813522 306837025 306566181 306125698 307821579 309930973 308822670 307080288 307112122 308319874
590.2 308319874 309856339 309866161 309799442 310522957 310795612 311777000 312120190 312227802 312594852 311293850
599.9 311293850 311024628 311945648 312556896 311477814 308975754 308236904 308410301 308777733 308637409
608.5 308637409 307727718 306427231 305305443 305552120 305906067 306232605 305967960 305730171 305489044
617.2 305489044 304800320 304698772 304636326 305235043 305634308 306538525 306341038 305044956 306066570 307140427
626.9 307140427 309133987 311623688 313473911 314498348 314402599 316001110 318009014 318875523 319324589
635.5 319324589 321051750 323385010 324337654 325777016 327815552 329369736 330007858 330392838 332307663
644.2 332307663 333714561 333315353 334122086 336295700 337319260 337674065 338008041 338444176 339456863
652.9 339456863 340648079 341600685 341004219 340117073 340626335 341058464 340808144 339872360 339983788 341021614
662.5 341021614 341241989 341001816 340301437 339970703 339120598 338073502 340401268 341158028 342298584
671.2 342298584 343463936 343857498 344755363 346244316 346566315 346697464 348342438 349742126 350812950
679.9 350812950 352248077 354054604 355673447 356504860 357496796 358648148 360129852 360462914 360383987
688.6 360383987 362458038 364054337 364539795 365614738 366933784 368005600 368348923 367977448 368212204
697.3 368212204 368702965 369044991 369836769 371126328 373743935 375211067 375291824 376391373 377310982
705.9 377310982 378106880 378656616 379630547 380599861 380702896 381128273 381366348 382475777 384607277
714.6 384607277 385932922 386356659 387133675 387962036 388192673 388994446 390016594 390542183 390829582
723.3 390829582 391584778 392239838 393444519 395606461 396973763 398040810 398185310 398431587 399950829
732 399950829 401100311 401473618 402018547 403173637 404062233 405749626 406528358 405433044 404899406
740.7 404899406 405767097 407190895 406868820 407103081 408418579 409025269 410126038 411396751 412475662
749.3 412475662 413423691 413896980 413688812 414659843 415884132 416612625 418144951 418979454 420829887
758 420829887 423513451 424989204 425816002 426979599 428538361 428659134 428032684 428124084 428871269 429559517
767.7 429559517 430393562 430992279 431784973 433092575 432761307 431978455 431972084 432257118 431797180 431233635
777.3 431233635 431536560 432185936 432853127 432440414 432789307 433353004 433538971 433771362 433024178 433018265
787 433018265 433950005 435776672 436550598 436111984 435598412 434887543 435339508 435892487 435884590 434187355
796.6 434187355 433158569 433215332 431989517 431277618 430039291 428340759 426614304 424778137 423406487
805.3 423406487 421391716 418324585 415780678 413929367 411693268 410457458 408974113 406804390
813 406804390 405220757 404051552 403136482 401735497 400389442 399321480 399174919 399482117 399946823
821.7 399946823 401225510 402576180 404418106 406550102 409067192 411802177 414840775 418056335
829.4 418056335 420848541 423936310 427080994 430833664 433884201 436921425 439652672 441471481
837.1 441471481 444138527 445609741 447857666 450417633 452837906 455626068 457691917 459985809
844.8 459985809 461068153 462486534 463822746 466583557 469638329 469802132 470488129 472208023 474150391
853.5 474150391 474335670 475765343 479015732 481547241 483472786 484552307 486907310 488083420 489262924
862.2 489262924 490827942 491616096 491958542 491357117 491764565 490890694 489955368 489645576 489838638 489471588
871.8 489471588 486960297 485016747 483478889 483035965 482056847 480374413 478774414 477443352 476736259
880.5 476736259 475404587 474771614 473741150 472854042 472160759 471414757 470252838 468439751 467849426
889.2 467849426 467160187 467157478 467245102 467523232 467362404 466343536 465706940 464557610 464961548 464373360
898.8 464373360 463144989 462438049 461189461 461252632 461879082 463337669 464773979 467233696 469711151
907.5 469711151 471185532 473110771 473750267 473801956 473784599 474306793 473618927 472423668 471247902
916.2 471247902 468764038 466441460 463187523 460208282 457360039 454657288 451374626 447967682
923.9 447967682 445441093 441481438 438396187 434913902 430946770 427940254 424516029 421627388
931.6 421627388 419294662 417567825 416088028 414933090 413636932 412349205 410929985 409280090
939.3 409280090 408649139 407671585 406666107 405288696 403955498 403326569 402531204 402000313 400803642
948 400803642 399976921 399667282 399208374 398679237 398175240 397898026 396856232 395264130 392738838 390068398
957.7 390068398 387602577 385077019 382782860 380336380 377714653 374799881 372666397 370773430
965.4 370773430 368792534 366723213 364014397 361657143 359723625 357738190 354982109 351928902
973.1 351928902 348754425 345385361 342228279 339055290 335443230 330478516 325471153 320908127
980.8 320908127 315686779 309952240 304516106 299456844 294321384 289544945 284886074 279924793
988.5 279924793 274841747 269863453 265583591 261422100 256830635 253023758 249385185 246043301
996.2 246043301 243129978 240066204 237541904 234767590 232272263 229475060 226948528 225043144
1004 225043144 222601471 220611839 218590450 217204571 215919590 214708920 213044586 210465984 208611927
1012.6 208611927 207060356 205761280 203291435 201110229 199431896 197630520 195859165 193047867
1020.3 193047867 191382542 189389591 187484417 185594368 183370094 181951981 180278969 178962975
1028.1 178962975 176899891 175709686 174711514 174040756 173930435 173515282 174405689 174403553 174670334 175194321
1037.7 175194321 176604862 177653122 178182545 180522118 181827602 182752209 182703323 183656578 184546967
1046.4 184546967 183907566 183608971 181892223 181106186 180771561 181304169 180926361 179222527 179027882
1055.1 179027882 178012161 176764088 175825253 176693211 177763290 178733234 180341759 181551933 183532028
1063.7 183532028 185292511 187069702 188350220 190524597 192703476 194611835 196131649 196565304
1071.5 196565304 198219872 198517857 199006214 199443626 199733620 200657043 200630760 201498127 201778297 203286171
1081.1 203286171 205038548 205630245 206062565 206795559 208597889 209168911 210185585 211422596 213468170
1089.8 213468170 215887203 217185192 218342876 219520340 221377068 221729603 223057995 224986286
1097.5 224986286 225714569 227028046 228360481 230126152 231151333 232390118 233766766 235336704
1105.2 235336704 237069473 237965469 239125271 239877472 240849953 241229649 241900806 243434715 244357090
1113.9 244357090 245245190 246162357 247513294 247944050 247738647 247696095 248020592 248448219 248105125 247937794
1123.5 247937794 248257065 249107971 249768257 251590614 253323669 254163818 256081314 258010101 260175228
1132.2 260175228 261798534 263789330 266242599 268712521 271541061 273624001 275832977 277728386
1139.9 277728386 279559708 280988178 282103024 283255959 284228420 285471001 285984917 287008839 287860374
1148.6 287860374 287758541 287428722 286797543 286817131 286897697 287153435 286977081 285885696 285022392 284775829
1158.3 284775829 284370289 283254642 282485237 281661701 281493187 282151966 283081360 284365540 285831413
1166.9 285831413 288281460 290951691 293968887 296588306 299331703 302810822 305592957 308563118
1174.6 308563118 311785431 314966240 318387051 321990318 325420380 328231583 330387878 332850266
1182.4 332850266 335809746 338297615 339963799 341503029 343218956 344245224 345122185 345719643 345992050
1191 345992050 346201630 346154671 345681534 344420929 343393631 342535706 341433868 340061188 338800354
1199.7 338800354 337737885 336189003 334680328 333213692 331818581 330676765 329606628 328789673
1207.4 328789673 327940254 327181778 327037926 327138710 326723518 326131020 325432091 324255142 323439369
1216.1 323439369 323192482 323030052 322664185 322222252 321830940 321452026 321052971 320205650 319522610 319033356
1225.8 319033356 318099384 316751404 315272999 314487629 314144001 313625565 312591133 311502457 311027641
1234.4 311027641 310525761 310195732 309622765 308943615 308850727 308560505 308164978 308000698 308123932 307699242
1244.1 307699242 306898212 306583977 306395264 306060219 305223236 304695511 304572372 304469147 304349384 303891354
1253.7 303891354 303693714 303397446 302839451 302652454 302795506 302606030 302330666 302565365 302877674 303246422
1263.4 303246422 303729000 304477539 304970856 305497169 306289539 306998825 307980232 308902988 310059700
1272 310059700 311287251 312464447 313527355 314567871 315828381 317135696 318701820 319761810 320507584
1280.7 320507584 321798897 323803520 325759544 327383652 328930664 330418930 332384338 334040146
1288.4 334040146 335427933 336718483 337877541 338987541 340175476 341571121 342531319 343300247 343801079
1297.1 343801079 344391708 345172691 346066208 346429634 346335678 346733475 346991806 347398262 347352486 347133675
1306.8 347133675 346972466 346655235 346421356 345718918 345429153 344722710 343970642 343682098 343270721 342988205
1316.4 342988205 342585716 343377762 344356689 345024834 345993080 346964989 347918739 348279457 349248734 350261765
1326 350261765 350517502 350576363 350724297 350711479 350533600 350340118 349610329 349142990 348537331 347958221
1335.7 347958221 347749176 347612381 348213348 348547592 348656540 349168205 350068741 350819778 351256104 351941566
1345.3 351941566 352806778 353785591 354062843 354489288 354705696 354507980 354291344 353683472 353022919 352035675
1355 352035675 351687126 351814613 351932716 351424179 351181335 351018372 349879570 349819489 348919907 348449478
1364.6 348449478 348072853 347140961 346938133 346137543 345799141 345343246 344750786 344336472 343850899 343496590
1374.3 343496590 342935715 343510742 343620567 343327103 342804222 342408257 342007637 340980835 340126114
1382.9 340126114 338635139 337260513 335715637 334235229 332771263 331174240 330007210 328010979
1390.7 328010979 325837860 323666878 322198486 319837646 316284122 314452324 312168217 310246143
1398.4 310246143 307352676 304833622 303357048 300950317 298755226 296661148 293502502 290806561
1406.1 290806561 289452934 287981052 286204014 284886112 283249531 281811848 280244255 278796501
1413.8 278796501 277920742 276942558 276149921 275004330 274530430 272965412 273170242 274716778 275063038
1422.5 275063038 275224934 274690323 275749779 276964264 277815819 279351940 279939899 281319981 282583618
1431.2 282583618 284284134 285836067 287552986 289978752 291557865 294366970 295291557 297190838
1438.9 297190838 299341812 301506538 303465347 304905930 307217693 308728256 310890427 312207222
1446.6 312207222 313189487 314615002 316142006 318615932 320081673 322258682 323933868 325845490
1454.3 325845490 327534142 329171448 332036591 331402779 335099754 336581612 338803596 341113091
1462 341113091 343342361 346401825 347434349 350205650 352581139 355233765 357555122 360116539 363704185
1470.7 363704185 366107750 369204254 372203255 376441612 379840508 382235069 384882889 387607498
1478.4 387607498 390315781 392501144 394444809 395778236 397593689 399494247 401064377 403108788
1486.1 403108788 404546127 405293198 406272354 405272369 404501457 404744225 404469185 403492241 402552452
1494.8 402552452 401508484 396450882 396409225 395111313 391663361 391122169 389629173 387827682 385992966
1503.5 385992966 385518227 384216080 379929085 377879639 377592125 379231110 379016609 379874420 378954582
1512.2 378954582 376925964 376705933 375985680 375823288 374206810 372199707 372888832 374114151 372592697
1520.8 372592697 370654602 372391281 373065300 374626160 375124283 375854721 376694374 377586784 378775291
1529.5 378775291 379617653 380628891 381186562 381529312 380645180 382361374 383665276 384097328 385088997
1538.2 385088997 382650032 383714485 385050659 385151939 385017662 386486397 387373886 386731911 388476486
1546.9 388476486 388806381 389330254 389300690 388885612 389911728 390404320 391435432 388230476 387237968
1555.6 387237968 387927170 388505669 384664345 375268707 379615555 378783226 379357681 377685242 375776024
1564.2 375776024 371964226 368259621 366659126 363542671 361805420 353245125 351194344 348892517
1572 348892517 344798088 341411514 337367935 335274086 321964226 320117455 316746883 312462006
1579.7 312462006 308332500 302417183 298752098 292518311 288663788 282973747 278237076 273786030
1587.4 273786030 268407173 264945621 258794575 255830193 250258293 246969433 243177853 238432961
1595.1 238432961 236000977 230829239 228512573 223981190 222103786 218374519 214714317 212722149
1602.8 212722149 208731403 207956429 204415131 203653450 200581150 199153385 198238735 195350723 195811844
1611.5 195811844 193296089 193723183 191941986 192136002 192125492 187217007 189222145 187865925 189080868
1620.2 189080868 187604351 188457203 188046227 187069435 189259682 188720894 190757027 189292297 191038322
1628.9 191038322 191609383 192498398 193780003 193630104 196268253 196210670 200110359 197992134 200021744
1637.5 200021744 202317696 203753281 206486282 206638813 209094772 209508038 212314892 214552822 214370842
1646.2 214370842 217291756 216624527 220466805 221155548 224350319 226551476 227292824 228458271 228023796
1654.9 228023796 232540455 233269081 235890388 237354736 239581242 241930790 243319874 246710396
1662.6 246710396 247690659 251819000 254205818 257837982 261054611 263555088 267837830 269354839
1670.3 269354839 275228558 278481636 282717400 286198273 290260410 295667896 299089069 304513645
1678 304513645 307796326 312659302 316806145 321590538 327000237 329712257 337126961 340306168 346771049
1686.7 346771049 351250954 356171417 361763687 366737900 372586784 377589607 383391838 388437347
1694.4 388437347 393596191 397172661 403391800 409953651 415534668 421531410 422442894 429484367
1702.1 429484367 435309982 440419960 445129089 449081116 452482262 456614838 461354485 464481010
1709.9 464481010 467236595 470002823 472846031 475928154 477702980 480238342 484797173 487970772
1717.6 487970772 484351540 487570000 491256599 493798141 496003265 497453575 499148102 501291924
1725.3 501291924 503162727 504788551 506865616 509038429 509560432 510602608 514220505 517932472
1733 517932472 516274948 513681221 518798828 523130760 525959473 529498253 530579720 530219498 534786873
1741.7 534786873 538084183 539671021 542208443 546066704 549853134 552903061 556188393 559111328
1749.4 559111328 564409904 567020226 569030495 574274025 577906952 581579361 585227470 586746826
1757.1 586746826 589197807 592928734 596426201 599870224 599912720 601077652 605264473 607709465 609757118
1765.8 609757118 612111168 614460144 613693161 616254158 620866241 621059418 619841270 619199486 623594589
1774.5 623594589 626302490 626156540 628830147 630157051 632077637 633137321 633141518 634769859 636681404
1783.2 636681404 638277359 638092461 638961868 640822220 642408142 643356018 645074997 646046066 646594086
1791.8 646594086 645376968 644743500 648795319 650142822 650301971 651984177 653987579 655116806 654158173
1800.5 654158173 656244202 656396484 656963959 658579865 659372101 660848694 661489182 662372208 663559341
1809.2 663559341 665085144 664767151 665569305 667023392 667492371 668628387 668659363 669823532 670201492
1817.9 670201492 670755386 671815720 672193756 673535843 673510208 674837418 675706711 673659134 674093552
1826.5 674093552 676413498 678806763 678538666 675978928 677141647 679646149 679820862 679945831 680476685
1835.2 680476685 680917969 681212997 680969849 682739258 683371811 684384842 685031738 686065903 687036057
1843.9 687036057 681569290 683782349 686198196 686611328 686621323 687043381 688367538 688706055 689677048
1852.6 689677048 689657974 690021667 689976578 689919586 690783844 690666428 691293030 691197739 691707001 692160568
1862.2 692160568 692766190 693266449 693551407 694662781 693600006 693792725 692998276 691878510 693155365
1870.9 693155365 694637375 696060562 696006241 696516190 696522293 696665192 696471024 696480484 697299957 697099533
1880.6 697099533 697791290 697882004 698316574 698255386 698266525 698983383 698741074 699600525 698892365 697709656
1890.2 697709656 698454514 699225159 699674606 700582123 700733719 699663620 700763779 701056671 701122360
1898.9 701122360 701159363 701180954 701641083 701322556 701949844 701718750 701956329 702337036 702395096 702513275
1908.5 702513275 701943207 701805344 701612549 702650757 702624283 702721863 702903442 703099670 704605331 703040848
1918.2 703040848 703185425 703905792 703924713 704126053 702967453 702866058 702901611 703511276 704027481 704453201
1927.8 704453201 704475327 704524536 704718628 704032593 704168091 703936539 704146729 704242325 704511795 704820023
1937.5 704820023 704624710 705309219 704991913 705489883 704809952 702889862 703405685 703918610 704184113
1946.1 704184113 704124069 704719315 704708786 704632492 704575882 704493027 704696121 704155350 703968277 703529587
1955.8 703529587 703969879 703996887 703749924 704236450 703904266 703868942 703648071 703763504 703733673 703893509
1965.4 703893509 703815689 703230286 703706970 703804245 704123764 703812637 703722076 703853760 703711624 704018326
1975.1 704018326 703828201 703640366 703072128 703221054 703160400 703221817 703709106 703539658 703752899 703175507
1984.7 703175507 702996292 702814713 702690048 702605820 702288971 702787628 702422409 702131653 702040939 702530823
1994.3 702530823 702607346 702185211 702321167 701867676 701930542 701597748 701532593 701451416 701307068 701481247
2004 701481247 701421738 701904755 701297073 700953064 700709152 700737915 700758362 699945450 700142670 699910126
2013.6 699910126 699932632 699928284 699492493 698935013 698985596 699584122 699051971 698955765 698495331 698280563
2023.3 698280563 698222427 697979584 698178635 697868729 697944183 697595367 697476654 697300110 697188873 697088318
2032.9 697088318 696429138 696314850 695893784 696181335 696273651 696144714 695965347 695614624 695590363 695025711
2042.6 695025711 695251541 695173645 695297928 695215912 694800339 694793167 694388046 694736786 694344559 694117355
2052.2 694117355 693938141 693765106 693911514 693390198 693478928 693107376 693103409 693079300 693257904 693533859
2061.9 693533859 693166428 693354111 692854691 692787247 692740402 692816696 692879486 692456207 692440643 692450409 692983627
2072.5 692983627 692614059 692314072 691795044 691253586 691322632 690862045 691343918 691623917 691944885 691816177
2082.1 691816177 691402588 691216736 690800858 690838318 690273132 690383224 690210190 689919281 689730835 689467926
2091.7 689467926 690002213 689699326 689728851 689554062 689375534 688913727 688166504 688114395 687932281 688488312
2101.4 688488312 688536987 688797226 688605728 688021088 688093567 687590561 687381897 686916733 686867828 686584320
2111 686584320 686414413 686272354 685905075 686529694 686231995 686177979 685997925 685829391 685644836 684866867
2120.7 684866867 684789963 684632645 685041656 685080032 685235291 685291061 685097351 685285721 684753113 684660187
2130.3 684660187 684137192 683917389 684281540 684803619 685192261 684989014 685106049 684629211 684497833 684084396
2140 684084396 683829727 683855438 683544464 683904419 683948135 684584351 684871140 684784012 684770126 684496536 684289246
2150.6 684289246 683979797 684114609 683796005 684030304 683889084 683909073 684651566 684430237 684430618 683990402
2160.2 683990402 683808746 683553543 683457794 683682709 683665695 684107819 684105453 684698105 684624634 684457626
2169.9 684457626 684862900 685020294 685028381 684152985 684162750 684152679 684487839 685002899 685112228 685364380
2179.5 685364380 684932632 685049133 684844589 684925385 684904022 684574661 684769058 684630127 685078049 685650787
2189.1 685650787 686351929 686381607 686258850 686051788 685589676 685727310 685034103 684862823 685080719 685455551
2198.8 685455551 685969543 686269608 686501999 686316452 686417770 685981445 686186066 686115265 685670013 685896301
2208.4 685896301 685955811 686594391 686533127 686523819 686627350 686796494 686853333 686430511 686513748 686235199 686656952
2219 686656952 686698608 686645737 686854324 686900024 687362900 686778336 686688232 686534271 686308975 686506500 686391983
2229.7 686391983 686356354 686392975 687364426 687705383 687296371 686730652 686499405 686556473 686303101 686311340
2239.3 686311340 686006317 686349335 686694336 686930466 686836624 686419678 686680527 686726303 687014008 686727371
2248.9 686727371 686719437 686741562 686359787 686349335 686179581 686521530 686289139 686222305 686307144 686560364 686721573
2259.5 686721573 686535416 686903229 686251984 686181107 686306839 686533127 686580811 686053314 686283951 685761108
2269.2 685761108 686044769 686141129 685934753 685929108 685577393 686051636 685860291 685440216 685009384 685422440
2278.8 685422440 685695953 685446472 685462646 685179062 685615311 685228195 685281372 685202255 684761887 684981995
2288.5 684981995 684566650 684586182 683987808 684211349 684412842 684078979 684086380 683494873 683888092 683741150
2298.1 683741150 683733902 683504562 682976761 683060684 682712173 682865906 682646561 682500534 681955414 681697083
2307.8 681697083 681529999 680755386 680978546 681142654 681548386 681111374 680937042 681079559 680377808 679695587
2317.4 679695587 679212189 679771729 679307938 679117508 678798523 678277740 678093643 677285538 677477417 677539062
2327.1 677539062 678403931 677261124 675597305 675753174 676156540 677032166 676174545 676291199 676040344
2335.7 676040344 675845490 676125870 675766220 676491928 676730042 675812759 673515549 673357773 673695984
2344.4 673695984 674175873 674457550 673089600 673689957 674889832 675617447 674911118 674158325 673333435
2353.1 673333435 672472687 673339081 673015060 673103180 671706772 671511993 670277100 668533325 670933990
2361.8 670933990 671086426 671289673 670885315 670963821 671226959 670982208 671347885 671702728 672118073 670587540
2371.4 670587540 670388870 670169144 670328598 670879974 670157776 670522232 670476303 670240021 670136642 670219116
2381.1 670219116 670210495 669804916 669427414 668970871 669032593 668740082 669062347 669358902 668570786 668084717
2390.7 668084717 667976074 668060989 667713089 667563324 667129135 666455231 666047516 665698471 665623474 665344543
2400.3 665344543 665476990 665284958 665189133 664976273 664212341 663771896 663233261 663248367 662998810 662541809
2410 662541809 662108307 661914902 661822968 661290436 661095581 660225525 659741211 659511795 659333572 659464340
2419.6 659464340 658894424 658676910 658249741 657659454 657194443 657148285 656953354 656234283 656028214 655732956
2429.3 655732956 655403900 654731750 654465485 654209290 653785706 653606720 652960205 653043289 652896271 652521362
2438.9 652521362 651964951 651265411 651107483 650777588 650694962 650186996 649649582 649199142 648810043 648529434
2448.6 648529434 648101730 647753677 646897812 646451340 645989456 645809402 645838394 645330582 645069580 644640808
2458.2 644640808 644104309 643444214 643132401 642590866 642120132 641783905 640855484 640548706 640438538 640414505
2467.8 640414505 639617462 638819008 638447456 637723389 637547150 636893463 636405754 636050911 635747490 635426750
2477.5 635426750 634675522 634359856 634088974 634009247 632972107 631952400 631913795 631714706 631005173 630004578
2487.1 630004578 629788895 629306030 628826332 628342247 627644615 627203178 626705513 626474037 625861168 625345154
2496.8 625345154 624594536 624025879 623581467 623119507 623278122 622527008 621997261 621605339 621025429 620335426
2506.4 620335426 619479294 619061279 618166313 617824516 617670479 617246284 616703796 616396370 616119537 615077438
2516.1 615077438 614611244 614060249 613464775 612799721 612513084 612623100 611908417 611431694 610837822 610604668
2525.7 610604668 610376205 609757538 608919144 608126106 608305054 607884216 607478676 607301178 606898308 606421013
2535.4 606421013 605724869 605288277 604563637 603987885 603561707 603129807 602637291 602543602 602233124 601215935
2545 601215935 600900078 600639229 600550652 599941559 598873062 598155594 597591133 597341919 596529312 596352921
2554.6 596352921 596407356 595940285 595336685 594796028 594693184 594152985 593715134 592998199 592252922 591876183
2564.3 591876183 591516914 591345558 591249390 591278076 590681953 590242119 589359856 588278313 587910576 587602158
2573.9 587602158 587510948 586797333 586569672 586442986 586038513 585871735 585081291 584289818 583435898 582943764
2583.6 582943764 582427139 582176552 582291718 582070999 581671257 580534477 579954758 579570160 578982697
2592.2 578982697 578614006 577946854 577428436 577028961 576730614 576490784 576404686 575982094 575504684 574880905
2601.9 574880905 573815956 572902870 572040024 571805649 571426239 571089249 570841942 570408897 570290794
2610.6 570290794 569704399 568994865 567909203 567054176 566405525 565944252 565928650 565107307 564354439 563699112
2620.2 563699112 563392258 563216705 562680511 562183838 561365967 560682182 559943008 559275360 558591805 558200111
2629.9 558200111 558007240 557816772 557737198 556881485 556193771 555510750 554789429 553981743 552954788 552608452
2639.5 552608452 552644196 552761002 552065353 551240273 550412979 549710846 549434662 548528175 547739296 547067833
2649.1 547067833 546726303 546519547 546235237 546033936 545719070 545288277 544219818 543438377 542806053
2657.8 542806053 542477684 542055092 541353455 541257973 540762405 540343628 539808044 539359741 539025993 538299179
2667.5 538299179 537832985 537526855 537184372 536146622 535770378 535923920 535843582 535832977 535231323 534700470
2677.1 534700470 534058342 533605919 533078728 532295799 531591682 530882721 530613937 530169144 529992485 529752846
2686.8 529752846 529305458 528952789 528662605 528547134 528082619 527567902 526681519 526248131 526032028 525592918
2696.4 525592918 525404472 524949799 524720078 524193230 523604126 523000946 522592545 522440681 521941299 521801987
2706 521801987 521557961 521251602 520491791 519847183 519613457 519286118 519197693 518446312 517941475 517765045
2715.7 517765045 517554398 517395439 517221832 516797218 516025276 516034660 515513306 514884415 514564743 514104462
2725.3 514104462 513859482 513425217 513651390 513485870 513076859 512674599 512015915 511788177 511308670 511025925
2735 511025925 510856819 510888710 510727806 510169449 509839401 509610519 509556313 509321480 509300117 509095192
2744.6 509095192 508647804 508249550 508172684 508373070 507885895 507527809 507132645 506934586 506945496 506387672
2754.3 506387672 505918961 505683479 505452003 504888687 504572678 504263000 503785934 503428841 503095398 502980843
2763.9 502980843 502709274 502395325 501528053 500875320 500804214 500494957 500270042 499932404 499756889 499539337
2773.5 499539337 499086037 498475151 498007050 497595863 497129936 496604958 495554123 495355949 495227623
2782.2 495227623 494807091 494574356 493749542 493226089 492758484 492485580 492208939 491573563 490824051 489870262
2791.9 489870262 489048843 488270760 487875061 487372513 486906281 486451492 485793037 485130043 484317741 483830223
2801.5 483830223 482688522 481632423 481235046 480678864 480209503 479686737 478975754 477819672 477015991
2810.2 477015991 476361847 475365257 474262238 473455086 473072662 472081871 471165924 470345421 469522324
2818.9 469522324 468813133 467833176 467015991 466099930 465126305 464171143 463368073 462418327 461437569 460211334
2828.5 460211334 458732567 458115959 457569847 456665878 455278549 454192276 453247566 451749496 450739784
2837.2 450739784 449490395 447967567 446122437 444331970 442715759 440567322 438441010 436177254
2844.9 436177254 434247627 432336693 430188293 427709160 425090828 423040810 421178474 419909592
2852.6 419909592 418748322 417873802 417280769 416739807 416759338 416777382 416467628 415855789 415762939 415348549
2862.3 415348549 414694176 414321022 413284912 412247734 411222839 410260582 409456367 408747978 407439423
2870.9 407439423 406296082 406353951 405764313 404696808 403388977 402392159 402041550 401315308 400447426
2879.6 400447426 399522133 398935318 398249550 397189674 395941925 394686661 393701553 392877541 391908150
2888.3 391908150 390433998 389295921 388280983 387398415 386339417 385248451 384812088 383753090 382686615
2897 382686615 381351433 380133629 379624748 378612709 377768478 377035141 376196823 375186005 374279823
2905.7 374279823 373542252 372759895 371735191 370390968 369581795 368371849 367021751 365693855 364275360
2914.3 364275360 363011703 361056633 359320374 357675133 356439590 355370445 353784065 352926712
2922.1 352926712 352367821 351760979 351187592 350685844 350599174 350975304 351019211 351074753 351567268 351455269
2931.7 351455269 351457253 351853905 352434464 352953987 353477554 354105263 354527893 355331917 356108437 356948280
2941.3 356948280 357591667 358181953 359084740 359815102 360910912 361812363 362344513 362797356 363448372
2950 363448372 364066315 364664078 365353622 365604095 366594048 367470093 367874832 368210831 368332291 369092484
2959.7 369092484 369923515 370812721 371135902 371407089 372330894 372969666 373587074 374105797 374762573 375943298
2969.3 375943298 377333031 378189621 378771019 379211731 379661636 380611229 380949593 381284103 382021332
2978 382021332 382733231 383283386 383554001 383989601 383999710 383929901 384061928 384330330 384655151 384792900
2987.6 384792900 385168266 385416336 385369911 385208397 385048599 384815140 384683571 384661331 384474487 384118423
2997.3 384118423 383871384 383980370 383597908 383057327 382422562 381784668 381574631 380984573 380325928 379591789
3006.9 379591789 379022408 378590355 378052368 377423859 376626511 376197968 375810738 375648003 374767151 373446274
3016.6 373446274 372914200 372330894 371723022 370888023 370104790 369254494 368528786 368230362 367535324 366677017
3026.2 366677017 365734673 364789581 363567848 362549973 361903801 361154976 360389709 359323692 358493385
3034.9 358493385 357816734 357222557 356194077 354949646 354217606 353267937 352438431 351604385 350893860
3043.6 350893860 350409966 349755554 348618011 346967812 345759773 345005951 344557800 343991585 343485794
3052.2 343485794 342750168 341344643 340237389 339345360 338471718 337358475 336419868 335775871 334966583
3060.9 334966583 333830528 332892189 332750320 332029953 331162567 330525551 329706726 328694382 327492256
3069.6 327492256 326943321 326181412 325402374 325006638 324549332 323935966 323194618 322344742 321144295
3078.3 321144295 320417519 319703808 319162483 318606873 317747307 317100983 316379433 316146603 315100994
3087 315100994 314079227 313654709 312805519 311985226 310817375 310199852 309264088 308681717 308702488 307596054
3096.6 307596054 306610527 305966187 305845203 305157871 304164562 303665695 302626934 301789970 300873547
3105.3 300873547 300060253 299464245 298739090 297883301 296798859 296009407 295524158 294945431 293835392
3114 293835392 292875557 292120819 291534119 291125259 290432587 289741402 288859749 287897701 286755772 286191502
3123.6 286191502 286038265 285221252 284111671 283199730 283009548 282403374 281147633 279765873 278579617
3132.3 278579617 278046494 277314339 276548996 275829792 275264626 274589729 273708324 273082066 272492352 271960068
3141.9 271960068 270939884 269979877 269115086 268198433 267679100 267026100 266288948 265514278 264815178
3150.6 264815178 263995934 263452473 262777348 261504917 260628128 259871101 259309654 258468037 257320747
3159.3 257320747 256487370 255882969 255504208 254709072 253809910 252946758 252217598 251644516 250828552 249832916
3168.9 249832916 249000092 248719254 248147793 247486897 246835575 245807114 244992332 244294605 243406258
3177.6 243406258 242287540 241590576 241065178 240346565 239638729 238921108 238306446 237566109 236890984
3186.3 236890984 236278229 235847874 235205841 234122963 233391285 232892990 232297382 231458836 230673580
3195 230673580 229882965 229273319 228952122 228493977 227956753 227054482 226402111 225863361 225185528 224763165
3204.6 224763165 224086342 223190632 222669392 222618122 221994743 221254578 220527687 219717007 219683704 219129906
3214.3 219129906 218528576 218235950 217461777 216867065 216321754 215608006 214906616 214654140 214172459 213322239
3223.9 213322239 212972279 212605877 211994629 211397572 210983524 210236015 209226665 209016151 209288254
3232.6 209288254 209128170 208129921 206864223 206352959 206232815 205707493 205363789 205379887 205024986 204224834
3242.2 204224834 203519268 202975655 202504330 202352028 201759434 200897770 200676022 200817375 200882645 200462742
3251.9 200462742 199709415 198826237 198255215 198063545 197411461 196484890 195999126 195888805 195722027 195693836
3261.5 195693836 195454903 194770603 194277573 194020481 193821564 193531113 193251228 192836628 192397747 192032833
3271.2 192032833 191522923 190980587 190421543 190088921 189680996 189509487 189301224 188713436 188686905 188598022
3280.8 188598022 188507748 188447857 187976837 187500057 186951370 186626301 186319923 185989876 185885372 185948086
3290.4 185948086 185953407 185448303 184930592 184749279 184800644 184733257 184158878 183593082 183517418 183385391
3300.1 183385391 182918167 182674809 182562943 182220135 181911621 181541290 180870647 180673676 180707150 180623608
3309.7 180623608 180786743 180436573 180183010 180001869 179396782 179028969 178489857 178220711 178271255 177889309
3319.4 177889309 177332706 176972923 176507893 176135826 176237030 175882759 175293694 174673386 174136372 174022522
3329 174022522 173457336 172727604 172289753 172142410 172005405 171911354 171846848 171122742 170451488 170070457
3338.7 170070457 169641609 169028816 168376732 168335571 168487225 168435936 167979851 167330418 167088337 166982346
3348.3 166982346 166876926 166795139 166388512 165848064 165443745 165295887 165755596 166136742 165630112 164870377
3357.9 164870377 164861126 165022926 164613914 164312687 164152088 164244328 164512215 164548779 164361477 164066620
3367.6 164066620 164149570 163968544 163621254 163576069 163399696 163335419 163594437 163843784 163604031 163482132
3377.2 163482132 163494930 163376961 163325348 163139248 163287659 163257122 163277454 163754444 163585072 163146172
3386.9 163146172 163090267 163309326 163351536 163174076 163144341 163113041 163284874 163566437 163257275 162731266
3396.5 162731266 162488117 162537575 163039742 163186760 163240013 163541222 163240395 163148384 163606567 163936119
3406.2 163936119 163840885 163909817 164309750 164185429 164115448 164474335 164715099 164963169 165380173 165363255
3415.8 165363255 165395546 165739594 165983467 166778736 166886711 166798134 167507629 167377224 167172165 167499485
3425.5 167499485 167615776 167614670 168473148 169336796 169147167 169142475 169255238 169548893 170075150 170443497
3435.1 170443497 170945549 171195107 171210594 171452579 172194157 173101254 173596439 173528595 173735809 174348297
3444.7 174348297 174856243 175419979 175515747 175965748 176695862 176849041 177192364 177696037 178029213 178473072
3454.4 178473072 179335117 180056114 180398617 180890694 181731396 182535553 182962170 183451691 183620682 184073734
3464 184073734 184975815 185655384 186310177 186619453 187423401 188282776 188644753 189209995 189675083 190332375
3473.7 190332375 190993443 191379128 192133656 193283844 193885078 194216537 194936562 195663681 196319485
3482.3 196319485 196706753 197717381 198975754 199602070 200181732 200877838 201905556 202750473 203164444
3491 203164444 203562489 204738941 205999985 206314754 206763096 207325268 208034916 209248772 210522079
3499.7 210522079 211193733 211886559 213218861 213707485 214032421 215030708 216194210 217275639 218607235
3508.4 218607235 219711342 219910679 220921879 222032986 222777596 223876362 225190716 226346111 227159538
3517.1 227159538 228037071 228675613 229678154 231060543 232690563 233781605 233949795 235002518 236032658
3525.7 236032658 237303638 238518028 239399929 240482235 241340981 242693634 244240932 245531254 246315079
3534.4 246315079 247398643 247976379 248790150 250989857 252650738 254424572 255385323 256215286 257614117
3543.1 257614117 259381046 261559505 262112999 263197021 264290295 266115017 267955303 269304237
3550.8 269304237 270995407 270849323 272814198 275150833 276867905 278555965 279307957 281410198 283296852
3559.5 283296852 284949799 286196156 288479080 290296249 290890312 294024067 294995422 296372337 298479080
3568.2 298479080 299259739 301813641 303827896 305953407 307923737 310436802 311877365 312806683 314910049
3576.9 314910049 316530170 318933487 320501900 322128143 324286156 326722374 329127617 330726128
3584.6 330726128 333971214 335146294 335536270 338426247 340563431 343650856 345976791 348719215
3592.3 348719215 350719452 352439766 355471535 355742340 358366737 362056427 363889694 367416458
3600 367416458 369621010 370933800 373627815 375652008 378232689 382069702 385135651 385703735 389236679
3608.7 389236679 391011086 391395760 397774658 400958672 400337791 403353119 404507828 408846321 413007660
3617.4 413007660 414523773 416278572 416856995 419944382 423943405 427650108 430889091 434464836
3625.1 434464836 437666092 440622826 447042274 449424782 443203583 447786331 453962746 459286613
3632.8 459286613 461113319 462163429 466773758 470964088 473222771 474691391 477874336 481742783
3640.5 481742783 485226021 487973785 490061531 493490067 497463837 502625313 503596916 502250328
3648.2 502250328 508609009 511200104 510828514 511696930 517235832 522602539 527040634 533113022 528281593
3656.9 528281593 530174141 536128922 538098183 540224113 541621857 545043983 548084335 550764771
3664.6 550764771 552738876 553577652 558226280 560613327 562245560 563775978 559040604 563597260
3672.3 563597260 571580162 579740028 577947540 562824135 567153587 574881630 579823456 579002991
3680 579002991 580652084 583532486 584874344 586652641 588596649 590008202 593629494 599308548 591128540
3688.7 591128540 588777695 596986122 592210503 591813126 597252655 598580093 599567223 600223160 600980988
3697.4 600980988 602469063 602997398 605685730 609255447 605578995 603387413 607783089 610603256
3705.1 610603256 611514626 611581078 613450661 616535606 609912987 613354454 618551941 607746429 611624146
3713.8 611624146 615816612 616384201 617571793 620003586 622185211 619563980 620222015 625272827 622628708
3722.5 622628708 619278870 623717117 624687080 623592720 621401787 622105255 625548286 626679611 631742249
3731.2 631742249 628327675 621507416 631087646 632748299 623398094 623246994 626361732 627321625 629049606
3739.8 629049606 632350655 629122849 631425781 642061768 631806602 618582344 628420753 633470268
3747.5 633470268 638875771 635617828 625364037 635242310 630325508 624970856 631862640 636579590
3755.3 636579590 639602814 634368324 635636330 639965019 633258438 632809029 637114944 638275604
3763 638275604 637734337 640480804 638125381 634336395 638339958 643357391 643504486 634579163 636634064
3771.7 636634064 640390778 640535126 641025696 640301361 641306152 642116852 644717178 644611740 637378883
3780.3 637378883 640127945 642769547 643484192 644614792 641437836 640729828 642252655 643047638 643726654
3789 643726654 643917694 644145966 643935699 644187775 644038086 645100250 648257523 644424973 640653763
3797.7 640653763 643702087 647437515 652511978 646988983 637278366 640674591 643568497 648269119
3805.4 648269119 653104172 644049377 640253830 645069199 646661377 646483078 647158966 647112274 648220139
3814.1 648220139 653011169 651845474 639636536 643228760 648349838 652568512 654332428 638205299
3821.8 638205299 639729767 645444870 647787399 650378647 650210037 646169357 646032410 648141098 651236649
3830.5 651236649 651512680 643186951 646475296 653854828 648330917 648429108 655954056 646353989 641458588
3839.2 641458588 648082047 644177094 645696259 652725372 649270706 645430908 648299866 649579697
3846.9 649579697 649802628 651228638 650578079 652180328 656246490 650438538 652271118 639427261
3854.6 639427261 640153122 650674133 649899902 647537155 648991013 650452881 652459488 647828217
3862.3 647828217 648461227 654438553 649166641 644391861 647960663 651885605 656156998 649665909
3870 649665909 641977844 645771408 651268387 653880081 644461899 645196152 649747849 650334091 652988358
3878.7 652988358 656047440 649784317 644264832 649395599 649855347 651061783 656187744 644619446
3886.4 644619446 645554276 649902878 650228882 652950134 651554260 645100098 646555405 650479202 649926834
3895.1 649926834 650528412 651122589 652734451 654392090 645959244 650329971 652088547 647177124 650832291
3903.8 650832291 647295380 646071091 646964722 648261108 650156479 649780426 649834747 649523468 650320282
3912.5 650320282 650630493 649852982 650528412 652051697 649010544 645598297 649054184 648448105 645568390
3921.1 645568390 648388977 650492172 651319199 649634171 647255783 648229904 649710007 650230255 648928452
3929.8 648928452 649132614 650930862 648318939 646842422 648752747 648688812 648248138 648490143 648076782
3938.5 648076782 648198929 648950958 650208588 650378723 646935196 646357193 647800446 648565521 649243927
3947.2 649243927 647143784 647375717 648013458 646513062 647770462 647905197 648243637 648944244 648990479
3955.8 648990479 649142685 647850266 647838364 647996216 648728561 649003906 647425156 647525787 648015137
3964.5 648015137 648173065 648147812 648436584 648426056 647724686 647769852 648517609 648686981 647690430 647548904
3974.2 647548904 647451782 647559052 648128662 648219604 648384247 648011780 647882309 647656937 647590408 647867737
3983.8 647867737 647693481 647449341 647492981 647901993 647784882 648114471 648320618 648267899 648628082 648487473
3993.5 648487473 648206711 647666779 647925720 648410797 648177032 647693710 648042526
4000.2 648042526
##END=$$ End of the data block
