##TITLE=$$ Begin of the data block
##JCAMP-DX=5.00 $$ ACD/SpecManager v 10.08
##SPECTROMETER/DATA SYSTEM=Varian
##DATE=15 Jan 2013 11:10:20
##DATA TYPE=INFRARED SPECTRUM
##DATA CLASS=XYDATA
##ORIGIN=
##OWNER=
##NPOINTS=3735
##FIRSTX=399.26403809
##LASTX=4000.35498047
##MAXX=4000.35498047
##MINX=399.26403809
##MAXY=70.98093414
##MINY=16.50793648
##XFACTOR=1.0000000000
##YFACTOR=0.000000100000000
##FIRSTY=37.37497330
##DELTAX=0.96440572
##XUNITS=1/CM
##YUNITS=TRANSMITTANCE
##XYDATA=(X++(Y..Y))
399.3C73749733m64630n80254k743225l499336L079948l721542K112884j723747n2070
407.9C66157761J333465k053947N132179o581039q213158k58942O698990L934021j107216
416.6C65042114L410759J248932m147720m219856P187995K335701r030799k070771
424.3C59756355j772613J445236J602592j211738m711380k633858Q97598L00026L068657
433C56740875L032570P4883m053765K077790L140449j385231j086769k220726K228775
441.7C58548851j28365j255226L127365K171021J928558j709556l277321j729965O38122
450.4C58313484j886101k091751K421265J975632l206559l721962L075333j500854
458.1C53378487n70336Q51746O26755J935997m031639L77845J875725k738533k667618
$$ plain form
399.3 373749733 373285103 372704849 369961624 366462288 369542236 365820694 367933578 366209831 366157761
407.9 366157761 367491226 365437279 370569458 363988419 355775261 355516319 362215309 366149330 365042114
416.6 365042114 368452873 369701805 365554085 361334229 368522224 370857925 361827126 359756355
424.3 359756355 357983742 359428978 361031570 359819832 355108452 352474594 353372192 353672218 356740875
433 356740875 359773445 359848328 355794563 357872353 361012802 359627571 358540802 356320076 358548851
441.7 358548851 358420486 357165260 360292625 362463646 364392204 362682648 359405327 357675362 358313484
450.4 358313484 356427383 354335632 356756897 358732529 355525970 351804008 354879341 353378487
458.1 353378487 352808151 353659897 354286652 356222649 352191010 352568855 354444580 351706047 349038429
466.8C49038429J15547K180024K00081K54821k498665j595382J900291J99433k071801
475.5C47722778j775016K413215K86598j361160j908417L1624K247963K81258m12598
484.1C47526245l549423o304321j619416L833161M31900P81364M6311j734887J144448
492.8C40555382j051254K51350L65410j534615k228164J083107J449317l169555L537864
501.5C39258842L826104k842331k501755r90944R51500l759270j638603R34448R78737
510.2C34216728J4343k005081j95198j319160j460114k49519M24004j03798j605378
518.9C27716827j392517J91117q4992j721153J82800n03273k604942k372685R83143
527.5C20394325L353310R57947o09017r88807k48223r06944q31184J152801l47633
$$ plain form
466.8 349038429 349153976 351334000 351534081 351788902 349290237 347694855 349595146 349794579 347722778
475.5 347722778 345947762 348360977 348647575 347286415 345377998 345409622 347657585 347938843 347526245
484.1 347526245 343976822 337672501 336053085 339886246 340318146 341099510 341145821 339410934 340555382
492.8 340555382 339504128 339755478 340120888 338586273 336358109 337441216 338890533 335720978 339258842
501.5 339258842 343084946 340242615 337740860 336749916 337701416 333942146 332303543 333237991 334216728
510.2 334216728 334231071 332225990 332030792 330711632 329251518 329001999 329426003 329322205 327716827
518.9 327716827 326324310 326515427 326430435 324709282 324892082 324388809 321783867 319411182 320394325
527.5 320394325 323747635 324705582 324096565 323107758 322859535 321952591 321121407 322274208 321926575
536.2C21926575j026688j210117j76811J09634q49094q70572m59251R96838l48721
544.9C18091793o79283m12483j166268o82621k50568k53468q70266j37424j318436
553.6C12320976j765079M59900J556606J97906j651516k60467K78969j68457j322842
562.3C09645996r20887J406136O22825M47464Q67520M40063n2681j179924j447372
570.9C09829140J44329M56772r38034J13315k85454o77948K57569o0730l00846m32320
580.6C08105793N90763n11322o90784O09169N84850O21757R6970L97720J26248J197529
590.2C11128693J936302j156349j329117P00798J850662J266918L48416Q2130j022301
598.9C13806152n62935j07574K80437P47872j570149j989097r346O05240L40080m85611
$$ plain form
536.2 321926575 320899887 319689770 319512959 319622593 318773499 317902927 317443676 318440514 318091793
544.9 318091793 317412510 317000027 315833759 315151138 314900570 314647102 313776836 313639412 312320976
553.6 312320976 310555897 311015797 312572403 312770309 311118793 310858326 311137295 310968838 309645996
562.3 309645996 308725109 310131245 310754070 311201534 312069054 312509117 312456436 311276512 309829140
570.9 309829140 309973469 310430241 309492207 309605522 309320068 308642120 308899689 308838959 308538113 308105793
580.6 308105793 308696556 308185234 307494450 308103619 308688469 309310226 309407196 309804916 309931164 311128693
590.2 311128693 313064995 311908646 310579529 311280327 313130989 314397907 314746323 314828453 313806152
598.9 313806152 313243217 313135643 313416080 314163952 312593803 310604706 310595360 311200600 311540680 311055069
608.5C11055069q68130j716938j621094M7207k84500q62541m53930N43652M63543m42925
618.2C05859413J99127M96598N9261p72762K07405J799431J517353Q32672R16481J125145
627.8C12240124K92072J108875J756687J491395J740894J117000R36127P14035J426392
636.5C22823601K260895K072944K274285K315788J367874l75328k18887J579475J346970
645.2C35447617K21252P38258J516037J405449R45969P69920J190377P48710J75934
653.9C43159523M03023k48680j105500J05324M08707j023369O50024J670075j99318
662.5C43819809n69382k51808K03247k24724k622070k904968L935547J507454J74293
671.2C43067398J950188K712402J065674P87887l03764K60964J726684J725197J163635
$$ plain form
608.5 311055069 310186939 308470001 306848907 306896114 306611614 305749073 305295143 305838795 306302338 305859413
618.2 305859413 306058540 306555138 306614399 305841637 306049042 307848473 309365826 310198498 311114979 312240124
627.8 312240124 312532196 313641071 315397758 316889153 318630047 319747047 320683174 321397209 322823601
636.5 322823601 325084496 327157440 329431725 331747513 333115387 332740059 332521172 334100647 335447617
645.2 335447617 335668869 336407127 337923164 339328613 340274582 341044502 342234879 342983589 343159523
653.9 343159523 343562546 343313866 342208366 342313690 342722397 341699028 342349052 344019127 343819809
662.5 343819809 343250427 342998619 343201866 342977142 340355072 337450104 341385651 342893105 343067398
671.2 343067398 345017586 347729988 348795662 349583549 349279785 349540749 351267433 352992630 354156265
679.9C54156265M7341K346344L538475J249466P18727L03001j73187N25665J491280
688.6C64203377J747360O64635k88620J184921K576370J348152J71280p93800j51939
697.3C70661736J190681O17790K88697O41593J189118J159859J968536K201538J027527
705.9C80947075P26967j22452J049423J859894J76811N837P85217J250229J216621
714.6C87895622J515694J023636r7046l16925P35092J352577N98030J079903M36592
723.3C94223175P3433J046677J550941J936569J263504J225472M36325j06201Q11538
732D02461433J171952R45663P65228J432038R41696P00340K75040m57420j90163K87971
741.6D08333778J732712J145592J36490Q8386M16603J206475P06138J333237J563416
$$ plain form
679.9 354156265 354203606 356549950 360088425 361337891 362056618 362359619 362186432 362712097 364203377
688.6 364203377 365950737 366615372 366326752 367511673 370088043 371436195 371607475 370813675 370661736
697.3 370661736 371852417 372470207 372758904 373400497 374589615 375749474 377718010 379919548 380947075
705.9 380947075 381674042 381551590 382601013 384460907 384637718 384643555 385428772 386679001 387895622
714.6 387895622 389411316 390434952 390337906 390020981 390756073 392108650 392706680 393786583 394223175
723.3 394223175 394296608 395343285 396894226 398830795 400094299 401319771 401756096 401649895 402461433
732 402461433 403633385 404579048 405344276 406776314 407718010 408418350 408693390 408235970 408045807 408333778
741.6 408333778 410066490 411212082 411348572 411436958 411853561 413060036 413766174 415099411 416662827
750.3D16662827M87442K85530O54144P55844P2403K66037J643219K171402J431961
759D24430809J087456J380615K059517K019920J017723K99607K63405Q79440O44760
767.7D34083252M50134K05460L32260K35558l81585p9002j91574N15861p9689p23571
777.3D34367104l07808j24245N04532L68690J275177K5292m24309N48630j74980J244239
787D37302322R76906k71263l02963N42030K08435m93850K45208j68190M35982q21304
796.6D37653313j097641l91426j282120p72247k105675k236519j305084j053696j751976
805.3D25656929l243103k737770k114334j737900j905975k323685j770477p97348j060257
814D07966080j402703j663780k433014j229744m08935n09377n69076N68847J932068
$$ plain form
750.3 416662827 417150269 417435799 418089943 418845787 418918190 419184227 420827446 422998848 424430809
759 424430809 425518265 426898880 428958397 430978317 431996040 432295647 432559052 433438492 434083252
767.7 434083252 434533386 434738846 435071106 435306664 434925079 434846077 434654503 435170364 435090675 434367104
777.3 434367104 434059296 433935051 434439583 434808273 436083450 436108742 435684433 436233063 436058083 437302322
787 437302322 438279228 438007965 437705002 438247032 438455467 437961617 438206825 438038635 438474617 437653313
796.6 437653313 436555672 436164246 434882126 434109879 432004204 429767685 428462601 427408905 425656929
805.3 425656929 422413826 419676056 417561722 415823822 413917847 411594162 409823685 409026337 407966080
814 407966080 406563377 404899597 402466583 401236839 400827904 400318527 399749451 400318298 402250366
822.6D02250366J233826J856346K790566K815780K491837L020439L455849K302246
830.4D22217255K996025L355598L533440L717155L495941K647171J815453K739258
838.1D46517296J689491K005158K769928K820816K142601J067352J854057J448822
845.8D62315521K624550J718979N31807J180801R81865K076683K142449K351989J043549
854.5D76968193J502571K932511K353820K059021J205559J696282L89671O09665J786995
863.1D91504288J281433K95524n51414O35757m38232o52885p18499p66868n82466j990891
872.8D88015747j736526j485482j175041j323700o18477j406784k149086o60743q82798
881.5D76577110o61049o41937j86043j031913j756173j349601r25446J72005j511193
$$ plain form
822.6 402250366 403484192 405340538 408131104 410946884 413438721 416459160 419915009 422217255
830.4 422217255 425213280 428568878 432102318 435819473 439315414 441962585 443778038 446517296
838.1 446517296 448206787 450211945 452981873 455802689 457945290 459012642 460866699 462315521
845.8 462315521 464940071 466659050 467190857 468371658 469353523 471430206 473572655 475924644 476968193
854.5 476968193 478470764 481403275 483757095 485816116 487021675 488717957 489107628 489717293 491504288
863.1 491504288 492785721 493081245 492529831 493165588 492727356 492074471 491355972 490589104 490006638 488015747
872.8 488015747 486279221 484793739 483618698 482294998 481676521 480269737 478120651 477459908 476577110
881.5 476577110 475916061 475274124 475088081 474056168 472299995 470950394 470024948 470196953 468685760
890.2D68685760r74998K86484K42271j01089r28612l50761o96335j05439l80592q85620
899.8D64791069j201591j071091L64876n1804O69708J501236K715645K933998J439743
908.5D72091789J003647M28314N81131J31378L64266k58484j120758j619873k739601
917.2D68861809k447014k921143k873611k487755k125359l328933l959542k940826
924.9D45777626l674545l563957l791123l324203k909546l322449k838821k628403
932.6D19724579j739273j336785j461792j760826j121063p49321j375580j162147j591988
941.3D07425804j146431q28857p27272o07643r90563n58777j187782j017761r1057
949.9D00269661j95580r00497j222382o93130r18236j408348j676292k017327l192978
$$ plain form
890.2 468685760 467710762 467997246 468239517 468138428 467209816 466859055 466162720 466057281 465676689 464791069
899.8 464791069 463589478 462518387 462883263 462831459 463501167 465002403 467718048 470652046 472091789
908.5 472091789 473095436 473523750 474104881 474236259 474600525 474342041 473221283 471601410 468861809
917.2 468861809 466414795 463493652 460620041 458132286 456006927 452677994 448718452 445777626
924.9 445777626 442103081 438539124 434748001 431423798 428514252 425191803 422352982 419724579
932.6 419724579 417985306 416648521 415186729 413425903 412304840 411555519 410179939 409017792 407425804
941.3 407425804 406279373 405450516 404723244 404115601 403125038 402566261 401378479 400360718 400269661
949.9 400269661 400074081 399173584 397951202 397258072 396339836 394931488 393255196 391237869 388044891
958.6C88044891l312835k526398k777252k514992k013931j989861k052231j886024
966.3C68971367k221069k461701k443390k700882k785225k910957k571526k989616
974.1C47887001l310089l199921l659820l466111l679313m864617n444145m890423
981.8C15372562n349235o069718n319595m764805n090084n148735n179272m827957
989.5B73623161m058609m436550m450683m149342l716259l511410l259887l013478
997.2B43026943l216209k930184l128013k036762k182312k873917k461681j998578
1004.9B22199287j219444k198639j489925j510220j773300j340656k066689j609535
1012.6B08990879k151775j876469k037964k016849j866932k388211j955890k100067
$$ plain form
958.6 388044891 384732056 382205658 379428406 376913414 374899483 372909622 370857391 368971367
966.3 368971367 366750298 364288597 361845207 359144325 356359100 353448143 350876617 347887001
974.1 347887001 344576912 341376991 337717171 334251060 330571747 325707130 320262985 315372562
981.8 315372562 310023327 303953609 298634014 293869209 288779125 283630390 278451118 273623161
989.5 273623161 269564552 265128002 260677319 256527977 252811718 249300308 246040421 243026943
997.2 243026943 239810734 236880550 233752537 231715775 229533463 226659546 224197865 222199287
1004.9 222199287 220979843 218781204 217291279 215781059 214007759 212667103 210600414 208990879
1012.6 208990879 206839104 204962635 202924671 200907822 199040890 196652679 194696789 192596722
1020.3A92596722j238995j737614j516380j785355k275104j388378j887131j331425
1028.1A79436340j940612j496888j356373j186580l00026l62797O63262K51235J040097
1036.7A74747658R46045J007576J151523J044789J770286J091137J243343j50280O45485
1045.4A83497562L09792r30367K72713j46942p305j714325j438065p55329q11195n54657
1055.1A77721882r09062K6360p08675M20036L15113J549988K515583R74521J637440
1063.7A83543186J120854J970787J880073K241135J772461J725387K032452L35884
1071.5A96622219J523533L33271Q08640N30204l76816J061860M10003J163159J71604
1080.1B02247677P52811J376000J072006J331005R15508J469002O58112J335201R10664
$$ plain form
1020.3 192596722 191357727 189620113 188103733 186318378 184043274 182654896 180767765 179436340
1028.1 179436340 177495728 175998840 174642467 173455887 173155861 172793064 173456326 173707561 174747658
1036.7 174747658 175693703 176701279 177852802 178897591 180667877 181759014 183002357 182852077 183497562
1045.4 183497562 183807354 182876987 183149700 183002758 182995453 181281128 179843063 179087734 178276539 177721882
1055.1 177721882 176812820 176839180 176130505 176550541 176865654 178415642 180931225 181905746 183543186
1063.7 183543186 184664040 186634827 188514900 190756035 192528496 194253883 196286335 196622219
1071.5 196622219 198145752 198479023 199287663 199817867 199441051 200502911 200912914 202076073 202247677
1080.1 202247677 203000488 204376488 205448494 206779499 207695007 209164009 209822121 211157322 212067986
1088.8B12067986J186771J634426J328259K166690J443558J665135K15568N81589J809673
1097.5B24099655J314163J172638R80053J990929J421356J722527J434459J295529
1105.2B35431309J429901O92692J637039R91154R40952O10962O66942J190148O32782
1113.9B44223881J135387J347447J295757r804m4060L91465J75113m08077q89301P89413
1123.5B48007221N58090N61009J326256J542473J223316J027450J858845J761704K433967
1132.2B60300331K107048K076569K189846K146911K399254J782017K659149K139244
1139.9B77800369J728287J871071J498680J237068J96362M92477P46155Q89892P20025
1148.6B87180386J20792j70460m20913N1040p0133p4234j89037m72279o44035p54185
$$ plain form
1088.8 212067986 213254757 214889183 216217442 218384132 219827690 221492825 221708393 222289982 224099655
1097.5 224099655 225413818 226586456 227566509 229557438 230978794 232701321 234135780 235431309
1105.2 235431309 236861210 237553902 239190941 240182095 241123047 241734009 242400951 243591099 244223881
1113.9 244223881 245359268 246706715 248002472 247992668 247948608 248340073 248515186 248107109 247217808 248007221
1123.5 248007221 248565311 249126320 250452576 251995049 253218365 254245815 256104660 257866364 260300331
1132.2 260300331 262407379 264483948 266673794 268820705 271219959 273001976 275661125 277800369
1139.9 277800369 279528656 281399727 282898407 284135475 284331837 284824314 285570469 286460361 287180386
1148.6 287180386 287301178 287130718 286709805 286760845 286690712 286616478 286427441 285955162 285311127 284556942
1158.3B84556942o86512r53217n69725m90131l2253K70900R12228J850700J790391
1166.9B86649323K356262K319221K588024K795945L269367L273067K570324K951527
1174.6C08773060K900162L227233L357602L304329L336181L015976K570191K488060
1182.4C32972794K731132K232285J804466J520691J347084J244469J065712O86264
1190.1C45604897L51066J8616m83818m31290m03480q79975j259994j164475r10988
1198.8C40440559r09462j343231j622124j624984j090241o28166j329994j563873j007309
1207.4C29321175n87082o09131p37343m55284m70543o73904n84183k57569l35578n39628
1217.1C24070930k37960o76346r59778m89655n4969j31188j095276j174011p63817
$$ plain form
1158.3 284556942 283870430 282917213 282347488 281857357 281825104 282096004 283008232 284858932 286649323
1166.9 286649323 289005585 291324806 293912830 296708775 299978142 303251209 305821533 308773060
1174.6 308773060 311673222 314900455 318258057 321562386 324898567 327914543 330484734 332972794
1182.4 332972794 335703926 337936211 339740677 341261368 342608452 343852921 344918633 345604897
1190.1 345604897 345955963 345974579 345490761 345059471 344655991 343776016 342516022 341351547 340440559
1198.8 340440559 339531097 338187866 336565742 334940758 333850517 333222351 331892357 330328484 329321175
1207.4 329321175 328734093 328124962 327387619 326932335 326461792 325787888 325203705 324946136 324610558 324070930
1217.1 324070930 323832970 323156624 322196846 321707191 321652222 321521034 320425758 319251747 318487930
1225.8C18487930o48918o29196r31721r07669q98609n02663n27744q98971r39904j299457
1235.4C10303078l67070K89422m41170j018524l08915N35622m38175p35798n33352
1244.1C07285118k26746j74236p10010l96653m55970k49310l08704l77751q6612k57416
1253.7C04041710m1523o1646K5769l63236n43880k05231J72539M91447J71566N69821
1263.4C04257336N92727M28162L65734M65488N31865N45787J322060J194115J067009
1272C10770283N70965P02018J726971J539955J143246J019783J255607J141606J309032
1280.7C21179466J617699J751785J858902J538963J664773J884689J886787J308022
1288.4C34691086R65385J063843J320267J189918J047821J266899J159440J442565
$$ plain form
1225.8 318487930 317839012 317209816 316278095 315370426 314471817 313969154 313441410 312542439 311602535 310303078
1235.4 310303078 309936008 310225430 309784260 308765736 308456821 308992443 308554268 307818470 307285118
1244.1 307285118 307058372 306884136 306174126 305777473 305321503 305072193 304763489 304385738 304299126 304041710
1253.7 304041710 304000187 303938541 303964310 303601074 303057194 302851963 303024502 303515949 303687515 304257336
1263.4 304257336 304850063 305278225 305643959 306109447 306641312 307187099 308509159 309703274 310770283
1272 310770283 311341248 312043266 313770237 315310192 316453438 317473221 318728828 319870434 321179466
1280.7 321179466 322797165 324548950 326407852 327946815 329611588 331496277 333383064 334691086
1288.4 334691086 335656471 336720314 338040581 339230499 340278320 341545219 342704659 344147224
1296.2C44147224R11713O08711O05011L33367L86696K2773K33918M16793L58734n226
1305.8C48019714o0882N2643o58799p80563m76227l79028p06673o55212l34320j68877
1315.4C43851776M4823K17209O06155O14166Q59642O90384O31409P83081O03867J131973
1325.1C50034485Q50410N79262K67754j14136j58730l18565m98199q89283l80363l47290
1334.7C49025345m31938j44120J9951L77426J62583P73468P67822M99230L64418M22096
1344.4C51836281Q61053N85480P26128M73785L95966L11050K54974p5759o65780l44200
1354C54358978r32502o86913o5842j7395l3951k16674q18711j091880l45650j210480
1363.7C48938980j43089j11275p33070k89955j046181p92656m53339r2239k97546p53174
$$ plain form
1296.2 344147224 345058937 345667648 346272659 346606026 346992722 347015495 347249413 347666206 348024940 348019714
1305.8 348019714 347958832 348011475 347352676 346572113 346095886 345716858 345010185 344354973 344020653 343851776
1315.4 343851776 343896599 344113808 344719963 345334129 346193771 346884155 347515564 348298645 348902512 350034485
1325.1 350034485 350884895 351464157 351731911 351617775 351459045 351140480 350642281 349752998 349372635 349025345
1334.7 349025345 348593407 348449287 348469238 348846664 349009247 349782715 350550537 351049767 351414185 351836281
1344.4 351836281 352697334 353282814 354008942 354482727 354878693 355189743 355444717 355368958 354703178 354358978
1354 354358978 353426476 352739563 352673721 352656326 352622375 352405701 351586990 350495110 350149460 348938980
1363.7 348938980 348795891 348684616 347951546 347661591 346615410 345822754 345369415 345277176 344979630 344226456
1373.3C44226456o6605l357L85895J01776o4506o49148m58412m31289j301003j097298
1382.9C40642509j648025j276588r84192j488037k107392j562843r13277j661529k063866
1391.6C26936760k140427j683654k919732l621215j638947j772461j662731l229809
1399.3C08267784k726135j519795k140598k174625k287712k522412k364998j761589
1407.1B90769920j734466k128678j686477j487637j277847j364822j118870j238747
1414.8B78732376j528854m46720r15089p59659j204586M54884J544246L39413P30896
1423.4B76946907q9340N07393R11827M74071J250973O59790J448631J177235J824284
1432.1B85111771K039318J593876J980018J285610J525689J647110L241844K272472
$$ plain form
1373.3 344226456 344159851 344156494 344542389 344644165 344579659 343930511 343472099 343040810 341739807 340642509
1382.9 340642509 338994484 337717896 336733704 335245667 333138275 331575432 330662155 329000626 326936760
1391.6 326936760 324796333 323112679 320192947 316571732 314932785 313160324 311497593 308267784
1399.3 308267784 305541649 304021854 301881256 299706631 297418919 294896507 292531509 290769920
1407.1 290769920 289035454 286906776 285220299 283732662 282454815 281089993 279971123 278732376
1414.8 278732376 277203522 276756802 275841713 275082054 273877468 274332352 275876598 276216011 276946907
1423.4 276946907 276857567 277364960 278276787 278750858 280001831 280661621 282110252 283287487 285111771
1432.1 285111771 287151089 288744965 290724983 292010593 293536282 295183392 298425236 300697708
1439.8C00697708J653519J810417J432304K657032J369896K005234J870556J085701
1447.6C14582367J094379J345501K496090J623936J927261J311608J978912K081947
1455.3C28442001R20678J693992M61235L840866J817436K518960K321090K249375K950248
1464C47215881J330414L110390K003403K563247K688294K742996L333702K087135K965165
1472.6C70040627K353057M231720L398095L070602L586235K664871K662621J967582
1480.3C93975410J904984J832619J812896J690522J133346J616478J098976M76151
1488.1D05541382J301422m83513o75659L3226m42810j137543j069221j200486m994812
1496.7C96871986K46392j245690l312187q15353k093392j523895j012688o4163q42743
$$ plain form
1439.8 300697708 302351227 304161644 305593948 308250980 309620876 311626110 313496666 314582367
1447.6 314582367 315676746 317022247 319518337 321142273 323069534 324381142 326360054 328442001
1455.3 328442001 329362679 331056671 331517906 335358772 337176208 339695168 342016258 344265633 347215881
1464 347215881 348546295 351656685 353660088 356223335 358911629 361654625 364988327 367075462 370040627
1472.6 370040627 372393684 376625404 380023499 383094101 386680336 389345207 392007828 393975410
1480.3 393975410 395880394 397713013 399525909 401216431 402349777 403966255 405065231 405541382
1488.1 405541382 406842804 406359291 405683632 405716858 405274048 404136505 403067284 401866798 396871986
1496.7 396871986 397118378 395872688 392560501 391745148 389651756 388127861 387115173 387051010 386208267
1505.4C86208267l848991k698479L36533J205940m72374N22232j581039j574211l28980
1514.1C77768898j390762n27687j684456j41259O83327Q50907j277314k368278J740761
1522.8C73654137R44214J599350m7303R39369J648102J003304J007347P99408R01985
1531.5C82449913N34668P64198o28357J412773J293870P66983J481170j942901q40455
1540.1C85291862Q12645J447411M79240J241494J466331q20694J334343J43929L85704
1548.8C91782265J59263k72407O11648k26287N09758k958947j80168J019287O50711
1557.5C91095123n000686j2348442P521591l13759L12920j436882j628762m008751
1565.2C74192352l775863j492234l327942j919822q415413k202110k275086m046020
$$ plain form
1505.4 386208267 382359276 379660797 379997330 381203270 380730896 381253128 379672089 378097878 377768898
1514.1 377768898 376378136 375850449 374165993 374024734 374708061 375558968 374281654 371913376 373654137
1522.8 373654137 374598351 376197701 376150398 377089767 378737869 379741173 380748520 381547928 382449913
1531.5 382449913 382984581 383748779 383120422 384533195 385827065 386594048 388075218 386132317 385291862
1540.1 385291862 386104507 387551918 388031158 389272652 390738983 389918289 391252632 391396561 391782265
1548.8 391782265 391941528 391669121 392280769 392054482 392564240 389605293 389425125 390444412 391095123
1557.5 391095123 386094437 373745995 381267586 380953827 381266747 379829865 378201103 374192352
1565.2 374192352 370416489 368924255 365596313 363676491 355261078 353058968 350783882 346737862
1572.9C46737862l225060m140129k642784j2898140j806374l514785m282761l981762
1580.6C10246067n756397l580780o255894m088478n497494m558162m856091n801125
1588.4B69851646l695278o066875k593441n358525l633174m324780m888744k539025
1596.1B36751804n100975j877174m672813k434006l406944k863255j874390m309692
1603.8B10212555r38969l657379p99160k641697j431560j254902k887364J76201k686653
1612.5A94091072K93522j963444L05100l41225m661045K389240j209583J381721j497821
1621.1A88787537Q92944n78709j433372J838951p00588K262115j182861J949367M54979
1629.8A92290363Q30136J502838J09844K543507r92585K673531m45557K912655J789894
$$ plain form
1572.9 346737862 343512802 339372673 336729889 323831749 322025375 318510590 314227829 310246067
1580.6 310246067 304489670 300908890 294652996 290564518 285067024 280508862 275652771 269851646
1588.4 269851646 266156368 260089493 257496052 252137527 248504353 244179573 239290829 236751804
1596.1 236751804 231650829 229773655 225100842 222666836 219259892 216396637 214522247 210212555
1603.8 210212555 209273586 205616207 204817047 202175350 200743790 199488888 196601524 196777725 194091072
1612.5 194091072 194384594 192421150 192726250 192385025 187723980 190113220 188903637 190285358 188787537
1621.1 188787537 189680481 189101772 187668400 189507351 188806763 191068878 189886017 191835384 192290363
1629.8 192290363 193120499 194623337 194733181 197276688 196284103 198957634 198512077 201424732 203214626
1638.5B03214626R16424K860279M59519K929458N73292K329178J456566l73669L997154
1647.2B18362827j80988M169254N00412K795944J719666l197155K643490J604824N011387
1655.9B33429661Q19206K611961J583672K207413K432384J829109L989468P72018L803616
1664.5B53478508K288017L378697L537216L408050M368363J097565N408992L184681
1672.3B80150089M723835L698769L519592M503098L797817N656567L160762M776993
1680C13987522M190540N290642O134186L328209P086487K868805O078758M199409N079308
1688.6C58243866N602798N017052N975571M826660N784111N377121N598259L026390
1696.4C99451828O117439O642571N384407O003837J751671O963463N641594M888382
$$ plain form
1638.5 203214626 204131050 206991329 207450848 210380306 210953598 213282776 214739342 214365673 218362827
1647.2 218362827 218181839 222351093 222851505 225647449 227367115 224169960 226813450 228418274 233429661
1655.9 233429661 234248867 236860828 238444500 240651913 243084297 244913406 248902874 249674892 253478508
1664.5 253478508 255766525 259145222 262682438 266090488 270458851 271556416 276965408 280150089
1672.3 280150089 284873924 288572693 292092285 296595383 300393200 306049767 309210529 313987522
1680 313987522 318178062 323468704 329602890 332931099 340017586 342886391 348965149 353164558 358243866
1688.6 358243866 363846664 368863716 374839287 379665947 385450058 390827179 396425438 399451828
1696.4 399451828 405569267 412211838 417596245 423600082 425351753 432315216 437956810 442845192
1704.1D42845192L967209L801613M449958M219208M596825K913322K575646L287658
1711.8D72656631L184205K968025J706810K293243L500977K080078j756210M093017
1719.5D90726776L780098K258492J823654J342239J619301K137947K097359J876373
1727.2E07662239J986809K336731P68852P25403L317261L052101j403198k302781M996643
1735.9E21140060M872628K604026K688523J022262K86866M415321L345032K063179
1743.6E42437897K468452L797379L619461L086738L806954K988968N112762J975212
1751.3E69293823J757164N368424L905067M080887L494682J314278K708130L948669
1759E95871124L508568L268051K12174J148452L948975K515984K459221K636833K366562
$$ plain form
1704.1 442845192 446812401 450614014 455063972 459283180 463880005 466793327 469368973 472656631
1711.8 472656631 475840836 478808861 480515671 482808914 486309891 488389969 486633759 490726776
1719.5 490726776 494506874 496765366 498589020 499931259 501550560 503688507 505785866 507662239
1727.2 507662239 509649048 511985779 512754631 513480034 516797295 519849396 518446198 516143417 521140060
1735.9 521140060 526012688 528616714 531305237 532327499 532614365 537029686 540374718 542437897
1743.6 542437897 544906349 548703728 552323189 555409927 559216881 562205849 567318611 569293823
1751.3 569293823 571050987 576419411 580324478 584405365 587900047 589214325 591922455 595871124
1759 595871124 599379692 602647743 602859917 604008369 607957344 610473328 612932549 615569382 617935944
1767.7F17935944o15616K314987M032555m80271j260719M43497M866256L065529N2071
1776.4F30354233K389641J286430J851425M80614k45819J735229K012596J691132l00751
1785.1F41254730J043396K035752J611480J271210J940384P93152J48315j484604m17404
1793.8F48196411M075470J428833K89612J489639J975632J439209p00684J970139O0959
1802.4F60225220P83539J654586P48215J480942O42776Q20084J056671J495972o32706
1811.1F68275299N66788J502533N00717J348724J61515J019439J80283O84357J377105
1819.8F75616760N44052J586914p7972J093140R27353k207108K56653K099304K281418
1828.5F82120514J60675k292023J106034K568588K44217J37024N45501N64804L89710
$$ plain form
1767.7 617935944 617320328 619635315 623667870 623187599 621926880 622370377 627236633 630302162 630354233
1776.4 630354233 632743874 634030304 635881729 636362343 636116524 637851753 639864349 641555481 641254730
1785.1 641254730 642298126 644333878 645945358 647216568 649156952 649950104 650098419 648613815 648196411
1793.8 648196411 652271881 653700714 653990326 655479965 657455597 658894806 658194122 660164261 660225220
1802.4 660225220 661008759 662663345 663411560 664892502 665535278 666355362 667412033 668908005 668275299
1811.1 668275299 668842087 670344620 670845337 672194061 672355576 673375015 673555298 674239655 675616760
1819.8 675616760 676160812 677747726 677669754 678762894 679690247 677483139 677739792 679839096 682120514
1828.5 682120514 682281189 679989166 681095200 683663788 683908005 684045029 684590530 685155334 685545044
1837.2F85545044m08859J551742M35028Q95844R40018J249160O11649n513535K335053
1845.8F87641144K257690L02277J24817O62536J488572M72946J113891j03607J86920
1854.5F94147186l3264k26669M76379q9340R69086o1646K27738K60772R04770R19800
1864.2F97494812J07574R92508n81665J06964j343841q06809J460267J169967J186066
1872.8F99785843j20087P45468L70331J60217r0866j07116M76226R8954Q62045j86691
1882.5G01994324K80838j44654J18638J001052j48086P39059q76159j733780N09948
1891.2G01741180J462555R41468M65011M4327n10254J296616Q2702r5977L9596k22854
1900.8G05244370J44653l28827R14459P1411K95105N88379o2561j95846k44904l815
$$ plain form
1837.2 685545044 685136185 686687927 687122955 688018799 688958817 690207977 690819626 685306091 687641144
1845.8 687641144 689898834 690201111 690325928 690988464 692477036 692949982 694063873 693960266 694147186
1854.5 694147186 694113922 693887253 694363632 694274292 695243378 695181732 695409470 695670242 696575012 697494812
1864.2 697494812 697602386 698594894 698013229 698120193 696776352 695969543 697429810 698599777 699785843
1872.8 699785843 699665756 700411224 700781555 700941772 700850906 700743790 701220016 701318970 702181015 701994324
1882.5 701994324 702275162 702130508 702249146 703250198 703102112 703841171 702965012 701231232 701741180
1891.2 701741180 703203735 704145203 704610214 704654541 704144287 705440903 705523605 705427628 705467224 705244370
1900.8 705244370 705389023 705060196 705974655 706046066 706341171 706929550 706866989 706671143 706426239 706422424
1910.4G06422424k81295J142730n5313j05667K88315L95355J315308j824646j10855
1919.1G07186356P33337J6785J64337q21076N3711K88239N22690K82364N98449R3460
1928.8G09118652J15509l0899o56356L98101l76587J61515N722J33362M10690j04599
1938.4G09175110L73840m51050P11441o24923j752167M56696L29208K07901M4556Q29544
1948.1G09300156J35421l7460n03769n88302M12521J17416J26114p78580K53525L91770
1957.7G08828812j75095J62888k38266p2022k14310L64914k25448K87552K53448p32345
1967.3G08240128p3700j32294M71268m43573R3994L02200l42255K50016j63880k6245
1977G08175659n28564K17209J8539j18637K10571o5994P23495m30984k76337k91977
$$ plain form
1910.4 706422424 706141129 707283859 707228546 707122879 707411194 707806549 709121857 707297211 707186356
1919.1 707186356 707919693 707936478 708100815 707279739 707333450 707621689 708144379 708426743 709025192 709118652
1928.8 709118652 709234161 709203262 708546906 708945007 708568420 708729935 708735657 708869019 709279709 709175110
1938.4 709175110 709548950 709097900 709809341 709184418 707432251 707888947 708218155 708426056 708470612 709300156
1948.1 709300156 709435577 709398117 708894348 708306046 708718567 708835983 708962097 708183517 708437042 708828812
1957.7 708828812 708653717 708816605 708578339 708506317 708292007 708656921 708431473 708719025 708972473 708240128
1967.3 708240128 708166428 708034134 708505402 708061829 708155823 708458023 708115768 708365784 708201904 708175659
1977 708175659 707647095 707864304 707882843 707764206 707974777 707908783 708632278 708201294 707924957 707632980
1986.6G07632980q6746l6697n28565N16587l58200l72544j56097L39432J11694k54746
1996.3G06807098J77308n11323K73362r7885j76850l00674j5946M37851n35812J26419
2005.9G06183548j13678j19858l44925n9585N0049m43726J38779n52750K518J2207
2015.6G04752579q1558l10746k33917L33862n65033P2251l67127j95083r6741k32391
2025.2G03076096K35214n23529j13526l56140J17340j2664k05613k41394r60006j83106
2034.9G00832672j48697M30985J6250L1205J01394n61752o4850l35083Q2016m78058
2044.5F99906082k34527j4725k06299K05688j67388M42428j93329l49426n15442l16086
2054.1F98556976P9499l64228J91193j87759K59857j33972n6382L16773j08948R0332
$$ plain form
1986.6 707632980 707546234 707509537 706980972 707497559 707139359 706766815 706610718 706950150 707061844 706807098
1996.3 706807098 706984406 706473083 706746445 706648560 706471710 706171036 706155090 706592941 706057129 706183548
2005.9 706183548 706069870 705950012 705605087 705545502 705595551 705151825 705290604 704737854 704740372 704752579
2015.6 704752579 704671021 704360275 704126358 704460220 703895187 703967438 703600311 703405228 703308487 703076096
2025.2 703076096 703311310 702787781 702674255 702318115 702435455 702422791 702217178 701975784 701015778 700832672
2034.9 700832672 700683975 701114960 701131210 701162415 701263809 700702057 700637207 700302124 700384140 699906082
2044.5 699906082 699671555 699656830 699450531 699656219 699488831 699931259 699737930 699388504 698873062 698556976
2054.1 698556976 698636475 698272247 698463440 698275681 698535538 698401566 698345184 698661957 698553009 698643341
2063.8F98643341o05698L2883l54996j24282J38549k55508J95770j57394L90167l32718
2073.4F97570114k40478j14365m30222m0512k90832J93100o3172K32010r9106j602
2083.1F96714935q4228m86679Q9035p89337j25428J0453M6081k74658l48358O22940
2092.7F95374756k54975Q0719k67028k35520l95126n29404J22223m21066O1493k58255
2102.4F93277817K30026J18561q621J27945o27060k60239r11179j34048o7749l46832
2112F91398621j99662j62201M87519k14615L05939l02735l21121k33994n09262K83661
2121.6F90532150l71551K25448J04905K36663o7672m51279J48926l67050J49993m05960
2131.3F89734573m70199j97678K40326M21372k0218L40118m08554Q7814l12118n23377
$$ plain form
2063.8 698643341 698037643 698070526 697715530 697591248 697729797 697474289 697670059 697512665 697902832 697570114
2073.4 697570114 697329636 697215271 696785049 696744537 696453705 696646805 696583633 696815643 696716537 696714935
2083.1 696714935 696630707 696144028 696233063 695443726 695318298 695328751 695374832 695100174 694751816 695374756
2092.7 695374756 695119781 695200500 694933472 694697952 694302826 693773422 693895645 693474579 693536072 693277817
2102.4 693277817 693507843 693626404 693617783 693745728 693118668 692858429 691947250 691813202 691745453 691398621
2112 691398621 691198959 691036758 691524277 691309662 691615601 691312866 690991745 690757751 690248489 690532150
2121.6 690532150 690160599 690386047 690490952 690727615 690659943 690208664 690357590 689990540 690140533 689734573
2131.3 689734573 689264374 689066696 689307022 689728394 689708176 690048294 689639740 689727554 689415436 688892059
2140.9F88892059k33307j58233N26123j39618O09131L36609J62506K44903l44314j76163
2150.6F89719696l18069M0054n78537J03531K37274R8724N22385n6305K46582l34930
2160.2F89680405l0289l64685l63617K58789M9133K74659k17362N93414J88599N3253
2169.9F90122299L26843k8305m0359p84531N4398j66931J19400K98462O7443O52085
2179.5F90620804j39160p6447j62735J83106j53199j31683O9885m35486O27518M55094
2189.1F90857697M05654L7766k3422k16446m29611K72064m92707N3483J37634M23202
2198.8F91025314P86209K37961k05154n64194L42713j82801N1346j85471l54080M73099
2208.4F91424942j8082K57874j30997L61557K26517j11466J11390m60740j2512L2883
$$ plain form
2140.9 688892059 688658752 688500519 689026642 688887024 689496155 689832764 689995270 690240173 689895859 689719696
2150.6 689719696 689401627 689441681 688863144 688966675 689203949 689302673 689825058 689768753 690015335 689680405
2160.2 689680405 689650116 689285431 688921814 689180603 689229736 689504395 689287033 689880447 690069046 690122299
2169.9 690122299 690449142 690420837 690380478 689595947 689650345 689483414 689602814 689901276 689968719 690620804
2179.5 690620804 690481644 690405197 690242462 690425568 690272369 690140686 690210571 689775085 690402603 690857697
2189.1 690857697 691263351 691301117 691277695 691061249 690631638 690903702 690410995 690464478 690602112 691025314
2198.8 691025314 691811523 692049484 691844330 691280136 691622849 691440048 691491394 691305923 690951843 691424942
2208.4 691424942 691406860 691664734 691533737 691895294 692121811 692010345 692121735 691660995 691648483 691681366
2218.1F91681366K22397k57034K92282O49109O9274N5008o33316P5455L3417j12534
2227.7F92075424m28390k15836O91300J83334L75748j08872j23138k58179k15454l1586
2237.4F91944351j41907L98407k15835J31607N569J30997k2125k65350L70864l09143
2247F92027435J51215k11868J43814L25546m86755j71738k0371N98145k21100j76239
2256.7F91958084p5226j3122J05056l46069L18222l52478K01340o4468l93296M6005
2266.3F91384048l29055M11529o8970J26572R0561J2741j62124k60773M04663m45938
2275.9F91163254m03595k77329L76206P0648k28882P5836l02124J59760o85578R9106
2285.6F90047302K24762j00860j6327n38788L00064n23224M2877k01416j70288M30908
$$ plain form
2218.1 691681366 691903763 691646729 691939011 692588120 692657394 692712402 692079086 692154541 692187958 692075424
2227.7 692075424 691647034 691431198 692122498 692305832 692681580 692572708 692449570 692191391 691975937 691944351
2237.4 691944351 691802444 692200851 691985016 692116623 692122192 692253189 692231064 691965714 692336578 692027435
2247 692027435 692178650 691966782 692110596 692436142 691949387 691777649 691757278 692355423 692134323 691958084
2256.7 691958084 691882858 691869736 691974792 691628723 691946945 691594467 691795807 691731339 691338043 691384048
2266.3 691384048 691054993 691466522 691397552 691524124 691614685 691627426 691465302 691204529 691609192 691163254
2275.9 691163254 690759659 690482330 690858536 690929184 690700302 690776138 690474014 690633774 689948196 690047302
2285.6 690047302 690272064 690171204 690154877 689616089 689916153 689392929 689435806 689234390 689064102 689495010
2295.2F89495010p49817Q5145j14441q2703m62875k15531K53601k28882L10746m23050
2304.9F87867203M9362l97949j72959K82364l34320j5640p61948K74201j71738l02505
2314.5F86316071p5760q78067m04206o32553k48260q39539l75824l26996Q0185M02375
2324.2F83017426k49482N71061l69568K99224j019821q61435L8758m31290J514359
2332.8F82509232p07474j514435j009827N24750Q13599p69882m94385m85459O85959
2341.5F79552078m41437q71810m38996P34406J12381p90177J104279J053161N90287
2350.2F80604172j101990p22580l29590j193619L86887j95236j97601r93653J93558
2358.9F76450348k230454j467590J818008j32522J941299l21731l85742j86997M7150
$$ plain form
2295.2 689495010 688745193 688830338 688715897 688633194 688170319 687954788 688208389 687979507 688290253 687867203
2304.9 687867203 687916565 687518616 687345657 687628021 687293701 687278061 686516113 686790314 686618576 686316071
2314.5 686316071 686240311 685362244 684958038 684325485 684077225 683237686 682861862 682534866 682615051 683017426
2324.2 683017426 682767944 683339005 682969437 683268661 682248840 681387405 681426163 680994873 682509232
2332.8 682509232 681801758 680287323 679277496 679802246 680615845 679845963 679351578 678866119 679552078
2341.5 679552078 679110641 678238831 677799835 678534241 678646622 677856445 678960724 680013885 680604172
2350.2 680604172 679502182 678779602 678450012 677256393 677643280 677448044 677250443 676256790 676450348
2358.9 676450348 674219894 672752304 674570312 674437790 676379089 676057358 675671616 675484619 675531769
2367.6F75531769J411590M19999J18560j677704j00555m16870k76108N01480m11606
2376.2F75100555L02582p1640J35193k03018P8583Q6059k33459q9417p88345j92261
2385.9F74124832l22494R7808K91749k40555l28522p70798j14975l35769k63749j72576
2395.5F71964951k70997m07638p00684P477k10495K7313q4076j45568l43018r17587
2405.2F68919678k98462k30560k89917o70014j58386J88598j53656m61730o50101r8419
2414.8F66097031n68467j82800l27225o02340j80970l62548l12043q10699l43704l51944
2424.5F62054291r0714n1269o22940q3008l41034k45056o45294m26407k56729n98832
2434.1F58693008o3858k15149k88391p77664l95965m95987o01731j20086n39017k29645
$$ plain form
2367.6 675531769 676943359 677363358 677481918 675804214 675703659 675286789 675010681 675512161 675100555
2376.2 675100555 675403137 675331497 675466690 675263672 675342255 675428314 675194855 675105438 674317093 674124832
2385.9 674124832 673802338 673900146 674191895 673951340 673622818 672852020 672737045 672401276 672137527 671964951
2395.5 671964951 671693954 671286316 670585632 670593109 670382614 670409927 670325851 670180283 669837265 668919678
2405.2 668919678 668621216 668390656 668100739 667430725 667272339 667460937 667307281 666845551 666195450 666097031
2414.8 666097031 665528564 665345764 665018539 664416199 664235229 663872681 663560638 662749939 662406235 662054291
2424.5 662054291 661963577 661912308 661289368 661206360 660865326 660620270 659974976 659548569 659291840 658693008
2434.1 658693008 658629150 658414001 658125610 657347946 656951981 656455994 655854263 655734177 655195160 654965515
2443.7F54965515m41055Q0414J33133m45404o08979o85196k73132o24084l39814o12487
2453.4F51148911m24271k07596o63452l18375n39932l33252l85895k27890p05337p15714
2463F46627197m6539p65228m65699m65316l22266k31934m86526n24368n48020k20794
2472.7F42550507p37610o47660o06002q9341j08108q01163m65584m04930j55678p92617
2482.3F37741814m66996j71432o84815o92253o05545N5847p11021o47697m71230p75795
2492F32570877p05643n51719N645q79287n81055m79965n26352k16293n76287l50723
2501.6F27709198p34100l92342p03125n30052n26505r68818j19210o49337m14696l77121
2511.2F22293892o07758o94122o88362k5025m16221m86756p14225m60854n90591m58107
$$ plain form
2443.7 654965515 654524460 654604874 654738007 654292603 653683624 652998428 652725296 652101212 651761398 651148911
2453.4 651148911 650724640 650517044 649853592 649535217 648995285 648662033 648276138 648048248 647342911 646627197
2463 646627197 646580658 645815430 645349731 644884415 644562149 644330215 643843689 643319321 642771301 642550507
2472.7 642550507 641812897 641165237 640559235 640469894 640361786 639560623 639095039 638690109 638534431 637741814
2482.3 637741814 637274818 637103386 636418571 635726318 635120773 635176620 634465599 633817902 633346672 632570877
2492 632570877 631865234 631313515 631319160 630439873 629858818 629378853 628852501 628636208 628059921 627709198
2501.6 627709198 626975098 626582756 625879631 625349579 624823074 623854256 623735046 623085709 622671013 622293892
2511.2 622293892 621686134 620992012 620303650 620278625 619862404 619375648 618661423 618200569 617609978 617151871
2520.9F17151871J2932m89541k08320n91545l27454l39394p08045p14875q36296l02696
2530.5F12646637o91605l17764k12593m26712m64325n20630l5248o06537p73925n81131
2540.2F08016167k39945n58815o12907m09355p19185l4828l06969l98522o74362n37910
2549.8F03523369j57433q68950o07032o58455k99340k50663k69165j99776n70984m32701
2559.5E99208870q66661o94122q81272p47566r6207K22512K02713j79215k12097j000023
2569.1E94956932l89442n00756j130600o03294p99637j55983r7427K1705j08261o55327
2578.7E90537910n54771m07371m77639j191826n38406m25758n42717k68135k64817
2587.4E85866470j07536p69768l15971l81661p64656o47430n86548l31230n32646l45917
$$ plain form
2520.9 617151871 617164803 616675262 616466942 615875397 615547943 615208549 614500504 613785629 612949333 612646637
2530.5 612646637 611955032 611637268 611424675 610997963 610533638 610013008 609977760 609371223 608597298 608016167
2540.2 608016167 607776222 607217407 606604500 606195145 605475960 605441132 605134163 604735641 604061279 603523369
2549.8 603523369 603365936 602496986 601889954 601231499 600932159 600681496 600412331 600212555 599641571 599208870
2559.5 599208870 598342209 597648087 596766815 596019249 595923042 596145554 596348267 596169052 595956955 594956932
2569.1 594956932 594567490 594066734 592936134 592332840 591533203 591377220 591279793 591301498 591193237 590537910
2578.7 590537910 589983139 589575768 589098129 587906303 587367897 586942139 586399422 586131287 585866470
2587.4 585866470 585758934 584989166 584673195 584291534 583526878 582879448 582292900 581961670 581429024 581083107
2597.1E81083107n01709r6893m59824q81309l16468o58607o23360p34329l05863k18200
2606.7E76286545o13823m72832l54652k75879p73964p03049r21783q12035n41534n43976
2616.4E70273018l89557p08351k09732l35007m45518n04418p53708n61371p91320m65393
2626E65108643o90155r29833n49850j54915l28484n46570l23410o82106n92880p89680
2635.6E59520760q72498r28307p33299k2011j99051l49159p27653n32608o65665p98492
2645.3E53692017m53225n58586l73153q83866n48515l39317l01590R346o05317q58535
2654.9E48779259j009903m83856n19524n77965k60696k59323j63460k63825j7891q95538
2664.6E44327278o23207k60620r19190l27301m13475n05714p38373m76265j0414k07367
$$ plain form
2597.1 581083107 580581398 580484505 580024681 579143372 578826904 578168297 577544937 576810608 576504745 576286545
2606.7 576286545 575672722 575199890 574845238 574569359 573795395 573092346 572170563 571358528 570816994 570273018
2616.4 570273018 569883461 569175110 568965378 568630371 568184853 567680435 566926727 566365356 565574036 565108643
2626 565108643 564418488 563488655 562938805 562783890 562455406 561908836 561585426 560903320 560310440 559520760
2635.6 559520760 558648262 557719955 556986656 556964645 556765594 556416435 555688782 555156174 554490509 553692017
2645.3 553692017 553238792 552680206 552307053 551423187 550874672 550535355 550233765 550243111 549637794 548779259
2654.9 548779259 547769356 547285500 546765976 546188011 545927315 545667992 545504532 545240707 545222816 544327278
2664.6 544327278 543704071 543443451 542524261 542196960 541783485 541277771 540539398 540063133 540052719 539845352
2674.2E39845352j97639l51563k99606o36597o54793j005630j063919m08898j07765
2682.9E35118942J71891m36860n22842m05388l03879l12309o49147l39470n01289p51229
2692.5E31068420n75714m8446j71585l13302k92930m36974k29454q18100q38432n34134
2702.2E26809349k66228k69661l15590j67160m83970k2011l09525l18450n65491j101380
2711.8E22989883m37202k85225j65367n57671j06048j93215m88357o3210q21457j41792
2721.5E19730339j23939p15638l99055l7499o9084n31235j32064m86069m09317n8785
2731.1E16767654r5939l48206p55462k26670k70691r1324k49137m72603k00806q1215
2740.8E13975601k92854o33812K09427j54991m06456k47078m42658J6098q6899K2774
$$ plain form
2674.2 539845352 539647713 539296150 538996544 538359947 537705154 536699524 535635605 535226707 535118942
2682.9 535118942 535290833 534853973 534331131 533925743 533621864 533309555 532660408 532320938 531819649 531068420
2692.5 531068420 530492706 530444260 530272675 529959373 529666443 529229469 529000015 528181915 527343483 526809349
2702.2 526809349 526543121 526273460 525957870 525790710 525306740 525284729 524975204 524656754 524091263 522989883
2711.8 522989883 522552681 522267456 522102089 521544418 521438370 521245155 520756798 520693588 519872131 519730339
2721.5 519730339 519606400 518890762 518491707 518454208 518385124 517853889 517721825 517235756 516826439 516767654
2731.1 516767654 516671715 516323509 515568047 515341377 515070686 514979362 514730225 514257622 514056816 513975601
2740.8 513975601 513682747 513048935 513258362 513103371 512696915 512449837 512007179 512023277 511936378 511959152
2750.4E11959152n55343o65894m03748n25398j58767n4703p4959n28069k35328k13471
2760E08543472l55568k15492m71496m35524o87142l88145l57933k45667j13449l22762
2769.7E04950294n60531q14171m4708j81198j83068j44081m14047o30684r17816j77231
2779.3E00882759q11081q29887k20261k90642j95312p36275p25784n84793k95906n29824
2789D95662994o20155n40504p90863n32685p07206l04146n16320o70623n69649q54187
2798.6D89556656n11437q87870p21856n75599q79936j104737q36944k62261n19447
2807.3D83256569m76761q97789j033134p99637q82416r02481p88651n13305r62868
2816D75999527q46481p51801q06312r61686j265411p95784o73637o20881j162300j261329
$$ plain form
2750.4 511959152 511403809 510737915 510334167 509808769 509650002 509595299 509520340 508992271 508756943 508543472
2760 508543472 508187904 507972412 507500916 507065392 506378250 505990105 505632172 505386505 505273056 504950294
2769.7 504950294 504389763 503575592 503530884 503349686 503166618 503022537 502608490 501977806 501059990 500882759
2779.3 500882759 500071678 499241791 499021530 498730888 498535576 497799301 497073517 496488724 496192818 495662994
2789 495662994 495042839 494502335 493711472 493178787 492471581 492167435 491651115 490980492 490410843 489556656
2798.6 489556656 489045219 488157349 487435493 486859894 485979958 484875221 484038277 483776016 483256569
2807.3 483256569 482779808 481882019 480848885 480049248 479166832 478264351 477475700 476962395 475999527
2816 475999527 475153046 474401245 473594933 472633247 471367836 470572052 469898415 469277534 468115234 466853905
2825.6D66853905p43790q83217j017723j063003j011353j115456r23385j206818j128349
2834.3D57760811j027336j611939j257133j120873j096420j589890j964263j851426
2842D46241531j918220j957817k394333j985474k118416k450294k688789k775650j620369
2850.7D26332169j437569j329575r75723p71408m98543m31022l93067k65236j64032
2859.4D20065994p89909m22287J25236k69165j083030j461907q06083p53861r86175
2868.1D13618813j279030r37424o89278o85196m77409j116371p88002o44493j029892
2876.7D05971718q34351m43878o43349j348457q56934o98700j019325j107902p71218
2885.4C98247604p92389j289863q94356j074829j164474j264458j368180r86747p70035
$$ plain form
2825.6 466853905 466110115 465226898 464209175 463146172 462134819 461019363 460095978 458889160 457760811
2834.3 457760811 456733475 455121536 453864403 452743530 451647110 450057220 448092957 446241531
2842 446241531 444323311 442365494 439971161 437985687 435867271 433416977 430728188 427952538 426332169
2850.7 426332169 424894600 423565025 422589302 421817894 421319351 420888329 420495262 420230026 420065994
2859.4 420065994 419276085 418853798 418979034 418709869 417626839 416164932 415358849 414604988 413618813
2868.1 413618813 412339783 411402359 410713081 410027885 409550476 408434105 407646103 407001610 405971718
2876.7 405971718 405137367 404693489 404050140 402701683 401844749 401146049 400126724 399018822 398247604
2885.4 398247604 397455215 396165352 395270996 394196167 393031693 391767235 390399055 389412308 388642273
2894.1C88642273q32558j469536j012497p18116r25255j049156j232033q29048o76460
2902.8C79897614k68212p56798j384239j217384j094322n02777q80509j882706j561355
2911.4C70349312q22945j280060j404991j557045j772346j209641j434631j289520
2919.2C59578133j219864j360321j290093q07838j78108o84014l59382L5209N2986
2927.8C53766708O8474J50566K50016R2506M24004N72J02005N49431J057243J054878
2937.5C57516403k4986L67699O67114P40738J188850J362343P09686N36042J269989
2946.2C64333878N89027P83691R32808O29578N53360N9013M89655K33002L73497O55670
2955.8C69633179M92859R05418R94606R85794O98242M54865M36210O18935L08685M43383
$$ plain form
2894.1 388642273 387809715 386340179 385327682 384609566 383684311 382635155 381403122 380574074 379897614
2902.8 379897614 379629402 378872604 377488365 376270981 375176659 374673882 373793373 371910667 370349312
2911.4 370349312 369526367 368246307 366841316 365284271 363511925 362302284 360867653 359578133
2919.2 359578133 358358269 356997948 355707855 354900017 354721909 354037895 353678513 353713722 353766708
2927.8 353766708 353835182 353985748 354235764 354328270 354752274 354752846 354854851 355404282 356461525 357516403
2937.5 357516403 357491417 357859116 358526230 359266968 360455818 361818161 362527847 363063889 364333878
2946.2 364333878 364922905 365706596 366639404 367268982 367822342 367881355 368371010 368604012 368977509 369633179
2955.8 369633179 370126038 371031456 372026062 373011856 373710098 374164963 374601173 375220108 375528793 375972176
2965.5C75972176R43832Q63342J009903M36554N47981J162415J093140O38466N90362
2974.1C83258171R11942J27296M75884J114959N20020p0572J64871P22427J07003o4316
2983.8C87267685K55432M45786L92074K10457J94092J81236K71149j88713N2299P3815
2993.4C89155312k48375k20948l69300k0981k88582m31023m04701l76663m82064q06121
3003.1C85506554k76986k49366m91753p65800p01256l10211k95906n46494q06007m80919
3012.7C80581856r37767j171570q14781m80309k26211o47316o09513o88285o44265
3021.4C74361839o31981j026039j002350r10453n40772m40445q87604j119842r19037
3030.1C66883316j064224p00417n42297j102791o61430j102333j356926q36640r03625
$$ plain form
2965.5 375972176 376916008 377779350 378789253 379225807 379773788 380936203 382029343 382667809 383258171
2974.1 383258171 384170113 384297409 384773293 385888252 386408272 386337700 386502571 387224998 387332001 387267685
2983.8 387267685 387523117 387968903 388360977 388571434 388765526 388946762 389217911 389029198 389081497 389155312
2993.4 389155312 388906937 388685989 388316689 388295708 388007126 387576103 387171402 386794739 386312675 385506554
3003.1 385506554 385229568 384980202 384488449 383722649 383021393 382711182 382415276 381868782 381062775 380581856
3012.7 380581856 379644089 378472519 377657738 377177429 376951218 376303902 375694389 375006104 374361839
3021.4 374361839 373729858 372703819 371701469 370791016 370250244 369809799 368922195 367802353 366883316
3030.1 366883316 365819092 365118675 364576378 363473587 362812157 361709824 360352898 359516258 358612633
3038.7C58612633o48537n79643o05622p52601q21152j057625j262092q51708q17337
3047.4C51216316j166687j180877q47397q18367n49698q27141j046524m69360p97005
3056.1C43513260r87320j080437j254806j143112p76291k19956l35541q80012j255035
3064.8C35580750o29654n44663j226845j268043q43697m86984j001434q57544j62659
3073.5C28559227m64211q23440m19350o35071r46655o33049r62982n77393q16993j160851
3083.1C21119232n49774p35817n62210p07684r34619j004544o70662m09431q99887
3091.8C14644604o24295q01029q07190q72059q19263l92571o69879m15974p88403j027374
3101.4C07426567p06596n14050o09875j046161q86688o97270l52821r31797j227761
$$ plain form
3038.7 358612633 357964096 357384453 356778831 356026230 355205078 354147453 352885361 352033653 351216316
3047.4 351216316 350049629 348868752 348021355 347202988 346653290 345826149 344779625 344310265 343513260
3056.1 343513260 342525940 341445503 340190697 339047585 338271294 338051338 337715797 336835785 335580750
3064.8 335580750 334951096 334406433 333179588 331911545 331067848 330580864 329579430 328721886 328559227
3073.5 328559227 328095016 327271576 326852226 326217155 325270500 324637451 323674469 323097076 322280083 321119232
3083.1 321119232 320569458 319833641 319271431 318563747 317629128 316624584 315953922 315544491 314644604
3091.8 314644604 314020309 313219280 312412090 311540031 310720768 310328197 309658318 309242344 308453941 307426567
3101.4 307426567 306719971 306205921 305596046 304549885 303663197 302965927 302613106 301681309 300453548
3110.1C00453548n69229n11455p20482r00517m81071q76198q78696n63164j038075
3118.8B93914661o47811o90308q96988j129704j158199p47833q59375q28972o31180
3127.5B86324291l41949l84083p95002r66949o47469q63075j301327q38413m92344
3136.1B79693680l36895n96485p95575p03125r74941j467533j228371n04379o91986
3144.8B72394390o39171r01604q12531l49292r69277o20346m54788o91319m92897r55524
3154.5B65507641j588020j099625k56710o62441q13313o33125o01006r70535r84345
3163.1B57898521l53164r59416j004886p42054j020775q05035l61042k89306q04654
3171.8B51558189q14361r50756r98783p46422n93891m86718q09955r45130j072921
$$ plain form
3110.1 300453548 299884319 299372864 298652382 297751865 297270794 296394596 295515900 294952736 293914661
3118.8 293914661 293266850 292576542 291679554 290549850 289391651 288643818 287784443 286955471 286324291
3127.5 286324291 285982342 285598259 284803257 283836308 283188839 282325764 281024437 280186024 279693680
3136.1 279693680 279356785 278760300 277964725 277261600 276286659 274819126 273590755 273086376 272394390
3144.8 272394390 271755219 270853615 270041084 269691792 268722515 268102169 267647381 266956062 266463165 265507641
3154.5 265507641 263919621 262819996 262563286 261900845 261087532 260454407 259853401 258882866 257898521
3163.1 257898521 257545357 256585941 255581055 254839001 253818226 253013191 252652149 252362843 251558189
3171.8 251558189 250743828 249793072 248794289 248047867 247453976 246967258 246157303 245212173 244139252
3180.5B44139252p74136m48570m59366p06558j020184o28776l82252n85175j273784
3189.2B37860451j026249j77231k11220n13935r44958j221485Tk52972j31683p95402
3198.8B31363831m15001k62814n40047j133022q54835p36466o94904k81983p80353
3207.5B25664406m21562l61710o89869n69706m48551l11451n54104n18875n90973n17197
3217.2B20680408q00895q53005m72984k72331q6003r38301o61373k81162q00629p88593
3226.8B14725132q23364m74396l79734l2711l9845o26926p20062p03907o30417r15528
3236.4B09378242p21702l89843k44198k15282m57154m49123m46816j46427m21219n99746
3246.1B05286732l28102o45428o21815l80764m34685m79164o2427j07022n61142p37991
$$ plain form
3180.5 244139252 243365116 242916546 242457180 241750622 240730438 240101662 239719410 239134235 237860451
3189.2 237860451 236834202 236656971 236445751 235931816 234986858 233765373 232543888 232290916 232159233 231363831
3198.8 231363831 230948830 230686016 230145969 229012947 228158112 227421646 226726742 226444759 225664406
3207.5 225664406 225242844 224881134 224191265 223621559 223173008 222861557 222307453 221788578 221197605 220680408
3217.2 220680408 219879513 219026508 218553524 218281193 218195190 217256889 216595516 216314354 215513725 214725132
3226.8 214725132 213901768 213427372 213047638 213014927 212975082 212348156 211628094 210924187 210293770 209378242
3236.4 209378242 208656540 208266697 208022499 207807217 207350063 206900940 206454124 206307697 205886478 205286732
3246.1 205286732 204958630 204313202 203691387 203310623 202875938 202396774 202334347 202227325 201666183 200928192
3255.7B00928192q62522o71005m26808r8285m68521n67780N0888j38798l00216n34497
3265.4A96910648o61163l29838j10149l23639o67915j71185J43318k18391o42204q11291
3275A93118191o96812l97034J25752k32315m41609L75538J01567n60131p52240q37116
3284.7A89803791j32027O3839l5534l90186q12263J55162K6284n48992l65200k18316
3294.3A87546558L3570p39632o80084K9354j17855k48909m44031j81732P0705k3307
3303.9A85244637l0041j16368n69763p07321m49848o49643m03595Q7605J11579j40724
3313.6A82376518j65329k86579q31737m88949L7575j39180m97284o03313o07052n25112
3323.2A78269558O2866K74067k01530j088314j390305o68030M540J42555k37637n20534
$$ plain form
3255.7 200928192 200065670 199394665 198967857 198869572 198401051 197833271 197884159 197745361 197445145 196910648
3265.4 196910648 196249485 195919647 195809498 195485859 194817944 194646759 194790077 194571686 193929482 193118191
3275 193118191 192421379 192024345 192150097 191917782 191476173 191851711 191953278 191393147 190640907 189803791
3284.7 189803791 189671764 189735603 189700069 189309883 188497620 188652782 188679066 188130074 187764874 187546558
3294.3 187546558 187580128 186840496 186160412 186189766 186071911 185823002 185378971 185197239 185267944 185244637
3303.9 185244637 185214596 185098228 184528465 183821144 183371296 182721653 182318058 182405663 182517242 182376518
3313.6 182376518 182211189 181924610 181092873 180603924 180641499 180502319 180005035 179401722 178794670 178269558
3323.2 178269558 178332424 178606491 178404961 177316647 175926342 175258312 175262852 175405407 175167770 174647236
3332.9A74647236m79221l7652k1305l54385j84269m23584q38566o51207P3719j00918
3342.5A71629848j031303p02419O7520q5487j22014K89269n66006j002121j28841k10781
3352.2A68137665l85838j3199J98899J15699K09485J03015n34019n01213q8520K6665
3361.8A67268639r4681j33648k07577k46162o371j4648j84155j17244K16121m5204
3371.4A66435070l31802j98098n5999J94530k48432m70867m4785M22688L63006j34544
3381.1A65930767j2627k9010l15972m70218k3575K71015M0455J03149j23138L08933
3390.7A65679779O59428J27544n8117j90220n32646l14350N11322N79662J47724n26447
3400.4A66083679m80270K32982J26400K69509J79863K20547J59015l83110m1981K84863
$$ plain form
3332.9 174647236 174168015 174130363 174109058 173754673 173570404 173146820 172308254 171657047 171730766 171629848
3342.5 171629848 170598545 169896126 169963646 169878159 169756145 170045414 169479408 168477287 168348446 168137665
3352.2 168137665 167751827 167738628 167937527 168053226 168262711 168365726 167831707 167330494 167241974 167268639
3361.8 167268639 167173958 167040310 166832733 166586571 166580200 166565552 166381397 166264153 166480274 166435070
3371.4 166435070 166103268 165905170 165849171 166043701 165795269 165324402 165279617 165702305 166065311 165930767
3381.1 165930767 165918140 165889130 165573158 165102940 165079365 165350380 165390835 165493984 165370846 165679779
3390.7 165679779 166339207 166466751 166408634 166218414 165685768 165371418 165882740 166462402 166610126 166083679
3400.4 166083679 165603409 165836391 165962791 166232300 166412163 166632710 166791725 166408615 166366634 166651497
3410A66651497M40006L30391L24421K17876r7808J51844M9839l9425K90756O14071
3419.7A68933468L43189J2722k9240Q1311L13453L00503O90060p324k11220O03504
3429.3A71030426K98386M58545L88165K92873J90792L65563J038112J70479l74069
3438A73859272J62010P37629O89850R8114k7370M43306P76882R24205R72844k09484
3447.6A78427258J39961P77855K41584P67193O92349M42982L71303N53970Q20561L88756
3457.3A83623772M56352L22151M22039M81873L08704O25553J151962R11541L06187
3466A88610134P84321N26504O31810O83632K77309Q37574N46684R10816Q78830K35081
3475.6A94922695N52654N33333O42605O64635Q40778R88407J026116P00531M75979
$$ plain form
3410 166651497 167091503 167421894 167746315 167964191 167866383 168018227 168068066 168028641 168319397 168933468
3419.7 168933468 169276657 169289379 169260139 169341450 169654903 169955406 170645466 170638142 170426922 171030426
3429.3 171030426 171328812 171787357 172175522 172468395 172659187 173024750 174062862 174233341 173859272
3438 173859272 174021282 174758911 175448761 175546875 175519505 175962811 176739693 177663898 178636742 178427258
3447.6 178427258 178567219 179345074 179586658 180353851 181046200 181489182 181860485 182414455 183235016 183623772
3457.3 183623772 184080124 184402275 184824314 185306187 185614891 186240444 187392406 188303947 188610134
3466 188610134 189394455 189920959 190552769 191236401 191513710 192351284 192897968 193808784 194687614 194922695
3475.6 194922695 195475349 196008682 196651287 197315922 198156700 199145107 200171223 200871754 201347733
3484.3B01347733N45864M41589R19094O62727Q00801J137714P63874P02191O23169
3493B07944756J179962J203384P57027L49827L82022J250191J359978R99279O29578
3501.6B16056004O78711O03275R40494J839371J227799M99439P38678N63736M75902
3510.3B23623409J034470Q23955J072159J106377N29671J148681J394425J378574J079884
3519B33191605N09948P52182J576786J899548O92959O01272R88522J208496J340580
3527.7B42761898J125755R19686O51111J392384J378937R41505J153832J803855J445179
3536.4B53574142L44162J215134J469116J377507J419868J750145J624737J046867
3544.1B63821678J435242J292000K221393J312180Q54530J891327J914711J549816
$$ plain form
3484.3 201347733 201893597 202335186 203254280 203917007 204717808 205855522 206619396 207321587 207944756
3493 207944756 209124718 210328102 211085129 211434956 211816978 213067169 214427147 215426426 216056004
3501.6 216056004 216734715 217337990 218278484 220117855 221345654 221845093 222583771 223147507 223623409
3510.3 223623409 224657879 225481834 226553993 227660370 228190041 229338722 230733147 232111721 233191605
3519 233191605 233701553 234453735 236030521 237930069 238623028 239224300 240212822 241421318 242761898
3527.7 242761898 243887653 244807339 245458450 246850834 248229771 249171276 250325108 252128963 253574142
3536.4 253574142 253918304 255133438 256602554 257980061 259399929 261150074 262774811 263821678
3544.1 263821678 265256920 266548920 268770313 270082493 270937023 272828350 274743061 276292877
3551.8B76292877P9136J885052K118778J512394J755352R56287J797905J484051J878300
3560.5B89760132J748390K141056K336998Q11195K666665J379261Q06427J009216J178112
3569.1C03837452L523674J950378J814881K150020K264023K121067J797867J851063
3576.9C21310425J281853K957954K173500J210937J992646K642822K451477R51080
3584.6C36972694L128624K340470N83229K644539J531677L086090K759132K372017
3592.3C55418472J836891J783448L600769J617622K372704K687797J165200L149948
3600C73632851K377319J756668K684059J989136K642555L843117L177147O62536L156281
3608.7C95921669J650810J214562O999969K759896j306687L617325J445427M214020
$$ plain form
3551.8 276292877 276372013 278257065 280375843 281888237 283643589 284599876 286397781 287881832 289760132
3560.5 289760132 291508522 293649578 295986576 296797771 299464436 300843697 301650124 302659340 303837452
3569.1 303837452 307361126 309311504 311126385 313276405 315540428 317661495 319459362 321310425
3576.9 321310425 322592278 325550232 327723732 328934669 330927315 333570137 336021614 336972694
3584.6 336972694 340101318 342441788 343025017 345669556 347201233 350287323 353046455 355418472
3592.3 355418472 357255363 359038811 362639580 364257202 366629906 369317703 370482903 373632851
3600 373632851 376010170 377766838 380450897 382440033 385082588 388925705 392102852 392765388 395921669
3608.7 395921669 397572479 398787041 405787010 408546906 407240219 410857544 412302971 416516991
3616.4D16516991M243736K452660L623847P22924K035904L293647L184739K896690
3624.1D38971138L148384L529320L685951N946732R13734n506363M241181N590324
3631.8D60520401N893326L081131R63058L378830M194641L078842J576272K848014
3639.5D85534515L542672L673820K826233J819725L328972M400101N865326R05647
3647.3E11897011r03168O913796K166519q95119J106491N785904N197258M159241N014648
3655.9E40442581n158653K792129O157303K906838L362007J294250K518044K150040
3663.6E56464539K286949K739029J429977M573441J941948l02773J531448l564834
3671.4E67099724M249344Q282051R491539N02052j7832832L670158P883835N086594
$$ plain form
3616.4 416516991 420760727 423213387 426837234 427560158 429596062 432889709 436074448 438971138
3624.1 438971138 442119522 445648842 449334793 455281525 456195259 450688896 454930077 460520401
3631.8 460520401 466413727 469494858 470457916 473836746 478031387 481110229 482686501 485534515
3639.5 485534515 489077187 492751007 495577240 497396965 500725937 505126038 510991364 511897011
3647.3 511897011 510993843 517907639 520074158 519179039 520285530 526071434 531268692 535427933 540442581
3655.9 540442581 535283928 538076057 544233360 547140198 550502205 551796455 554314499 556464539
3663.6 556464539 558751488 561490517 562920494 567493935 569435883 569133110 570664558 567099724
3671.4 567099724 571349068 579631119 589122658 589624710 571791878 575462036 583345871 588432465
3679.1E88432465m11110J047172L038559K016640J963730J220360L76510L781777O410751
3687.8F07876854o249504l233261N468979m144478J620559N413170Q12683Q51937Q51555
3696.4F09268494P68852J324806P09877K712097K669144m652672j389656N001335K159195
3705.1F18571472Q09822P84378J907921L716202n638695K810478M053688j1059990
3712.8F15955276M964104M637757J17225Q54721K382241J852264k711372R25216M763375
3721.5F33740807l163681l181496M559212Q06579j051521j863136P86934L586120J279869
3730.2F35499687N121956k834434o553002R254151J112670r639205K7084L064041J190910
3738.9F36243858J972885K679253l268623L005409J0349197j2089500j3874054J1182022
$$ plain form
3679.1 588432465 588021355 589068527 592107086 594123726 596087456 597307816 597684326 601466103 607876854
3687.8 607876854 601627350 598394089 603863068 599718590 601339149 606752319 607565002 608416939 609268494
3696.4 609268494 610037346 611362152 612072029 614784126 617453270 612800598 611410942 616412277 618571472
3705.1 618571472 619381294 620165672 622073593 625789795 620151100 622961578 627015266 615955276
3712.8 615955276 620919380 625557137 625674362 626529083 628911324 630763588 628052216 628977432 633740807
3721.5 633740807 630577126 627395630 631954842 632761421 631709900 629846764 630633698 634219818 635499687
3730.2 635499687 640621643 637787209 631234207 640488358 641601028 631961823 631988907 635052948 636243858
3738.9 636243858 638216743 640895996 637627373 640632782 650981979 638892479 625018425 636200447
3746.6F36200447O624870N532532l295441j0404968J0000839m486923o928940O478348
3754.3F39720764N039978L901673m506531J339798M812774o933136j383285L699646
3762F45691681J338425M55322L762131k232056n175705L557892N064163l15018r063186
3770.7F43083649K020111L801346Q00399R31931p40509R70611L54386K045746k62299
3779.4F53005371o807480K836685K055664P23267J635513k871399l05175J888199P44628
3788F52905273J08185n0888M44565j19705L01590J91421J244126K859878l397217m202270
3797.7F50284958J608353L715438O058197o030883j0632935L921509K672424M745255
3805.4F56342316N688247q638610m101029M241943J901322P54547P88040J9302J233902
$$ plain form
3746.6 636200447 642825317 648357849 645062408 634657440 644658279 640171356 633242416 639720764
3754.3 639720764 644760742 648662415 644155884 645495682 650308456 643375320 641992035 645691681
3762 645691681 647030106 647485428 651247559 649015503 643839798 647397690 652461853 652146835 643083649
3770.7 643083649 645103760 648905106 649705505 650637436 649896927 650867538 651221924 653267670 653005371
3779.4 653005371 646197891 649034576 651090240 651813507 653449020 650577621 650272446 652160645 652905273
3788 652905273 653013458 652962570 653407135 653287430 653589020 653780441 655024567 657884445 654487228 650284958
3797.7 650284958 651893311 655608749 661666946 655636063 645003128 648924637 651597061 656342316
3805.4 656342316 662030563 653391953 649290924 653532867 655434189 656188736 656976776 656996078 658229980
3814.1F58229980M958802k323151j3206558N156708N250625K717438l84369j6044083
3821.8F44355392L965073O597672J996307J690140r47724l216858Q74253J888962K633972
3830.5F59837189J041794p394333K713928P386398m799957m01077P016372q611984
3838.2F56788330m493637N336151n089264J643219O889878k577134k742843K706604
3845.9F58461304J194763k34528Q88672m26788J815033M828872m496383O14090j5603256
3854.6F47041779Q98513J0743485k53830j176605J610489J380386K756271m849930
3862.3F58150558l96728N136795n842361l790741M195175L810959L739700o606369
3870F58396988p162476L893280N282441K735748q485031R92202M492264j93176J812744
$$ plain form
3814.1 658229980 663188782 660865631 647659073 652815781 658066406 660783844 660399475 644355392
3821.8 644355392 648320465 654918137 656914444 658604584 657656860 654440002 655314255 657203217 659837189
3830.5 659837189 660878983 653484650 656198578 663584976 658785019 658383942 665400314 656788330
3838.2 656788330 652294693 657630844 652541580 654184799 661074677 658497543 655754700 658461304
3845.9 658461304 659656067 659421539 660310211 659883423 661698456 666527328 662030945 662645035 647041779
3854.6 647041779 647940292 658683777 658429947 657253342 658863831 660244217 663000488 658150558
3862.3 658150558 657753830 662890625 657048264 653257523 657452698 661263657 665003357 658396988
3870 658396988 651234512 655127792 660410233 663145981 654660950 655653152 660145416 659952240 661764984
3878.7F61764984L557587n433655o275940M990311L56369M44107M625168j0290375
3886.4F53738556J590042L994598Q38700L627395k439041p590637J711121L965149
3894.1F59435883p27921M30908M99192J659393K460327q086853M016190J291122n573807
3902.8F55404434L936615l468094j557007Q21229J684875K290421l52250O09284N6228
3911.5F59425735p3699k57264N9815J294861J133499l062897l086395L536300q63037
3920.2F58106918l336944K708664K000580M12597k218246j472321J665802R79767P99942
3928.8F59646759q49152n43136Q22296l151550o76728K739182M21295p2174k56653
3937.5F58080139r91287K62451J232529J415710k35367l331070l8375J577224K30866
$$ plain form
3878.7 661764984 665322571 659888916 653612976 658603287 658959656 659403763 664028931 653738556
3886.4 653738556 655328598 659323196 660161896 663789291 661350250 653759613 655470734 659435883
3894.1 659435883 658707962 659138870 659638062 661297455 663757782 655670929 659687119 660978241 655404434
3902.8 655404434 659341049 655872955 654315948 655137177 656822052 659112473 658760223 659369507 659425735
3911.5 659425735 659352036 659094772 659154587 660449448 661582947 658520050 655433655 658969955 658106918
3920.2 658106918 654769974 657478638 659479218 659891815 657673569 656201248 657867050 658846817 659646759
3928.8 659646759 658797607 658254471 659076767 655925217 655248489 657987671 658408966 658336792 658080139
3937.5 658080139 657088852 657351303 658583832 659999542 659764175 656433105 656394730 657971954 658202820
3946.2F58202820J26419j962891N04914Q30841j403885J571731k02942m83779Q07647
3954.9F57990875M0436M65927n71136p2480k54058m7226j29624j232300o637R7656
3964.5F56281433L67432L84750K25220J19781l19442j03684L71018K97470o91681q2855
3974.2F56849442K37274P2403j92261l98789L52326J36185q5068k33307Q6670K48031
3983.8F57072906O1799j88065L1204O78330k67716k74887j12533l815q9493k3575M36020
3994.4F57320175o02417M73175O89621k58941k20032N7068
4000.2F57458649
$$ plain form
3946.2 658202820 658329239 656366348 656871262 657702103 656298218 657869949 657667007 657183228 657990875
3954.9 657990875 658031311 658497238 657926102 657853622 657599564 657552338 657422714 656190414 656183777 656281433
3964.5 656281433 656648865 657033615 657258835 657378616 657059174 656955490 657326508 657623978 656932297 656849442
3974.2 656849442 657086716 657159119 656966858 656568069 656920395 657056580 656971512 656738205 656824875 657072906
3983.8 657072906 657134705 656946640 656977844 657656174 657388458 657113571 657001038 656997223 656907730 656884155 657320175
3994.4 657320175 656717758 657190933 657880554 657621613 657401581 657458649
4000.2 657458649
##END=$$ End of the data block
