##TITLE=$$ Begin of the data block
##JCAMP-DX=5.00 $$ ACD/SpecManager v 10.08
##SPECTROMETER/DATA SYSTEM=Varian
##DATE=14 Jan 2013 09:38:46
##DATA TYPE=INFRARED SPECTRUM
##DATA CLASS=XYDATA
##ORIGIN=
##OWNER=
##NPOINTS=3735
##FIRSTX=399.26403809
##LASTX=4000.35498047
##MAXX=4000.35498047
##MINX=399.26403809
##MAXY=73.15855408
##MINY=25.04372215
##XFACTOR=1.0000000000
##YFACTOR=0.000000100000000
##FIRSTY=43.17627716
##DELTAX=0.96440572
##XUNITS=1/CM
##YUNITS=TRANSMITTANCE
##XYDATA=(X++(Y..Y))
$$ plain form
399.3 431762772 434506226 436693535 433166542 429275322 430734138 429349136 434544144 447144432
407 447144432 445499725 432285728 428043900 429760513 429649315 431129761 430535393 424951553 424131508
415.7 424131508 431622276 431345787 426298065 426618462 421804581 424516907 428872490 429363022 428124542
424.3 428124542 434953613 436310806 430878220 431676331 430546799 425362854 421479950 426127052 430422440
433 430422440 428344231 424314537 422108917 423163681 420925446 423224983 425659103 424416656 424176407
441.7 424176407 420755959 420197639 423246460 430931320 435917282 430328064 425357780 424610672 426049767
450.4 426049767 427059822 428823128 430177727 431913910 428532753 422604218 421818619 421934738 425082664
459.1 425082664 424638329 422116776 420670776 422956009 427449646 429749641 429414024 422485275 420486984
$$ packed form
399.3D31762772K743454K187309l526993l891220J458816j385002N195008J2600288
407D47144432j644707j3213997m241828J716613j11198J480446n94368n583840q20045
415.7D24131508P490768k76489n047722L20397m813881K712326M355583M90532j238480
424.3D28124542O829071J357193n432586P98111j129532n183945l882904M647102M295388
433D30422440k078209m029694k205620J054764k238235K299537K434120j242447k40249
441.7D24176407l420448n58320L048821P684860M985962n589218m970284p47108J439095
450.4D26049767J010055J763306J354599J736183l381157n928535p85599J16119L147926
459.1D25082664m44335k521553j446000K285233M493637K299995l35617o928749j998291
$$ plain form
467.7 420486984 421111183 418967628 415793495 410647964 415525360 417358246 416417274 414515572 414247894
476.4 414247894 420029831 420282097 420493011 420438576 418951607 417141075 416113853 416461945 414925957
485.1 414925957 415550957 414386139 413803329 415200768 416505432 417195969 417698441 418820534 419094734
493.8 419094734 419259987 415702705 416250343 420093269 417698479 414896164 415403137 416014595 412299957
502.5 412299957 412638435 414891281 415983620 416032257 413417816 415159645 415076447 412603874 410594177
511.1 410594177 408843307 409222183 409136887 409741287 410314484 411078758 408671341 407433395 410188484
519.8 410188484 408388939 405743637 404759750 404824295 405513573 407929230 409875221 406690826 404284096
528.5 404284096 403598709 403696365 403601265 401965218 402423019 404468842 404669991 403711128 402662506 402763710
$$ packed form
467.7D20486984O24199k143555l174133n145531M877396J832886r40972j901702k67678
476.4D14247894N781937K52266K10914n4435j486969j810532j027222L48092j535988
485.1D14925957O25000j164818n82810J397439J304664O90537N02472J122093K74200
493.8D19094734J65253l557282N47638L842926k394790k802315N06973O11458l714638
502.5D12299957L38478K252846J092339M8637k614441J741829q3198k472573k009697
511.1D10594177j750870L78876q5296O04400N73197P64274k407417j237946K755089
519.8D10188484j799545k645302r83887O4545O89278K415657J945991l184395k406730
528.5D04284096o85387R7656r5100j636047M57801K045823K01149r58863j048622J01204
$$ plain form
538.1 402763710 402143974 400215912 401002502 401848412 402014771 402398453 402147141 403306694 402839012
546.8 402839012 400757446 399979324 399600601 397138710 394896240 397148857 400701981 401418190 398221092
555.5 398221092 395545998 394735336 395113106 396851997 396454659 396036720 395611839 395029144 395775948
564.2 395775948 396423721 396235504 395058479 395259552 395655785 395430298 394804459 394594040 395732994
572.9 395732994 396927338 397903442 397234383 397180557 397141685 395337868 394348297 394605980 394778900 393757973
582.5 393757973 394932251 396860352 396849022 396054497 395430756 396724510 397105026 396787033 397126579
591.2 397126579 397416649 398217392 398740768 399071350 398961716 397959747 396702003 397357101 398477173
599.9 398477173 398931732 399328423 398417778 398401070 397549515 395373383 394865761 395436783 396064949 394861069
$$ packed form
538.1D02763710o19736j928062P86590Q45910J66359L83682k51312J159553m67682
546.8D02839012k081566p78122l78723k461891k242470K252617L553124P16209l197098
555.5C98221092k675094q10662L77770J738891l97338m17939m24881n82695P46804
564.2C95775948O47773j88217j177025K01073L96233k25487o25839k10419J138954
572.9C95732994J194344R76104o69059n3826l8872j803817r89571K57683J72920j020927
582.5C93757973J174278J928101j1330p94525o23741J293754L80516l17993L39546
591.2C97126579K90070Q00743N23376L30582j09634j001969j257744O55098J120072
599.9C98477173M54559L96691r10645j6708q51555k176132n07622N71022O28166j203880
$$ plain form
609.5 394861069 393817825 394141006 394806900 394940453 393273087 392473259 392318230 391467400 391604614
618.2 391604614 391877365 391995773 392990189 394259491 395248566 395640259 395980797 396344910 396069908 396067314
627.8 396067314 397079201 398278770 399346581 400876923 401587334 402362328 404233665 405484886 406829720
636.5 406829720 407193680 406570625 406839066 407260284 408624725 411406784 414004211 415049591 415724182
645.2 415724182 416899033 417303734 417324638 417826805 417982254 418831749 421117477 422360878 422859383
653.9 422859383 423842697 424033470 422876320 421732063 421483269 421358337 421568756 421873970 421840706 422785339
663.5 422785339 423865128 423508987 422270851 419594917 415764389 420309448 423344383 424541664 424724655
672.2 424724655 424816360 425551949 425988693 426086273 426719475 427302170 428192673 429593353 431636543 432962723
$$ packed form
609.5C94861069j043244L23181O65894J33553j667366p99828j55029q50830J37214
618.2C91604614K72751J18408R94416J269302R89075L91693L40538L64113k75002k594
627.8C96067314J011887J199569J067811J530342P10411P74994J871337J251221J344834
636.5D06829720L63960o23055K68441M21218J364441K782059K597427J045380O74591
645.2D15724182J174851M04701K0904N02167J55449Q49495K285728J243401M98505
653.9D22859383R83314J90773j157150j144257k48794j24932K10419L05214l3264R44633
663.5D22785339J079789l56141j238136k675934l830528M545059L034935J197281J82991
672.2D24724655R1705P35589M36744R7580O33202N82695Q90503J400680K043190J326180
$$ plain form
681.8 432962723 433629799 435672760 436899757 436702271 436962051 437402573 438238258 439166565 439387817
690.5 439387817 440211983 442100716 443711433 444137268 443841171 444155884 444040184 443537865 444395752
699.2 444395752 445387726 446419067 447520943 448506317 449613762 449663391 449886169 450613441 451026611
707.9 451026611 451943092 453183479 454520569 455368080 455802155 456294670 456692352 457142754 457718430
716.6 457718430 458828278 459351654 459006195 459263191 460112305 461068306 462549591 464485474 465377541
725.2 465377541 465587692 465716209 465447235 465956726 467232819 467906303 468115044 469796181 471856537
733.9 471856537 473064194 474258614 474172897 473652077 474068604 474649162 474511070 474637833 475931129
742.6 475931129 476721420 477438164 479074860 480874481 481734924 481187477 480494537 481125450 482458725
$$ packed form
681.8D32962723O67076K042961J226997j97486K59780M40522Q35685R28307K21252
690.5D39387817Q24166J888733J610717M25835k96097L14713j15700n02319Q57887
699.2D44395752R91974J031341J101876R85374J107445M9629K22778P27272M13170
707.9D51026611R16481J240387J337090Q47511M34075M92515L97682M50402N75676
716.6D57718430J109848N23376l45459K56996Q49114R56001J481285J935883Q92067
725.2D65377541K10151J28517k68974N09491J276093O73484K08741J681137K060356
733.9D71856537J207657J194420q5717n20820M16527N80558j38092J26763J293296
742.6D75931129P90291P16744J636696J799621Q60443n47447o92940O30913J333275
$$ plain form
751.3 482458725 483647041 485388031 486861343 488436699 489895020 490187416 490797577 491341743 491090279
760 491090279 491248779 493374519 495610123 497474594 499320526 498943138 497927170 497217216 497944679
768.6 497944679 499221573 499439087 500227394 500690689 500903969 500960464 501486893 502068024 501760979 501302795
778.3 501302795 500639114 501223450 501903954 501890602 501747437 501824303 503152466 504899254 505934563 505776901
787.9 505776901 505843468 506074524 506208000 506445885 507083244 508303032 508467789 508536224 508524437 508397789
797.6 508397789 507835464 506552658 505695114 504909325 504627151 504033966 503483200 502648735 500582123
806.2 500582123 498267822 496483040 495325432 493550415 491868744 490471230 490298119 491105232 489915123
814.9 489915123 487501526 486129799 486218224 485701714 484491653 484270325 485322723 486481552 487583504
$$ packed form
751.3D82458725J188316J740990J473312J575356J458321K92396O10161N44166k51464
760D91090279J58500K125740K235604J864471J845932l77388j015968p09954P27463
768.6D97944679J276894K17514P88307M63295K13280N6495N26429N81131l07045m58184
778.3E01302795o63681N84336O80504j3352j43165P6866J328163J746788J035309j57662
787.9E05776901O6567K31056J33476K37885O37359J219788J64757O8435j1787j26648
797.6E08397789n62325j282806q57544p85789k82174n93185n50766q34465k066612
806.2E00582123k314301j784782j157608j775017j681671j397514j73111Q07113j190109
814.9D89915123k413597j371727Q8425n16510j210061k21328J052398J158829J101952
$$ plain form
823.6 487583504 489426422 490736580 492517014 494821358 497688103 500549774 501283493 502736664 505551720
832.3 505551720 508819618 511463432 514120140 517542763 519362984 519802208 520083771 522386703 524359398
841 524359398 525457039 527427521 529399109 531726151 533125038 535073700 535994110 535731354 536852455
849.6 536852455 538236542 539544487 540573845 542746277 544986229 547196770 548898582 549548721 550760422
858.3 550760422 552098923 553783913 554466019 555324783 556134720 557362289 559587784 560642891 561013680
867 561013680 559781494 559117165 558587990 557216911 555638695 554453125 554535980 553794365 553719788 553481026
876.7 553481026 553210297 552246895 549944382 549540558 549699669 549606285 548138390 547495041 547811012 547072945
886.3 547072945 546578178 544829788 543510475 542781639 541667175 541101608 540970497 540298424 539168282
$$ packed form
823.6D87583504J842918J310158J780434K304344K866745K861671P33719J453171K815056
832.3E05551720L267898K643814K656708L422623J820221M39224K81563K302932J972695
841E24359398J097641J970482J971588K327042J398887J948662R20410k62756J121101
849.6E36852455J384087J307945J029358K172432K239952K210541J701812O50139J211701
858.3E50760422J338501J684990O82106Q58764Q09937J227569K225495J055107L70789
867E61013680j232186o64329n29175j371079j578216j185570Q2855p41615p4577k38762
876.7E53481026k70729r63402k302513m03824J59111r3384j467895o43349L15971p38067
886.3E47072945m94767j748390j319313p28836j114464n65567j31111o72073j130142
$$ plain form
895 539168282 539298058 539336472 538963966 538032417 536434135 534491119 532708168 532484169 532568398 533164597
904.6 533164597 535037346 537357674 538937225 539812431 540564499 541249580 541717377 541147652 541218262
913.3 541218262 541081848 540485001 540333672 539557915 538615150 536650620 534211235 531840630 529193001
922 529193001 526935577 525791817 524648285 522687912 520903053 518323479 515647049 513471870 511036453
930.7 511036453 508420868 506863518 506196480 504396820 503067589 502926445 502778893 501699295 499849472
939.3 499849472 497564812 494838638 493448257 492555695 491835861 491263618 490389671 489901848 489096832
948 489096832 487771454 485851555 484494972 483548851 482340775 481266899 479826469 478485451 477254906
956.7 477254906 475950966 473908195 471336136 468338852 465146370 463282967 461488113 459458389
$$ packed form
895E39168282J29776L8414l72506r31549j598282j943016j782951k23999Q4229N96199
904.6E33164597J872749K320328J579551Q75206P52068O85081M67797n69725P0610
913.3E41218262j36414n96847j51329p75757r42765j964530k439385k370605k647629
922E29193001k257424j143760j143532j960373j784859k579574k676430k175179k435417
930.7E11036453k615585j557350o67038j799660j329231j41144j47552j079598j849823
939.3D99849472k284660k726174j390381q92562p19834n72243q73947m87823q05016
948D89096832j325378j919899j356583r46121j208076j073876j440430j341018j230545
956.7D77254906j303940k042771k572059k997284l192482j863403j794854k029724
$$ plain form
964.4 459458389 458357582 457580376 456472130 455340729 454023781 451985970 449737015 447711639 445814972
973.1 445814972 443233376 440652657 439129906 437839622 435944176 432894058 429221191 425396652
980.8 425396652 421456757 417673264 413642540 409842720 406878471 403694000 400519600 397157364
988.5 397157364 393354263 389706383 385320930 381210175 378010750 375357513 372683144 370072937
996.2 370072937 367922287 365738487 363866577 361151810 358576584 356067123 353290977 351143494
1004 351143494 348784943 347116547 345079842 343189011 341785202 340257263 338755035 336736679 334953957
1012.6 334953957 332824326 331343536 330110664 328564682 326786652 325241890 324518967 322353668
1020.3 322353668 319763794 317151985 315150013 313485909 311771069 311156902 310147533 308751907
$$ packed form
964.4D59458389j100807p77206j108246j131401j316948k037811k248955k025376j896667
973.1D45814972k581596k580719j522751j290284j895446l050118l672867l824539
980.8D25396652l939895l783493m030724l799820k964249l184471l174400l362236
988.5C97157364l803101l647880m385453m110755l199425k653237k674369k610207
996.2C70072937k150650k183800j871910k714767k575226k509461k776146k147483
1004C51143494k358551j668396k036705j890831j403809j527939j502228k018356j782722
1012.6C34953957k129631j480790j232872j545982j778030j544762p22923k165299
1020.3C22353668k589874k611809k001972j664104j714840o14167j009369j395626
$$ plain form
1028.1 308751907 306910210 306249466 305883961 304732132 303294029 302151642 302439251 302657738 304414959
1036.7 304414959 306029053 307424679 309090424 310368385 312528038 313271198 314460373 315761471
1044.5 315761471 316348095 316613846 316739578 317445145 316785717 316608543 315844116 314166298 312947483
1053.1 312947483 311744137 310991211 310307751 310415592 310045147 310138550 311071186 311936970 312375412 313329086
1062.8 313329086 315544014 316904011 318193588 318934078 320540352 322871933 324573212 325814476
1070.5 325814476 325381126 325677261 326462784 326931419 326823502 326850739 327771072 328358307 329575844 330838928
1080.1 330838928 331713295 331556129 331385460 331488800 331824799 332999496 333667641 334734650 335544662
1088.8 335544662 337170792 339062386 340146866 341040764 341476517 342828178 343457680 344149971 344881897
$$ packed form
1028.1C08751907j841697o60744l65505j151829j438103j142387K87609K18487J757221
1036.7C04414959J614094J395626J665745J277961K159653P43160J189175J301098
1044.5C15761471N86624K65751J25732P05567o59428j77174p64427j677818j218815
1053.1C12947483j203346p52926o83460J07841l70445R3403R32636Q65784M38442R53674
1062.8C13329086K214928J359997J289577P40490J606274K331581J701279J241264
1070.5C25814476m33350K96135P85523M68635j07917K7237R20333N87235J217537J263084
1080.1C30838928Q74367j57166j70669J03340L35999J174697O68145J067009Q10012
1088.8C35544662J626130J891594J084480Q93898M35753J351661O29502O92291P31926
$$ plain form
1097.5 344881897 345142365 346038132 346738091 347538948 348074989 349168968 349611702 349499550 350119743
1106.2 350119743 350951195 351574440 351571999 352781067 353588982 353754845 354168053 354464264 355029602 355431404
1115.8 355431404 356733017 357775879 358191261 358440018 359190826 359807129 359510231 359911613 360204048
1124.5 360204048 361029701 361764908 362677727 363972244 364759178 366578712 368180351 369365730 369942703
1133.2 369942703 371146736 373315735 374982224 377201843 378935432 380403252 382199059 383792648
1140.9 383792648 384724579 385104294 385851936 386508751 387054787 387694893 388115196 388290367 388979683 390134926
1150.5 390134926 390972633 390671539 389405899 388949623 389150925 389280739 388930435 388502960 388352089
1159.2 388352089 388148613 388057365 387464485 387119102 387034950 387848511 389682732 391166801 393071556
$$ packed form
1097.5C44881897K60468Q95767O99959Q00857N36041J093979M42734j12152O20193
1106.2C50119743Q31452O23245k441J209068Q07915J65863M13208K96211N65338M01802
1115.8C55431404J301613J042862M15382K48757P50808O16303k96898M01382K92435
1124.5C60204048Q25653P35207R12819J294517P86934J819534J601639J185379N76973
1133.2C69942703J204033K168999J666489K219619J733589J467820J795807J593589
1140.9C83792648R31931L79715P47642O56815N46036O40106M20303J75171O89316J155243
1150.5C90134926Q37707l01094j265640m56276K01302J29814l50304m27475j50871
1159.2C88352089k03476r1248n92880l45383q4152Q13561J834221J484069J904755
$$ plain form
1167.9 393071556 395232468 398395500 402049599 405109787 407609787 409824257 412646637 415753441
1175.6 415753441 418784180 421891022 425342751 428639221 431644897 434245262 437082634 439800262
1183.3 439800262 441553726 443593292 445519142 446756248 448078842 450227966 452003555 452817192
1191 452817192 453207626 453093681 452795410 451882782 450892525 450133171 449454727 448992004 448421173 447753868
1200.7 447753868 446870651 445593224 444085007 442611084 441030922 439902878 439271965 438878288 439114876
1209.4 439114876 439198189 438838425 438302269 437709732 437103271 436625786 436195679 435149956 434521599 434504013
1219 434504013 434750977 435047569 434670868 434380226 433801956 433282280 433000755 432226982 431771126 431241989
1228.6 431241989 430808716 430759811 430519943 429943314 429123001 428645439 428352432 428135643 427765312 427343025
$$ packed form
1167.9C93071556K160912L163032L654099L060188K500000K214470K822380L106804
1175.6D15753441L030739L106842L451729L296470L005676K600365K837372K717628
1183.3D39800262J753464K039566J925850J237106J322594K149124J775589Q13637
1191D52817192L90434j13945k98271r12628r90257p59354o78444m62723n70831o67305
1200.7D47753868q83217j277427j508217j473923j580162j128044o30913l93677K36588
1209.4D39114876Q3313l59764n36156n92537o06461m77485m30107j045723o28357j7586
1219D34504013K46964K96592l76701k90642n78270n19676k81525p73773m55856n29137
1228.6D31241989m33273m8905k39868n76629q20313m77562k93007k16789l70331m22287
$$ plain form
1238.3 427343025 427252579 427271004 427307243 427121162 427085724 426967850 426624336 426151276 425486031 425259781
1247.9 425259781 425030746 424922905 425146790 424887352 424154854 423708916 423673897 423579636 423488808 423152618
1257.6 423152618 422819214 422647171 422751312 423375511 423761940 423887177 424011612 424583015 425015640 425264740
1267.2 425264740 426251450 427112160 427708397 428752975 430096664 431094284 431940994 432674637 433166046
1275.9 433166046 433944435 435131569 436566582 438031197 439435577 440418739 441231461 442640228 444274483
1284.6 444274483 445250130 446070557 447302208 448624649 449739189 450530968 451691399 452727890 453452797
1293.3 453452797 453986893 454341431 454790535 454839249 455105515 455512161 456261292 456669388 456681175 457438812
1302.9 457438812 457504845 457004166 456325798 455711060 455213394 454554024 454193306 454036255 453907127 453211250
$$ packed form
1238.3D27343025r0446J8425L6239j86081l5438j17874l43514m73060o65245k26250
1247.9D25259781k29035j07841K23885k59438p32498m45938l5019r4261r0828l36190
1257.6D23152618l33404j72043J04141O24199L86429J25237J24435N71403M32625K49100
1267.2D25264740R86710Q60710N96237J044578J343689R97620Q46710P33643M91409
1275.9D33166046P78389J187134J435013J464615J404380R83162Q12722J408767J634255
1284.6D44274483R75647Q20427J231651J322441J114540P91779J160431J036491P24907
1293.3D53452797N34096L54538M49104M8714K66266M06646P49131M08096J1787P57637
1302.9D57438812O6033n00679o78368o14738m97666o59370l60718j57051j29128o95877
$$ plain form
1312.5 453211250 452496758 451943474 451322327 450596275 450033455 450146980 450248032 450937576 451782608 452557220
1322.2 452557220 453614693 454451141 454971771 454822578 455071602 455294151 454921608 454546089 454316025
1330.9 454316025 454257011 453914032 453558922 453015594 452591209 452244148 452024689 452194405 452143936 452641220
1340.5 452641220 453407249 454244041 454879150 455334282 455742187 455975494 456798401 457354355 457731667 457826653
1350.2 457826653 457745285 457434769 456727333 456627922 456461792 456220436 455714073 455115623 454766769 454649162
1359.8 454649162 454529686 454140472 454015007 453257103 453197289 452863541 451848984 451206360 450613632 450720444
1369.4 450720444 450403824 450176125 450415344 450495872 449981194 449449501 449797401 449635582 449908981 450100975
1379.1 450100975 449979134 449960518 449564133 449253922 448502350 447841949 446757355 445416718 444006805
$$ packed form
1312.5D53211250p14492n53284o21147p26052n62820J13525J01052O89544Q45032P74612
1322.2D52557220J057473Q36448N20630j49193K49024K22549l72543l75519k30064
1330.9D54316025n9014l42979l55110n43328m24385l47061k19459J69716n0469M97284
1340.5D52641220P66029Q36792O35109M55132M07905K33307Q22907N55954L77312R4986
1350.2D57826653q1368l10516p07436r9411j66130k41356n06363n98450l48854j17607
1359.8D54649162j19476l89214j25465p57904n9814l33748j014557o42624n92728J06812
1369.4D50720444l16620k27699K39219Q0528n14678n31693L47900j61819K73399J91994
1379.1D50100975j21841j8616l96385l10211p51572o60401j084594j340637j409913
$$ plain form
1387.8 444006805 443485107 443130608 441798592 440988617 439950562 438962364 436818962 433833504 433030319
1396.4 433030319 431336403 429326553 427030487 425815735 424963951 423359337 421758080 419659195
1404.2 419659195 417225838 415404091 413881798 411686020 409530830 407940331 406563835 405976830
1411.9 405976830 404722137 403247032 402171402 400809708 399532776 398217392 397308540 395238953
1419.6 395238953 395079193 395401535 394933701 395104141 394915962 395493736 396094742 395908203 395903320 395664787
1429.2 395664787 396183662 396873512 398043404 399318199 400819244 402340202 403104973 404182281 405253601
1437.9 405253601 407332993 408564644 409868164 411676979 412890358 414659882 416080780 417988052
1445.6 417988052 419315529 420472984 421710167 423295860 425095444 425852890 427944260 429637871
$$ packed form
1387.8D44006805n21698l54499j332016q09975j038055r88198k143402k985458q03185
1396.4D33030319j693916k009850k296066j214752q51784j604614j601257k098885
1404.2D19659195k433357j821747j522293k195778k155190j590499j376496n87005
1411.9D05976830j254693j475105j075630j361694j276932j315384r08852k069587
1419.6C95238953j59760L22342m67834J70440j88179N77774O01006j86539m883k38533
1429.2C95664787N18875O89850J169892J274795J501045J520958P64771J077308J071320
1437.9D05253601K079392J231651J303520J808815J213379J769524J420898J907272
1445.6D17988052J327477J157455J237183J585693J799584P57446K091370J693611
$$ plain form
1453.3 429637871 431354523 432662621 433156013 434222641 435332222 439617920 441281815 443578491
1461.1 443578491 445329170 446656761 448871269 449717484 452898750 454857025 456935654 459431038
1468.8 459431038 461919060 464618683 465705338 468047028 471231194 474893837 477984886 480830612
1476.5 480830612 483329773 485031052 487043953 488921242 490594788 491872940 492786217 493871536
1484.2 493871536 494729958 495409966 494949951 494166908 494730644 494022522 494075127 494351349 494280701 493464394
1493.8 493464394 492204514 491242256 487298965 486957588 485796432 483487358 483256912 482439613 481538773
1502.5 481538773 480524330 480241966 478554497 475170898 473778305 474247055 475501404 474378777 474721565
1511.2 474721565 474319267 473416405 472901459 471638298 470800095 468966331 468303070 468721161 469331512
$$ packed form
1453.3D29637871J716652J308098M93392J066628J109581M285698J663895K296676
1461.1D43578491J750679J327591K214508Q46215L181266J958275K078629K495384
1468.8D59431038K488022K699623J086655K341690L184166L662643L091049K845726
1476.5D80830612K499161J701279K012901J877289J673546J278152R13277J085319
1484.2D93871536Q58422O80008m60015p83043N63736p08122N2605K76222p0648q16307
1493.8D93464394j259880r62258l943291l41377j161156k309074k30446q17299r00840
1502.5D81538773j014443k82364j687469l383599j392593M68750J254349j122627L42788
1511.2D74721565m02298r02862n14946j263161q38203j833764o63261M18091O10351
$$ plain form
1519.9 469331512 467553520 466006699 466789017 467232399 468292046 467346153 467736244 467529640 466780930
1528.6 466780930 466513062 466371918 466915474 466330872 465731888 464144745 465368881 466210442 465952072
1537.2 465952072 465926285 459753380 460435257 462527351 462810402 462462654 463195457 464335022 463208351
1545.9 463208351 464264069 464367638 464797173 464682007 463632050 463733063 463302841 464052696 462272568
1554.6 462272568 462647247 463702583 463638878 461300812 455125008 457993736 458197517 459278374 458566475
1563.3 458566475 457255936 454862137 453162460 452450104 450478172 449723206 442821693 441857948 440879555
1572 440879555 437963104 435872498 433117065 431292076 421959381 421114845 418791847 415503502 412595520
1580.6 412595520 408502541 405712433 400714417 397779160 393679733 390237923 386725464 382295303
$$ packed form
1519.9D69331512j777992j546821P82318M43382J059647r45893L90091k06604p48710
1528.6D66780930k67868j41144N43556n84602n98984j587143J224136Q41561k58370
1537.2D65952072k5787o172905O81877K092094K83051l47748P32803J139565j126671
1545.9D63208351J055718J03569M29535j15166j049957J01013m30222P49855j780128
1554.6D62272568L74679J055336o3705k338066o175804K868728K03781J080857p11899
1563.3D58566475j310539k393799j699677p12356j971932p54966o901513r63745r78393
1572D40879555k916451k090606k755433j824989r332695q44536k322998l288345k907982
1580.6D12595520m092979k790108m998016k935257m099427l441810l512459m430161
$$ plain form
1588.4 382295303 379605103 375066719 373069534 368716812 365765038 362527008 358740425 356540871
1596.1 356540871 351842690 350064659 346484985 344685822 342133484 339587631 337851753 334384804
1603.8 334384804 333671722 330538826 329515572 326842117 325256195 324248009 321552582 321442680 318838673
1612.5 318838673 318560066 316478653 316074123 315129166 309981327 312338943 311463318 312037048 310240173
1621.1 310240173 310794773 310274353 308155422 309550476 308788471 310138149 308295231 309356136 309590187
1629.8 309590187 309693012 310646362 310229511 311855583 310931187 312476425 311423950 312812901 313884850
1638.5 313884850 314710560 316944828 317005215 319458237 319764099 321260414 322349281 322796631 326223526
1647.2 326223526 324161491 327355957 328484879 331603088 333734703 331614494 334069023 334900551
$$ packed form
1588.4C82295303k690200m538384j997185m352722k951774l238030l786583k199554
1596.1C56540871m698181j778031l579674j799163k552338k545853j735878l466949
1603.8C34384804p13082l132896j023254k673455j585922j008186k695427j09902k604007
1612.5C18838673k78607k081413m04530r44957n147839K357616q75625N73730j796875
1621.1C10240173N54600n20420k118931J395054p62005J349678j842918J060905K34051
1629.8C09590187J02825R53350m16851J626072r24396J545238j052475J388951J071949
1638.5C13884850Q25710K234268O0387K453022L05862J496315J088867M47350L426895
1647.2C26223526k062035L194466J128922L118209K131615k120209K454529Q31528
$$ plain form
1654.9 334900551 339698677 341281166 343846779 345000839 346850815 349260902 351001816 354223747
1662.6 354223747 355147285 359005356 361293259 363932762 366594276 369249878 372181625 372803459 377560081
1671.3 377560081 380138702 384200058 387450447 389704552 393417816 396714859 401144600 403765411
1679 403765411 407845955 410627022 414167023 418125496 418283234 424003983 427911301 433964958 437967606
1687.7 437967606 441790390 446048393 449803123 454874687 459080811 463416367 467568245 472300568
1695.4 472300568 474002609 478839493 484632759 489700241 494684753 494376221 500925255 505731354
1703.1 505731354 509616203 513457642 517092285 520507355 524025764 528623657 531569901 533818169
1710.8 533818169 536974564 540233154 543495216 545179176 546766357 550159912 552001648 549833183
$$ packed form
1654.9C34900551M798126J582489K565613J154060J849976K410087J740914L221931
1662.6C54223747R23538L858071K287903K639503K661514K655602K931747O21834M756622
1671.3C77560081K578621M061356L250389K254105L713264L297043M429741K620811
1679D03765411M080544K781067L540001L958473J57738N720749L907318O053657M002648
1687.7D37967606L822784M258003L754730N071564M206124M335556M151878M732323
1695.4D72300568J702041M836884N793266N067482M984512l08532O549034M806099
1703.1E05731354L884849L841439L634643L415070L518409M597893K946244K248268
1710.8E33818169L156395L258590L262062J683960J587181L393555J841736k168465
$$ plain form
1718.5 549833183 553954697 557535858 559830055 561886520 563210640 564473190 566491165 568859558
1726.3 568859558 570386086 571720886 573481522 574245377 575683746 578533020 581272697 581520653 579849663
1734.9 579849663 583368149 586734505 588424377 591026192 592570190 592499504 596082306 598690300 600022049
1743.6 600022049 602216873 605162735 607854881 609946175 612286835 614434662 618835831 620966682
1751.3 620966682 622325516 626806679 630091133 633347015 636287308 637184258 639204521 641783981
1759 641783981 644101715 647056427 647216568 647995300 651616745 653765259 655308151 657171021 658907471
1767.7 658907471 658144073 660024719 663218155 663310013 662759552 662697983 666737823 669107132 669103699 671283951
1777.4 671283951 672191391 673532028 673806839 673567047 674960251 676476517 678250656 678508835 679323044
$$ packed form
1718.5E49833183M121514L581161K294197K056465J324120J262550K017975K368393
1726.3E68859558J526528J334800J760636P63855J438369K849274K739677K47956j670990
1734.9E79849663L518486L366356J689872K601815J543998p0686L582802K607994J331749
1743.6F00022049K194824K945862K692146K091294K340660K147827M401169K130851
1751.3F20966682J358834M481163L284454L255882K940293Q96950K020263K579460
1759F41783981K317734K954712J60141P78732L621445K148514J542892J862870J736450
1767.7F58907471p63398J880646L193436R1858n50461o1569M039840K369309l433K180252
1777.4F71283951R07440J340637K74811k39792J393204J516266J774139K58179Q14209
$$ plain form
1786 679323044 680955353 682169724 682971573 684128952 683990402 683927536 684135284 684281921 687058945
1794.7 687058945 687903671 688516617 690262985 691658249 691637878 690292053 692266464 692917023 693792953
1803.4 693792953 695210953 696074295 697642822 698335800 699054413 699522552 700063705 699277878 699828720
1812.1 699828720 701031342 701366959 702960434 703549118 704549561 704914169 705282211 706328125 706360855
1820.8 706360855 706937943 706668015 707422028 707977753 706781616 707544937 709241257 711032639 710905457
1829.4 710905457 708924332 709668579 711378174 711587753 712001572 712687912 713403244 714414062 714283218
1838.1 714283218 714786530 714676437 715280609 715469055 715972672 716876450 713273010 715540466 717697830
1846.8 717697830 718016891 717881622 717901764 718881836 718787842 719135666 718919525 719108200 719551697 719886169
$$ packed form
1786F79323044J632309J214371Q01849J157379j38550o2866K07748J46637K777024
1794.7F87058945Q44726O12946J746368J395264k0371j345825J974411O50559Q75930
1803.4F93792953J418000Q63342J568527O92978P18613M68139N41153p85827N50842
1812.1F99828720J202622L35617J593475N88684J000443L64608L68042J045914L2730
1820.8G06360855N77088k69928P54013N55725j196137P63321J696320J791382j27182
1829.4G10905457j981125P44247J709595K09579M13819O86340P15332J010818j30844
1838.1G14283218N03312j10093O04172J88446N03617R03778l603440K267456K157364
1846.8G17697830L19061j35269K0142R80072r3994L47824k16141J88675M43497L34472
$$ plain form
1856.4 719886169 720849686 721022720 721593552 721603851 721928177 721715088 721435013 721804276 721930618 722678680
1866.1 722678680 722524796 723104248 722523727 722265549 723503494 724018860 724700317 724360199 724527512
1874.8 724527512 724580917 724878387 725657349 725979691 726124191 725880585 726459351 726203308 726198654 726180191
1884.4 726180191 726117706 726875839 726799469 727643890 727823105 727086029 727857895 728574677 728069687 727573853
1894.1 727573853 727537460 727281876 728331451 728796387 729027863 729387970 729046173 728759079 728567047 729060211
1903.7 729060211 729057159 729113464 729128723 729301224 729765472 729873734 730088959 730099030 730775757 730216599
1913.3 730216599 729790421 729918365 730001831 730904694 729720612 729861145 730901489 731067352 730641174
1922 730641174 729590836 729828110 730255508 730652466 730598602 731004257 731369171 731398010 731585541 731280518
$$ packed form
1856.4G19886169R63517J73034N70832J0299L24326k13089k80075L69263J26342P48062
1866.1G22678680j53884N79452n80521k58178J237945N15366O81457l40118J67313
1874.8G24527512N3405K97470P78962L22342J44500k43606N78766k56043m654j8463
1884.4G26180191o2485P58133p6370Q44421J79215p37076P71866P16782n04990m95834
1894.1G27573853l6393k55584J049575M64936K31476L60107l41797k87094j92032M93164
1903.7G29060211l052N6305J5259J72501M64248J08262K15225J0071O76727n59158
1913.3G30216599m26178J27944Q3466R02863j184082J40533J040344J65863m26178
1922G30641174j050338K37274M27398L96958n3864M05655L64914K8839J87531l05023
$$ plain form
1931.7 731280518 731235199 730767136 730673599 730357590 730201187 730389709 730428772 731018677 730785370 731421509
1941.3 731421509 731436615 730120239 730118027 729943390 729759216 729630661 730018921 730197372 730557098 730832138
1951 730832138 730632935 730485306 730135956 730353394 729973373 729594193 729500122 729552994 729777527 729790115
1960.6 729790115 730217438 730187988 730280991 729892960 729287186 728892288 728286362 728624649 729191132 729657364
1970.2 729657364 729592438 729706039 729650345 729524841 729457397 728753891 728647614 728679428 728989334 728908157
1979.9 728908157 728839645 728931274 728619308 728857193 728500595 728066254 727607040 727557907 727560349 727287674
1989.5 727287674 727825317 727927704 727806396 727601166 727806931 727447739 727038269 727400360 726868362 726628189
1999.2 726628189 726541977 726593628 726281815 726196823 726547165 725978165 725817108 725456467 725292740 725390091
$$ packed form
1931.7G31280518m5319m68063r3537l16009j56403J88522L9063N89905k33307O36139
1941.3G31421509J5106j316376k212j74637j84174j28555L88260J78451L59726K75040
1951G30832138j99203j47629l49350K17438l80021l79180r4071N2872K24533J2588
1960.6G29790115M27323k9450R3003l88031o05774l94898o05926L38287N66483M66232
1970.2G29657364o4926J13601n5694j25504o7444p03506j06277L1814L09906q1177
1979.9G28908157o8512R1629l11966K37885l56598m34341m59214m9133K442k72675
1989.5G27287674N37643J02387j21308k05230K05765l59192m09470L62091n31998k40173
1999.2G26628189q6212N1651l11813q4992L50342n69000j61057l60641j63727R7351
$$ plain form
2008.8 725390091 725444641 725371628 725055695 725184784 724914932 724835129 724541550 724095383 723457413 723093872
2018.5 723093872 723480301 723453903 723743057 723552704 723466644 723471222 722919922 722506561 722183685 722099762
2028.1 722099762 721545639 721439285 721356812 721263504 721271362 721124344 721349640 720841522 720507202 720327911
2037.7 720327911 720292282 719989777 719546967 719728088 719521637 719458160 719095459 719122314 718893280 718440628
2047.4 718440628 718487396 717984772 718165436 718514328 718757172 718473587 718055191 717955475 717784424 717778397
2057 717778397 717258301 717370529 717244110 717042465 717027664 716877747 717014618 716624680 716806488 716536865
2066.7 716536865 716291504 716029587 715630493 715920868 715751190 715941086 715811081 715917206 715808487 715413589
2076.3 715413589 715389023 714813995 714659576 714283905 714684601 714929886 714749527 714919510 714301910 714362488
$$ packed form
2008.8G25390091N4550p3013l15933J29089k69852p9803k93579m46167o37970l63541
2018.5G23093872L86429k6398K89154j90353q6060M578n51300m13361l22876q3923
2028.1G22099762n54123j06354q2473r3308P858j47018K25296n08118l34320j79291
2037.7G20327911l5629l02505m42810J81121k06451o3477l62701K6855k29034m52652
2047.4G18440628M6768n02624J80664L48892K42844k83585m18396r9716j71051o027
2057G17778397n20096J12228j26419k01645j4801j49917J36871l89938J81808k69623
2066.7G16536865k45361k61917l99094K90375j69678J89896j30005J06125j08719l94898
2076.3G15413589k4566n75028j54419l75671M00696K45285j80359J69983o17600O0578
$$ plain form
2086 714362488 714288483 713927689 713616714 713590164 713432159 713036346 713470078 713352356 713273010 712998199
2095.6 712998199 712765579 712879562 712513809 712096710 711757202 712141953 712199326 711947327 711789551 711944656
2105.2 711944656 711917877 711165085 710879288 710511627 710567398 710840530 710956726 710689697 710387344 710549927
2114.9 710549927 710287781 710364304 709944534 709760590 709696579 709358215 709530487 709126129 709236145 709325333
2124.5 709325333 709327774 709126968 708577957 708545990 708771286 709111938 708360138 708188858 708407364 708199692
2134.2 708199692 708547897 708605957 708463135 708319168 708528442 708202820 708058014 708360138 708101196 707907181
2143.8 707907181 707794571 708125534 708360596 708689423 708336334 707914886 708137436 707653961 707816315 708078613
2153.5 708078613 708058243 707872543 708087158 708535461 708207169 708136978 707774887 707926025 708050766 707776489
$$ packed form
2086G14362488p4005l60794l10975k6550j58005l95813M33732j17722p9346k74811
2095.6G12998199k32620J13983l65753m17099l39508L84751N7373k51999j57776J55105
2105.2G11944656k6779p52792k85797l67661N5771K73132J16196k67029l02353J62583
2114.9G10549927k62146P6523m19770j83944o4011l38364J72272m04358J10016Q9188
2124.5G09325333K441k00806n49011l1967K25296L40652p51800j71280K18506k07672
2134.2G08199692L48205N8060j42822j43967K09274l25622j44806L02124k58942j94015
2143.8G07907181j12610L30963K35062L28827l53089m21448K22550m83475J62354K62298
2153.5G08078613k0370j85700K14615M48303l28292p0191l62091J51138J24741k74277
$$ plain form
2163.1 707776489 708107681 708275909 708130646 707942505 708366013 708321075 708022385 707598114 707397614 707848587
2172.8 707848587 707686005 708124313 708584518 708852234 708949051 708789902 709075317 708996124 709031296 709009552
2182.4 709009552 709120255 709248657 709222870 709117889 709149399 709559860 709356613 709244156 708998718 709054031
2192 709054031 709425507 709487228 709732208 709780197 709882660 709721222 709785767 709425964 709192505 709800110
2201.7 709800110 710026398 710503082 710493622 710466385 710410233 710105896 710157089 710367584 710640259 710378113
2211.3 710378113 710701981 710870819 710728836 710636749 710417404 710616913 710587769 710732880 710567474 710626068
2221 710626068 710730972 710771408 710972214 710786057 711072083 710717621 710648193 710706406 710589828 710987549
2230.6 710987549 711049957 711384659 711307755 711586304 711636047 711155167 711076965 711005249 711219559 710954056
$$ packed form
2163.1G07776489L31192J68228j45263j88141M23508m4938k98690m24271k00500M50973
2172.8G07848587j62582M38308M60205K67716R6817j59149K85415p9193L5172k1744
2182.4G09009552J10703J28402k5787j04981L1510M10461k03247j12457k45438N5313
2192G09054031L71476O1721K44980M7989J02463j61438O4545l59803k33459O07605
2201.7G09800110K26288M76684r460k7237n6152l04337N1193K10495K72675k62146
2211.3G10378113L23868J68838j41983r2087k19345J99509k9144J45111j65406N8594
2221G10626068J04904M0436K00806j86157K86026l54462o9428N8213j16578L97721
2230.6G10987549O2408L34702p6904K78549M9743m80880p8202p1716K14310k65503
$$ plain form
2240.3 710954056 711041641 711083984 711191864 711445847 711210098 711293716 711090775 711157150 711009598 710852432
2249.9 710852432 711180115 711647949 711669083 711053619 711237183 711231613 711310577 711226501 711065140 711296921
2259.5 711296921 711172714 711425781 711001587 710716705 710900040 711057739 711158218 711015854 711097412 710856094
2269.2 710856094 711236725 711420364 711208038 710824280 710383759 710952454 711270752 711005707 710523682 710713120
2278.8 710713120 710865631 711053391 711407013 711072388 711022263 710727997 710924225 711035385 710946732 711037064
2288.5 711037064 710568314 710113678 709559555 710068970 709861374 709357986 709844818 709955139 710089722 709746704
2298.1 709746704 709792252 709330521 708862610 709153061 709122314 708970261 708303223 708223190 707833176 707559433
2307.8 707559433 707231827 706615753 706803589 706396332 706273499 705931931 705924530 705914001 705692596 706063461
$$ packed form
2240.3G10954056Q7585M2343J07880K53983k35749Q3618k02941O6375j47552j57166
2249.9G10852432L27683M67834K1134o15464J83564n570P8964q4076j61361K31781
2259.5G11296921j24207K53067m24194k84882J83335J57699J00479j42364Q1558k41318
2269.2G10856094L80631J83639k12326l83758m40521N68695L18298k65045m82025J89438
2278.8G10713120J52511J87760L53622l34625n0125k94266J96228J11160q8653R0332
2288.5G11037064m68750m54636n54123N09415k07596n03388M86832J10321J34583l43018
2298.1G09746704M5548m61731m67911K90451l0747j52053o67038q0033l90014k73743
2307.8G07559433l27606o16074J87836m07257j22833l41568p401j0529k21405L70865
$$ plain form
2317.4 706063461 705824356 705267944 703852463 703715668 704031448 703704147 703330536 702905502 702881165 701537704
2327.1 701537704 701439743 701221466 700815125 700909195 700959473 701994629 701025696 700533295 699997940 699475708
2336.7 699475708 699984665 699913025 699505768 698917313 699504166 699217682 699213486 699381027 700012360 700607452
2346.3 700607452 700433350 701628342 702058563 701966171 701133270 699915619 699399261 698499832 698032990
2355 698032990 697014389 695689392 694296265 695070419 695239639 694338760 694661636 694509811 695979614
2363.7 695979614 696242294 696617813 696582184 696527634 697457733 697041779 697529755 698045120 698248215 698341675
2373.3 698341675 699627304 700841522 700877609 701112061 701091766 701705780 701842194 701863480 702180710 702312012
2383 702312012 702423630 702092972 702432327 702846985 702911606 702637863 702379074 702253647 701632767 701294022
$$ packed form
2317.4G06063461k39105n56412j415481j36795L15780l27301l73611m25034k4337j343461
2327.1G01537704r7961k18277m06341R4070N0278J035156r68933m92401n35355n22232
2336.7F99475708N08957p1640m07257n88455N86853k86484m196J67541O31333N95092
2346.3G00607452j74102J194992M30221r2392q32901j217651n16358q99429m66842
2355F98032990j018601j324997j393127P74154J69220r00879L22876j51825J469803
2363.7F95979614K62680L75519l5629n4550R30099m15954M87976N15365K03095R3460
2373.3F98341675J285629J214218L6087K34452k0295O14014J36414K1286L17230J31302
2383G02312012J11618l30658L39355M14658O4621k73743k58789j25427o20880l38745
$$ plain form
2392.6 701294022 701350021 701905746 701825104 701563339 701558380 701272659 701267929 700831680 700639954 700153656 699640732
2403.2 699640732 699725494 699806519 699898300 699332809 699039230 698796692 698762970 698882904 698602600 698473358
2412.9 698473358 698296585 698367233 697821960 697034149 696632080 696652145 696780624 696648483 696914139 696649323
2422.5 696649323 696193695 695805359 695736389 695614243 694767914 694292831 694055862 694276123 694229584 694173050
2432.2 694173050 694394684 694066162 693535385 692791901 692627106 692388382 691863251 691617813 691579132 691751099
2441.8 691751099 691739197 691536179 690846100 690487747 690196457 689879456 689909439 689761353 689756699 689285278
2451.5 689285278 688866959 688900528 688979492 688887482 688323517 687551575 686953506 686888962 686772537 686598740
2461.1 686598740 686096344 685618820 685547409 685415573 685502167 685346298 685170288 684693069 684200211 683808136
$$ packed form
2392.6G01294022N5999N55725q0642k61765m959k85721m730m36249j91726m86298n12924
2403.2F99640732Q4762Q1025R1781n65491k93579k42538l3722J19934k80304j29242
2412.9F98473358j76773P0648n45273p87811m02069K0065J28479j32141K65656k64816
2422.5F96649323m55628l88336o8970j22146q46329m75083k36969K20261m6539n6534
2432.2F94173050K21634l28522n30777p43484j64795k38724n25131k45438l8681J71967
2441.8F91751099j1902k03018o90079l58353k91290l17001K9983j48086m654m71421
2451.5F89285278m18319L3569P8964r2010n63965p71942n98069o4544j16425j73797
2461.1F86598740n02396m77524p1411j31836Q6594j55869j76010m77219m92858l92075
$$ plain form
2470.7 683808136 683162918 682915573 682488098 682355804 682334061 682063828 681799088 681396179 680899582 680411453
2480.4 680411453 680331497 679712067 679092331 678858643 678661499 678684464 678622894 678574753 677925186 677352448
2490 677352448 676886215 676218643 675638657 675080109 674925003 674985504 675229416 674607773 673979950 673843460
2499.7 673843460 673272247 672906952 672494965 672347870 671946487 671196442 670607300 670184860 669992828 669764328
2509.3 669764328 669806824 669273300 668672409 668325272 667803955 667485962 667153168 666891022 666712875 666724930
2519 666724930 666090927 665498886 665295639 664805298 664660568 664555435 664550171 664014587 663519974 663302917
2528.6 663302917 662677536 662267761 661857071 661733856 661435852 661047134 660727768 660555344 660518188 659792252
2538.2 659792252 659332428 659237518 659144058 658587494 658214417 658170776 657513809 657431488 657453079 656999130
$$ packed form
2470.7F83808136o45218k47345m27475j32294k1743k70233k64740m02909m96597m88129
2480.4F80411453p9956o19430o19736k33688j97144K2965o1570m8141o49567n72738
2490F77352448m66233o67572n79986n58548j55106O0501K43912o21643o27823j36490
2499.7F73843460n71213l65295m11987j47095m01383p50045n89142m22440j92032k28500
2509.3F69764328M2496n33524o00891l47137n21317l17993l32794k62146j78147J2055
2519F66724930o34003n92041k03247m90341j44730j05133n264n35584m94613k17057
2528.6F63302917o25381m09775m10690j23215k98004l88718l19366j72424l7156p25936
2538.2F59792252m59824r4910r3460n56564l73077m3641o56967q2321K1591m53949
$$ plain form
2547.9 656999130 656447678 656020813 655582504 655086136 654924850 654950714 655032806 654450378 654014359 653730850
2557.5 653730850 653407745 653381042 652734985 652048340 651647263 651584930 651153259 650993729 651392441 650880356
2567.2 650880356 650274582 649776001 649501419 649025345 648497086 648205948 647909470 648165894 647916336 647453690
2576.8 647453690 647013855 646808853 646773224 646159897 645572205 644763794 644283142 644359512 644427032 644075394
2586.5 644075394 643814163 643670425 642857666 642286987 642032776 642017822 641646194 641092606 640929718 640476532
2596.1 640476532 640149460 640213089 640261383 639405861 638562355 638077126 637841148 637898293 637075615 636405258
2605.7 636405258 635946503 635730324 635517769 635101891 635004349 634243126 633414078 632580566 632139854 631967125
2615.4 631967125 631480293 631270256 631187439 631068611 630394630 630024948 629457054 628641891 628595772 628268623
$$ packed form
2547.9F56999130n51452m26865m38309m96368j61286K5864Q2092n82428m36019k83509
2557.5F53730850l23105k6703o46057o86645m01077o2333m31671j59530L98712n12085
2567.2F50880356o05774m98581k74582m76074n28259k91138k96478K56424k49558m62646
2576.8F47453690m39835k05002l5629o13327n87692q08411m80652P6370O7520l51638
2586.5F44075394k61231j43738q12759n70679k54211j4954l71628n53588j62888m53186
2596.1F40476532l27072O3629M8294q55522q43506m85229k35978N7145q22678o70357
2605.7F36405258m58755k16179k12555m15878r7542p61223q29048q33512m40712j72729
2615.4F31967125m86832k10037q2817j18828o73981l69682n67894q15163m6119l27149
$$ plain form
2625 628268623 627624321 627217903 627318420 626755257 625886002 625393448 624819946 624429359 623868370 623782692
2634.7 623782692 623633728 623214417 622628975 621883125 621537971 621024132 620831871 620486336 619845505 619232445
2644.3 619232445 618655815 618117065 617628326 617762680 617583847 617259865 616822548 616330566 615782051 615030365
2654 615030365 614865570 614527092 614238281 613638077 613160591 613234520 612969360 612691803 611852036 611280289
2663.6 611280289 611000137 610430374 609880295 609450150 609418907 609187851 608818016 608503227 608544235 608212509
2673.3 608212509 607643623 607586784 607116127 606540337 606235886 606149597 605403557 604578896 604370422 603894196
2682.9 603894196 603374290 602753563 602773209 602847672 602333221 601841965 601288071 601002617 600782814 600670166
2692.5 600670166 600281067 599719353 599207916 598520393 598425064 598714485 598483353 597953377 597836990 597343903
$$ packed form
2625F28268623o44302m06418J00517n63163q69255m92554n73502l90587n60989q5678
2634.7F23782692j48964m19311n85442p45850l45154n13839j92261l45535o40831o13060
2644.3F19232445n76630n38750m88739J34354j78833l23982m37317m91982n48515p51686
2654F15030365j64795l38478k88811o00204m77486P3929k65160k77557q39767n71747
2663.6F11280289k80152n69763n50079m30145l1243k31056l69835l14789M1008l31726
2673.3F08212509n68886n6839m70657n75790l04451q6289p46040q24661k08474m76226
2682.9F03894196n19906o20727J9646P4463n14451m91256n53894k85454k19803j12648
2692.5F00670166l89099n61714n11437o87523r5329K89421k31132n29976j16387m93087
$$ plain form
2702.2 597343903 596499672 595716743 595196037 595298004 595205193 595376244 595539322 595020714 594164696 593545799
2711.8 593545799 593305855 592755775 592076950 591497574 591600990 591695404 591451149 591547775 591687927 591647720
2721.5 591647720 590889854 590311203 589889641 589450455 589112625 588435059 588093185 587879486 588037376 588225861
2731.1 588225861 588222771 587804832 586888237 586445885 586282272 586327782 585889587 585712166 585604591 585061760
2740.8 585061760 585102043 584752541 584581070 584461823 584215355 584178429 583788414 583692780 583735123 583727493 583414040
2751.4 583414040 582809677 582273369 582158241 581999931 581541595 581445541 581049232 580826569 580834198 580742874
2761 580742874 580478172 579870300 579418945 578877373 578749580 578850708 578678589 578036766 577623215 577686920
2770.7 577686920 577279015 577114296 576747551 576312103 575895653 575200424 574800110 574509888 574623909 574290276
$$ packed form
2702.2E97343903q44231p82929n20706J01967r2811J71051J63078n18608q56018o18897
2711.8E93545799k39944n50080o78825n79376J03416R4414k44255R6626J40152m0207
2721.5E91647720p57866n78651m21562m39186l37830o77566l41874k13699J57890J88485
2731.1E88225861l090m17939r16595m42352j63613M5510m38195j77421j07575n42831
2740.8E85061760M0283l49502j71471j19247k46468l6926l90015r5634M2343p630l13453
2751.4E83414040o04363n36308j15128j58310m58336r6054l96309k22663P629r1324
2761E80742874k64702o07872m51355n41572j27793J01128j72119o41823m13551O3705
2770.7E77686920m07905j64719l66745m35448m16450o95229m00314k90222J14021l33633
$$ plain form
2780.3 574290276 573663635 573251534 572786102 572418175 572102051 571672440 570906792 570865440 570857620 570468559
2789.9 570468559 570080147 569396744 568843575 568040581 567505341 566765099 566059685 566197205 565848961 565041161
2799.6 565041161 564376183 563988380 563547401 563038216 562289581 561309395 560575256 560075226 559744415 559379539
2809.2 559379539 559289970 558725090 557843285 557011833 555956116 555238266 554236298 553484154 552894897
2817.9 552894897 552095680 551845856 551744118 551229782 550173111 549177933 548110695 547124939 546350479
2826.6 546350479 545597267 544991722 543995285 543017273 542335243 541743011 540892677 539872513 538892441
2835.3 538892441 537724190 536560707 535354958 534165993 532893410 531559677 529608307 527547722
2843 527547722 525914841 523794022 521872063 519884338 517579956 515122185 512895164 511742287 510973206
$$ packed form
2780.3E74290276o26641m12101m65432l67927l16124m29611p65648m1352p820l89061
2789.9E70468559l88412o83403n53169q02994n35240p40242p05414J37520l48244q07800
2799.6E65041161o64978l87803m40979n09185p48635r80186p34139n00030l30811l64876
2809.2E59379539q9569n64880q81805q31452j055717p17850j001968p52144n89257
2817.9E52894897p99217k49824j01738n14336j056671r95178j067238r85756p74460
2826.6E46350479p53212o05545r96437r78012o82030n92232q50334j020164r80072
2835.3E38892441j168251j163483j205749j188965j272583j333733j951370k060585
2843E27547722j632881k120819j921959j987725k304382k457771k227021j152877p69081
$$ plain form
2851.7 510973206 510268402 509442711 508979988 508706894 508344841 508254929 508145027 508028069 507820778 507984772
2861.3 507984772 507477150 506588402 506403427 505721359 504515533 503326073 502613029 501886101 501527481
2870 501527481 501547623 501094742 500706940 499921227 499213867 498667984 497926025 497313805 496726837 496122932
2879.6 496122932 495273209 494580193 494065285 493912582 493442268 492156601 490916901 489989319 489504242
2888.3 489504242 488465080 487001953 486001472 485319138 484545517 483691101 483101273 482323875 481515656
2897 481515656 480120888 478552246 477919807 477520523 476940384 476236229 475787125 475009079 473904915
2905.7 473904915 472919579 471936646 471149025 470211945 469300613 468274956 467230263 466055832 464468117
2914.3 464468117 463087196 461690178 459900780 458272705 457377319 456256981 455185432 454859886 454532242
$$ packed form
2851.7E10973206p04804q25691m62723k73094l62053q9912j09902j16958k07291J63994
2861.3E07984772n07622q88748j84975o82068j205826j189460p13044p26928l58620
2870E01527481K0142m52881l87802p85713p07360n45883p41959o12220n86968o03905
2879.6D96122932q49723o93016n14908j52703m70314j285667j239700r27582m85077
2888.3D89504242j039162j463127j000481o82334p73621q54416n89828p77398q08219
2897D81515656j394768j568642o32439l99284n80139p04155m49104p78046j104164
2905.7D73904915r85336r82933p87621r37080r11332j025657j044693j174431j587715
2914.3D64468117j380921j397018j789398j628075q95386j120338j071549l25546l27644
$$ plain form
2923 454532242 454220848 453879128 453676109 453684654 453909798 453754120 453504868 454080391 454403343 454391861
2932.7 454391861 454775658 455757599 456411743 456741447 457482948 457795753 457815361 458153915 459142418 460228729
2942.3 460228729 461131592 461686783 461988525 463074303 463573990 463357887 463651848 463995514 464261055
2951 464261055 464844398 465212784 464878654 465271378 466313171 466714172 466465759 466540413 467268448 467712479
2960.6 467712479 468082085 468638802 469084663 469488983 470332985 471164703 471626816 471964722 472093163 472761688
2970.3 472761688 473231125 473703499 475023041 475962257 476083221 475956078 476445694 477258606 478033142
2979 478033142 478334770 478240891 478416824 478434639 478647652 478889885 478904533 478778343 478825073 478929634 478695908
2989.6 478695908 479002151 479380074 479482918 479315338 479000969 478767166 478512993 478591766 478287659 477720337
$$ packed form
2923D54532242l11394l41720k03019Q545K25144j55678k49252N75523L22952j1482
2932.7D54391861L83797R81941O54144L29704P41501L12805J9608L38554R88503J086311
2942.3D60228729R02863N55191L01742J085778M99687k16103K93961L43666K65541
2951D64261055N83343L68386l34130L92724J041793M01001k48413P4654P28035M44031
2960.6D67712479L69606N56717M45861M04320Q44002Q31718M62113L37906J28441O68525
2970.3D72761688M69437M72374J319542R39216J20964j27143M89616Q12912P74536
2979D78033142L01628r3879J75933J7815K13013K42233J4648j26190M6730J04561k33726
2989.6D78695908L06243L77923J02844j67580l14369k33803k54173P8773l04107n67322
$$ plain form
2999.2 477720337 477159195 476941948 477028275 476569061 475989151 475239487 474774666 474592056 474073524 473530273
3008.8 473530273 473110657 472741661 472227859 471721420 471171646 470546036 469888878 469499168 469096832 468284454
3018.5 468284454 467538910 466811066 466103363 465107880 464239502 463902588 463510094 462766151 461925774 461389084
3028.1 461389084 460693092 460185051 459234848 457872429 457408257 457225494 456950951 455933952 454755135
3036.8 454755135 453914757 453329620 452968712 452032967 451237526 450420685 449435616 448797073 448398781 447718201
3046.5 447718201 446765175 446151924 445168533 444081383 443076668 442360954 441892319 441304436 440874176
3055.1 440874176 439966621 439242020 438091125 436759605 436412468 435802803 435188828 434748688 434060516
3063.8 434060516 432981720 432267036 432197990 431769485 431034927 430113716 429408875 428740807 427698441
$$ packed form
2999.2D77720337n61142k17247Q6327m59214n79910p49664m64821j82610n18532n43251
3008.8D73530273m19616l68996n13802n06439n49774o25610o57158l89710m02336q12378
3018.5D68284454p45544p27844p07703r95483q68378l36914l92494p43943q40377n36690
3028.1D61389084o95992n08041r50203j362419m64172j82763k74543j016999j178817
3036.8D54755135q40378n85137l60908r35745p95441q16841r85069o38543l98292o80580
3046.5D47718201r53026o13251r83391j087150j004715p15714m68635n87883m30260
3055.1D40874176r07555p24601j150895j331520l47137o09665o13975m40140o88172
3063.8D34060516j078796p14684o9046m28505p34558r21211p04841o68068j042366
$$ plain form
3072.5 427698441 426541443 425839958 425658226 425394478 425045280 424338226 423752556 423107719 422079277
3081.2 422079277 421169090 420304565 419737473 419167862 418801117 418428955 417774239 417144547 416267052 415565453
3090.8 415565453 414810867 413839684 413066406 412489891 411985283 411650314 411199608 410322685 409755325 409381027
3100.5 409381027 408634987 407560539 406837082 406478844 405762177 404717064 403899078 404031143 403858223
3109.1 403858223 402910309 401780396 400647087 400099831 399416237 398851700 398407707 397628975 396823196
3117.8 396823196 396063194 395534935 394806442 394232750 393451729 392515869 392086639 391408195 390490341 389656029
3127.5 389656029 389006119 388153763 387340965 386615028 385787468 385499496 385130920 384368362 383591042 383050728
3137.1 383050728 382222061 381069527 380284081 379559593 379102211 378387985 377337456 376647415 375932465
$$ packed form
3072.5D27698441j156998p01485j81732k63748l49198p07054n85670o44837j028442
3081.2D22079277r10187q64525n67092n69611l66745l72162o54716o29692q77495p01599
3090.8D15565453p54586r71183p73278n76515n04608l34969m50706q76923n67360l74298
3100.5D09381027p46040j074448p23457l58238p16667j045113q17986J32065j72920
3109.1D03858223r47914j129913j133309n47256o83594n64537m43993p78732q05779
3117.8C96823196p60002n28259p28493n73692p81021r35860m29230o78444r17854q34312
3127.5C89656029o49910q52356q12798p25937q27560k87972l68576p62558p77320n40314
3137.1C83050728q28667j152534p85446p24488m57382p14226j050529o90041p14950
$$ plain form
3145.8 375932465 375287323 374717064 373884621 372852020 372011223 371369629 370685196 369921951 369297256
3154.5 369297256 369094276 368738899 367666893 366425171 365622635 364884872 364163628 363450546 362725296
3163.1 362725296 362190628 361431770 360732536 359922676 359031754 358738976 358363228 357180786 355643349
3171.8 355643349 354678802 354048538 353549576 353306389 353027077 352329407 351242371 350796928 350370827
3180.5 350370827 349187698 348166924 347962379 347387581 345851173 345176468 344905014 344308472 343849869
3189.2 343849869 343156128 342573738 341989288 341288605 340689240 340045128 339465446 338700867 337295952
3197.9 337295952 336269989 336232796 335924225 335225487 334353180 333692207 333487206 332878799 332024651 331246948
3207.5 331246948 330780182 330287437 329437370 328704338 327970200 327594032 327249146 326387100 325772133 325468864
$$ packed form
3145.8C75932465o45142n70259q32443j032601q40797o41594o84433p63245o24695
3154.5C69297256k02980l55377j072006j241722q02536p37763p21244p13082p25250
3163.1C62725296n34668p58858o99234q09860q90922k92778l75748j182442j537437
3171.8C55643349r64547o30264m98962k43187k79312o97670j087036m45443m26101
3180.5C50370827j183129j020774k04545n74798j536408o74705k71454n96542m58603
3189.2C43849869o93741n82390n84450p00683n99365o44112n79682p64579j404915
3197.9C37295952j025963l7193l08571o98738q72307o60973k05001o08407q54148p77703
3207.5C31246948m66766m92745q50067p33032p34138l76168l44886q62046o14967l03269
$$ plain form
3217.2 325468864 325046654 324415627 323839684 323172684 322155266 321557426 321130600 320559959 320210571
3225.8 320210571 319414959 318754044 318248005 317463322 317191410 316650906 315819073 315145588 314556198 314131527
3235.5 314131527 313580990 313215027 312994461 312894897 312344437 311327724 310815411 310516376 310481033 310363770
3245.1 310363770 309532452 308686295 308372746 308055553 307495575 306983376 306244507 305662842 305302486 304853668
3254.8 304853668 304335022 303752289 303478184 303292027 302961292 302506351 301984348 301467972 301216393 301131058
3264.4 301131058 300544243 299887066 299567108 299421864 299171581 298396626 297518997 297516689 297686691 297285404
3274 297285404 297296371 296936054 295991249 295381222 294957504 294664650 294209824 294160728 294046803 293553715
3283.7 293553715 293228512 292695560 292356071 291700802 290907192 291009960 291708241 291824017 290675125
$$ packed form
3217.2C25468864m22210o31027n75943o67000j017418n97840m26826n70641l49388
3225.8C20210571p95612o60915n06039p84683k71912n40504q31833o73485n89390m24671
3235.5C14131527n50537l65963k20566r9564n50460j016713n12313k99035l5343j17263
3245.1C10363770q31318q46157l13549l17193n59978n12199p38869n81665l60356m48818
3254.8C04853668n18646n82733k74105j86157l30735m54941n22003n16376k51579q5335
3264.4C01131058n86815o57177l19958j45244k50283p74955q77629k308J70002m01287
3274B97285404J0967l60317r44805o10027m23718k92854m54826m9096j13925m93088
3283.7B93553715l25203n32952l39489o55269p93610J02768O98281J15776j148892
$$ plain form
3292.4 290675125 289934139 290097618 290078907 289534950 289170055 289073849 288318176 287882671 287933407 287444057
3302 287444057 286966400 286936512 286626358 285935307 285592442 285358410 284960670 284321823 283731346 283408279
3311.7 283408279 283098259 283134289 282887268 282154045 281294632 280558739 280400639 279994221 279520664 279428692
3321.3 279428692 279319725 278868523 277871933 277425175 277194614 276224461 275250092 274703293 274462719 274099216
3330.9 274099216 273821411 273771992 273151798 272250195 271952953 271390476 270142193 269610367 269182682 268390388
3340.6 268390388 268255291 268070011 267562294 267260857 266800270 266185265 265970173 265870190 265457439 265036392
3350.2 265036392 264590607 264053421 263198776 262395096 262331734 262290573 261797447 261527328 261618252 261459274
3359.9 261459274 261239319 260602016 259508266 259191475 259311600 259539108 259533672 259180279 258805370 258111515
$$ packed form
3292.4B90675125p40986J63479j8711n43957l64895r6206p55673m35505N0736m89350
3302B87444057m77657k9888l10154o91051l42865k34032l97740o38847n90477l23067
3311.7B83408279l10020L6030k47021p33223q59413p35893j58100m06418m73557r1972
3321.3B79428692j08967m51202r96590m46758k30561r70153r74369n46799k40574l63503
3330.9B74099216k77805m9419o20194r01603k97242n62477j248283n31826m27685p92294
3340.6B68390388j35097j85280n07717l01437m60587o15005k15092r9983m12751m21047
3350.2B65036392m45785n37186q54645q03680o3362m1161m93126k70119R0924j58978
3359.9B61459274k19955o37303j093750l16791J20125K27508n436l53393l74909o93855
$$ plain form
3369.5 258111515 257537956 257082939 256879025 256476784 255687275 255673809 255836296 255611248 255318146 255073605
3379.2 255073605 254620609 254263153 254395275 254257526 254077606 253913136 253712883 253662910 253378429 253237762
3388.8 253237762 253331852 253347874 253247013 252980709 252164650 251392822 251663494 252308884 252297535 251840744
3398.4 251840744 251664352 251445789 251153526 250967445 250782261 250914135 250843601 250787754 251055527 250970383
3408.1 250970383 250617447 250437222 250517750 250788403 251152058 250959034 250732899 251039391 250977650 250788898
3417.7 250788898 251031837 251453476 251302223 250984688 251656933 252322731 252024918 251757507 252410736 252829533
3427.4 252829533 252120647 251742821 252270222 252537804 252625961 252876015 252736530 252541981 252827930 253567123
3437 253567123 254165993 254489441 254724884 254864883 255395260 255660629 255760117 256275597 256767273 257170620
$$ packed form
3369.5B58111515n73559m55017k03914m02241p89509j3466J62487k25048k93102k44541
3379.2B55073605m52996l57456J32122j37749j79920j64470k00253m9973k84481j40667
3388.8B53237762R4090J6022j00861k66304q16059p71828K70672O45390j1349m56791
3398.4B51840744j76392k18563k92263j86081j85184J31874p0534n5847K67773q5144
3408.1B50970383l52936j80225Q0528K70653L63655j93024k26135L06492o1741j88752
3417.7B50788898K42939M21639j51253l17535O72245O65798k97813k67411O53229M18797
3427.4B52829533p08886l77826N27401K67582Q8157K50054j39485j94549K85949P39193
3437B53567123N98870L23448K35443J39999N30377K65369R9488N15480M91676M03347
$$ plain form
3446.7 257170620 256840382 256761932 257401466 258100662 259070034 259515724 259625149 260189209 260549927 260923119
3456.3 260923119 261704845 262379494 262952404 263305054 263340893 263364563 263735790 264633007 265259247 265827847
3466 265827847 266544399 267038479 267734871 268247108 268753319 269580307 270215244 270548840 270936489 271218643
3475.6 271218643 271223984 271796856 272733974 273622437 274414597 275143509 275623589 275897579 276839104 277401466
3485.2 277401466 277973671 279232368 280145798 280868797 281621780 282423134 282701702 283152065 283812065
3493.9 283812065 284266071 285384102 286298313 287136383 287708206 288115005 289228954 290152855 290414867
3502.6 290414867 290586166 291675968 292491226 292985191 294149456 295490913 296210728 296293507 297267609
3511.3 297267609 298112907 298799725 299892063 300377388 300863018 301515598 302467918 303763275 304899979
$$ packed form
3446.7B57170620l30238p8450O39534O99196R69372M45690J09425N64060L60718L73192
3456.3B60923119P81726O74649N72910L52650L5839K3670L71227Q97217O26240N68600
3466B65827847P16552M94080O96392N12237N06211Q26988O34937L33596L87649K82154
3475.6B71218643N341N72872R37118Q88463P92160P28912M80080K73990R41525N62362
3485.2B77401466N72205J258697R13430P22999P52983Q01354K78568M50363O60000
3493.9B83812065M54006J118031R14211Q38070N71823M06799J113949R23901K62012
3502.6B90414867J71299J089802Q15258M93965J164265J341457P19815Q2779R74102
3511.3B97267609Q45298O86818J092338M85325M85630O52580R52320J295357J136704
$$ plain form
3520 304899979 305467777 306082592 307084103 307570190 308613014 310126610 311210327 312029305 312830143
3528.6 312830143 313451023 314428730 315820923 316628342 317287312 317945099 319578228 321154060 321560402
3537.3 321560402 322855072 324005127 324799423 325622444 326724892 327915573 329178810 330382462 330968704
3546 330968704 333166237 334421844 334899750 335685349 336612663 339023552 340029030 340764885 341508102
3554.7 341508102 342696381 344862938 345842476 347431374 349202385 350709229 351735649 353244057
3562.4 353244057 354608574 354719009 357027931 359020119 360529671 361469765 361923294 364319534 365734444
3571.1 365734444 367446785 369513550 371077347 372124710 373713951 375763969 376530113 378209114
3578.8 378209114 379704437 381412430 383652229 385543060 387385406 388576431 391696587 393661804
$$ packed form
3520C04899979N67798O14815J001511M86087J042824J513596J083717Q18978Q00838
3528.6C12830143O20880R77707J392193Q07419O58970O57787J633129J575832M06342
3537.3C21560402J294670J150055P94296Q23021J102448J190681J263237J203652N86242
3546C30968704K197533J255607M77906P85599R27314K410889J005478P35855P43217
3554.7C41508102J188279K166557R79538J588898J771011J506844J026420J508408
3562.4C53244057J364517J10435K308922J992188J509552R40094M53529K396240J414910
3571.1C65734444J712341K066765J563797J047363J589241K050018P66144J679001
3578.8C78209114J495323J707993K239799J890831J842346J191025L120156J965217
$$ plain form
3586.5 393661804 393554726 395643501 396282272 398346786 401142540 403754501 404857292 406069794 409395714
3595.2 409395714 410608864 412949829 415289574 415767708 418232079 420436935 422535362 424836960
3602.9 424836960 426756363 429242401 431687317 433753204 434822769 437797737 438901520 439655380
3610.6 439655380 444994354 446983299 446825180 450758324 451953583 454876060 458762856 460134087
3618.3 460134087 462182045 464032631 466163139 468855400 471409950 474049454 477149200 480096169
3626 480096169 482391701 486660995 489474144 486272964 489474945 493778725 498503990 501385345 502024040
3634.7 502024040 504791641 508156357 511795158 514355087 516545601 519624634 522408295 524636459
3642.4 524636459 526612625 529819565 533378563 537848740 540027008 539214821 543079948 545254593
$$ packed form
3586.5C93661804j07078K088775O38771K064514K795754K611961J102791J212502L325920
3595.2D09395714J213150K340965K339745M78134K464371K204856K098427K301598
3602.9D24836960J919403K486038K444916K065887J069565K974968J103783P53860
3610.6D39655380N338974J988945j58119L933144J195259K922477L886796J371231
3618.3D60134087K047958J850586K130508K692261K554550K639504L099746K946969
3626D80096169K295532M269294K813149l201180L201981M303780M725265K881355O38695
3634.7E02024040K767601L364716L638801K559929K190514L079033K783661K228164
3642.4E24636459J976166L206940L558998M470177K178268q12187L865127K174645
$$ plain form
3650.1 545254593 546878014 547895546 552021942 556845322 561258698 566869965 563396492 564677963
3657.9 564677963 569919052 572696419 574968224 576233368 579597626 581938896 583542900 585801277
3665.6 585801277 587031593 591362419 594641609 594596748 595406494 592883110 595417519 601700935 608002052
3674.3 608002052 607481995 598991623 602411995 608762703 612783165 612140465 613139153 616025925 618249016
3682.9 618249016 619793510 620589790 620886230 623659706 628389511 623267479 622571030 629834328 626264877
3691.6 626264877 625165863 629114838 630161285 632299118 633374596 633408089 634820442 635609779 638100662
3700.3 638100662 640426636 637033348 635860443 639594955 641135483 641112976 641953506 644179306 646840897
3709 646840897 641880035 645448761 650704117 641448975 644104767 647531128 648058167 648988800 651185074
$$ packed form
3650.1E45254593J623421J017532M126396M823380M413376N611267l473473J281471
3657.9E64677963N241089K777367K271805J265144L364258K341270J604004K258377
3665.6E85801277J230316M330826L279190m4861Q09746k523384K534409O283416O301117
3674.3F08002052n20057q490372L420372O350708M020462o42700R98688K886772K223091
3682.9F18249016J544494P96280K96440K773476M729805n122032o96449P263298l569451
3691.6F26264877j099014L948975J046447K137833J075478L3493J412353P89337K490883
3700.3F38100662K325974l393288j172905L734512J540528k2507Q40530K225800K661591
3709F46840897m960862L568726N255356r255142K655792L426361N27039R30633K196274
$$ plain form
3717.7 651185074 652420578 649864578 651110611 655422363 653584442 649919205 652911377 654012985
3725.4 654012985 653592987 652491150 652534409 654872284 655165482 659894714 660038834 653414917 659408875
3734 659408875 660712051 654931717 655433807 657740707 658203659 659550095 662221375 659163666 661152420
3742.7 661152420 670165405 661131668 648393097 657241974 662853317 667909546 665656815 655884171
3750.4 655884171 664787674 664123611 658394928 662329788 664719696 666977615 663474731 665044785
3758.2 665044785 669456177 664425735 663663406 666759338 667928925 667649918 669772491 668303528 664771881
3766.8 664771881 667404861 671194382 671437759 664900055 666369705 669025116 669159012 670274887 670417252
3775.5 670417252 670731659 670442657 672180786 672460098 667212524 668703766 670376968 671228333 672655945
$$ packed form
3717.7F51185074J235504k556000J246033M311752j837921l665237K992172J101608
3725.4F54012985m19998j101837M3259K337875K93198M729232J44120o623917N993958
3734F59408875J303176n780334N02090K306900M62952J346436K671280l057709J988754
3742.7F61152420R012985r033737j2738571Q848877N611343N056229k252731r772644
3750.4F55884171Q903503o64063n728683L934860K389908K257919l502884J570054
3758.2F65044785M411392n030442p62329L095932J169587k79007K122573j468963l531647
3766.8F64771881K632980L789521K43377o537704J469650K655411J33896J115875J42365
3775.5F70417252L14407k89002J738129K79312n247574J491242J673202Q51365J427612
$$ plain form
3784.2 672655945 671100311 670409622 671353149 672346497 673388824 673714142 673274002 672697830 672766800
3792.9 672766800 672413330 673256531 676334457 673762436 669858627 671848068 674838867 679134598 674505539
3801.5 674505539 666364365 669723663 672101669 676589355 681695175 673042679 668495102 672457504
3809.3 672457504 674412537 674666672 674811783 674349442 675287933 679260559 678149796 669230804 672395706
3817.9 672395706 675778275 678770752 681810989 669389572 669131699 673398132 675152664 677149963
3825.7 677149963 677009277 674369812 674640503 675700455 677667618 678600769 672294540 673597107 679190445
3834.3 679190445 675544662 674252472 678792038 672080765 670105438 676948700 674870911 674816513 679846725
3843 679846725 677742767 674374390 676197357 676869659 676539307 677513809 676420593 677459488 681613541
$$ packed form
3784.2F72655945j555634o90689R43527R93348J042327L25318m40140n76172O8970
3792.9F72766800l53470Q43201L077926k572021l903809J989441K990799M295731m629059
3801.5F74505539q141174L359298K378006M487686N105820q652496m547577L962402
3809.3F72457504J955033K54135J45111m62341R38491L972626j110763q918992L164902
3817.9F72395706L382569K992477L040237j2421417k57873M266433J754532J997299
3825.7F77149963j40686k639465K70691J059952J967163R33151o306229J302567N593338
3834.3F79190445l645783j292190M539566o711273j975327O843262k077789n4398N030212
3843F79846725k103958l368377J822967O72302l30352R74502j093216J038895M154053
$$ plain form
3851.7 681613541 678404846 680757904 669810486 668422241 676205826 676276703 675256577 676454010
3859.4 676454010 677095184 678487930 675330734 675290985 679766312 676430740 671761475 674315033 678220215
3868.1 678220215 682184830 676948242 670143967 672882538 677412109 680429459 674265976 674284210 677163849
3876.8 677163849 676794586 678353043 681726913 677926941 671891251 675635529 677258072 678395081
3884.5 678395081 682183075 673459167 673545074 676170731 676121368 679523621 679003677 671761627 673042374
3893.2 673042374 676863022 676230927 676229477 676694794 678364105 679590607 672604065 676513824 679050522
3901.8 679050522 675070343 677421570 674339828 673290405 674197845 675197601 676747818 676029816 675857849
3910.5 675857849 675944061 676838684 677246704 677035904 677800064 677845459 675478897 674019089 677474442
$$ packed form
3851.7F81613541l208695K353058j0947418j388245P783585P0877j020126J197433
3859.4F76454010O41174J392746l157196l9749M475327l335572m669265K553558L905182
3868.1F78220215L964615n236588o804275K738571M529571L017350o163483J8234K879639
3876.8F77163849l69263J558457L373870l799972o035690L744278J622543J137009
3884.5F78395081L787994q723908Q5907K625657m9363L402253n19944p242050J280747
3893.2F73042374L820648o32095j450M65317J669311J226502o986542L909759K536698
3901.8F79050522l980179K351227l081742j049423R07440R99756J550217p18002j71967
3910.5F75857849Q6212Q94623M08020k10800P64160M5395k366562j459808L455353
$$ plain form
3919.2 677474442 677618790 674181595 675370636 675795135 676310577 676509399 674897232 675726013 676366196
3927.9 676366196 676677017 676266403 675647583 676247101 674785538 674137726 675167694 675477905 675789185
3936.6 675789185 676285706 676193771 675316391 674857788 675431671 675251770 673119354 673760681 675179520
3945.2 675179520 675559692 676365509 674386215 674095230 675016708 674028473 675606461 675774689 674402161
3953.9 674402161 674328156 674794159 675222321 675255585 675793228 675091553 675219345 675840454 674937515 675123138
3963.6 675123138 674880295 674478607 674851761 674973450 674720078 674160156 674215088 674635010 674741592 674620819
3973.2 674620819 674403992 674245911 674094620 674202271 675008774 675206909 674960175 675061569 674854355 674851456
3982.8 674851456 674689865 674734726 674725418 674557724 674717255 674400406 674173203 673709564 674403610 675479889
$$ packed form
3919.2F77474442J44348l437195J189041M24499N15442J98822j612167Q28781O40183
3927.9F76366196L10821m10614o18820N99518j461563o47812J029968L10211L11280
3936.6F75789185M96521r1935q77380m58603N73883j79901k132416O41327J418839
3945.2F75179520L80172Q05817j979294k90985R21478r88235J577988J68228j372528
3953.9F74402161p4005M66003M28162L3264N37643p01675J27792O21109r02939J85623
3963.6F75123138k42843m01688L73154J21689k53372n59922N4932M19922J06582j20773
3973.2F74620819k16827j58081j51291J07651Q06503J98135k46734J01394k07214k899
3982.8F74851456j61591M4861r308j67694J59531l16849k27203m63639O94046J076279
$$ plain form
3992.5 675479889 675406189 676017151 675699463 674565811 674380188 674804993 674988632 674649506
4000.2 674649506
$$ packed form
3992.5F75479889p3700O10962l17688j133652j85623M24805J83639l39126
4000.2F74649506
##END=$$ End of the data block
