##TITLE=$$ Begin of the data block
##JCAMP-DX=5.00 $$ ACD/SpecManager v 10.08
##SPECTROMETER/DATA SYSTEM=Varian
##DATE=14 Jan 2013 09:38:36
##DATA TYPE=INFRARED SPECTRUM
##DATA CLASS=XYDATA
##ORIGIN=
##OWNER=
##NPOINTS=3735
##FIRSTX=399.26403809
##LASTX=4000.35498047
##MAXX=4000.35498047
##MINX=399.26403809
##MAXY=73.43698120
##MINY=24.97580528
##XFACTOR=1.0000000000
##YFACTOR=0.000000100000000
##FIRSTY=45.36386490
##DELTAX=0.96440572
##XUNITS=1/CM
##YUNITS=TRANSMITTANCE
##XYDATA=(X++(Y..Y))
399.3 453638649 442105217 433525963 430866737 430772667 436707649 433484688 432721100 438341026 438090439
407.9 438090439 430667877 428792801 430100403 428746834 430545235 432183151 433321457 428429794
415.7 428429794 429878960 438148537 433430099 429610558 430480995 432467346 432793541 430543938 433605995
424.3 433605995 438952065 435663261 428156586 429240799 428725090 425638008 425119247 426405525 430086060
433 430086060 429362755 423919754 420831757 425260811 428370705 425682411 425280380 432088814 436092148
441.7 436092148 431040611 430649147 432988853 435008774 433701324 429058380 426679001 424339867 424291878
450.4 424291878 427024994 430676956 429234238 431114616 432371979 425188942 419434319 415636063
458.1 415636063 420936775 426039848 429612236 427834320 422109108 424803543 425397606 422336388 421238289
466.8 421238289 421702576 422671165 422388153 421576576 421111870 424124527 421186981 420360260 421866798
475.5 421866798 420658112 418079300 414539986 415505104 414176064 414236374 418248253 422000046 423811607
484.1 423811607 419477730 419260674 418188248 415270195 415296326 415261879 415504189 415926437 417452927
492.8 417452927 416478386 416407547 418441391 417155914 415074577 414102440 414302864 416542511 417751999
501.5 417751999 414500046 414175568 415341454 413299713 410952072 411587105 412895546 410487175 409417953
510.2 409417953 408555222 406576576 407593117 410218811 411997414 409932175 408022232 407564240 406295624
518.9 406295624 406407089 406867180 406079102 404690323 405731659 407068367 406526451 406422234 407087250
527.5 407087250 406094017 404511833 405290489 404928131 403680801 403962631 404523392 405634422 407526360
536.2 407526360 407693634 404895210 402112732 400606804 400762863 402688522 404175262 402979813 401100807
544.9 401100807 401189308 400605621 399688644 399383163 399734459 399749222 398422623 398073425 397999039 397390633
554.5 397390633 396518936 396623306 396666451 395158577 393705826 393123169 393572464 394036903 395206184
563.2 395206184 395514069 395495872 395637474 394691658 395285912 396252899 397454948 397430573 396711578 396568527
572.9 396568527 395592384 396537476 396372032 394915314 395032997 395121002 395631943 396336288 397004471 396146889
582.5 396146889 395628052 397091179 398330421 397983627 396892471 396423378 395730934 395836983 396692924
591.2 396692924 398174095 400085258 399926491 398712349 398279381 398478584 398842201 398866997 398670273
599.9 398670273 399343491 399520035 399082108 400145874 400212059 398413544 397023239 396302719 395020866
608.5 395020866 393611259 394127083 394716682 394265976 394569511 394844780 393417892 391954994 391269684
617.2 391269684 391635170 393315468 393767548 393270493 393174782 394707794 396482201 396724091 396779442 396546021
626.9 396546021 396681252 396655731 396941910 398547745 400854759 403811493 405177116 404993095 405382729
635.5 405382729 406873131 407852783 407910423 408909645 410379028 411381187 412945633 415512466 416785164
644.2 416785164 416698570 416872635 417327423 418607712 419841499 420146866 420299149 421055489 421985741 422909470
653.9 422909470 424338150 425020981 424261551 422757263 421880836 421408501 420813751 421637993 422396393
662.5 422396393 423076897 424042053 424206543 424632683 422795868 416384277 420375824 423000679 424982834
671.2 424982834 426526794 427483101 428601952 429157486 429626579 429946098 429748917 429864464 430192719
679.9 430192719 431173630 432702332 434411736 436520157 437829094 438327179 439402390 440291061 440244598
688.6 440244598 440368309 441097260 442136154 443398323 444856110 446000252 446126633 445776825 445983047
697.3 445983047 446405563 445671654 445098152 446557236 448188171 449098129 449803009 450427628 451650200
705.9 451650200 452222977 451909561 452559662 453658943 454586449 456152267 457680130 458443794 459120255
714.6 459120255 459439507 459723778 460673561 460953484 460917397 461255341 461388512 462076759 463852615 465607300
724.3 465607300 466083870 466249008 466486626 466639023 467539825 469200211 470868454 471428146 472464218
733 472464218 474336357 475223122 475646935 475992508 476117096 475666618 475599785 476028252 476910782 478436661
742.6 478436661 479430542 480983734 482223282 482425194 482501221 482674103 483897743 485195007 486158867
751.3 486158867 486968231 487574463 488502769 490613594 492362747 492015533 492249641 492806206 493110199
760 493110199 494238472 495507278 496892014 498326836 500095825 501407585 501876717 502330627 502120514
768.6 502120514 501467209 502011070 502252617 501238098 500969162 501452026 502508049 502892075 502690659
777.3 502690659 502638130 502330818 502844582 503031693 503504601 504670372 505594444 506343002 506097260 506494598
787 506494598 507672577 508045692 508063622 508723564 509179535 509635315 510853539 511114082 510865021 510088348
796.6 510088348 508503532 507171326 506585159 505689354 504417419 504939575 505817032 505361214 503743286
805.3 503743286 501956367 500273132 497911415 495865173 494439354 493312492 492198868 491960182 492380676
814 492380676 491764107 490227661 488399696 486788864 486156998 486247711 485553932 485539513 486696167 487987709
823.6 487987709 490183258 492308006 494342575 496772156 499561005 501559792 502340355 504216042 506805191
832.3 506805191 509809799 513016968 516025314 518297195 519861336 521341324 522241096 524043236 525574036
841 525574036 527305031 529279251 530690498 532948761 534914589 537282906 538318787 538136024 537683640
849.6 537683640 537365875 539472771 541714401 543737106 546167870 548600502 549735641 550327454 551841393
858.3 551841393 553581238 555797920 556151543 555772171 556889229 559101753 560268440 560798988 561540985
867 561540985 560666428 560728035 559569130 557755165 557473679 557000542 556583481 555313225 554817085 554498978
876.7 554498978 554306793 553669891 551975403 551350479 550861168 550059586 548890381 549360123 550590553
885.3 550590553 550508423 548536797 545667953 544553490 543042641 541785507 541305809 541003723 540679665
894 540679665 540171089 540795822 540412750 539113846 537614403 536363983 535410652 533980179 533250961
902.7 533250961 533573761 534553909 535541496 537656784 539812622 540815353 541502419 541509132 541437950 541239204
912.3 541239204 541478577 541525307 541543884 541706505 540940781 539263115 536460381 533857193 531399040
921 531399040 529106445 527060547 526008072 525477066 523420525 520610123 517894096 516089859 513591843
929.7 513591843 510528183 508079529 506379204 505750313 504305000 503235130 503162270 503020287 501660233
938.4 501660233 499617310 498579865 496404648 494114685 492988853 491920166 491139679 490630569 489948845
947.1 489948845 489118843 488177452 486450882 484901619 483596535 482352219 481205635 479654427 478258858
955.7 478258858 476895828 475814819 474003334 471225319 468490715 465666885 463232841 461230431
963.4 461230431 459643211 458807831 458134232 456976013 456053123 454721527 452550240 450277786 447451248
972.1 447451248 444881973 442739143 440631371 438738518 437513504 436113167 432877731 429354134
979.8 429354134 426038361 421536484 416581230 412812767 409786682 406846581 403969574 400577507
987.6 400577507 396870041 393404045 389747734 385444832 381707878 378368759 375287743 372512321
995.3 372512321 369782448 367421227 365058899 363713036 362052650 358910065 355338631 352693901
1003 352693901 350922890 348861809 347394295 345506668 343820992 342502098 340499153 338448372 336320114
1011.7 336320114 334346046 331812134 329725533 328508453 327617912 326161919 324604187 323589287
1019.4 323589287 321395111 318934135 316450386 314876766 313373299 312057953 311596870 309910851
1027.1 309910851 308930626 307951202 306864586 305497417 303973083 303369274 302863522 303624268 304545307
1035.8 304545307 305790062 306860771 307841930 309001331 310496311 312376938 312871647 313878136 314630394
1044.5 314630394 315826683 316807022 316763477 317938175 317786617 316578522 314762859 313606148 313374081
1053.1 313374081 312221317 311466503 311506538 311640320 310913582 310703449 310922489 311771431 312811165
1061.8 312811165 313793411 315078316 315900345 318339558 320083313 321166039 322615547 324000473 325778236
1070.5 325778236 326212959 326278725 326162071 326432648 326481857 326474571 327875938 329306450 329801979 329684410
1080.1 329684410 330643845 331354179 332015648 332677307 333388367 334318123 334431343 335623283 336859856
1088.8 336859856 338553276 339219780 339385567 340922585 341522598 342445259 342989426 344159279 345063362
1097.5 345063362 345004692 346027336 346826019 347652054 348240013 349237747 349325294 348932304 349674149 350569878
1107.1 350569878 351793900 352447777 353324318 353415985 353181915 353750229 354806938 356300697 356816254
1115.8 356816254 357714005 358152771 358217201 358819313 359571915 360340118 360241814 360371017 360375175 360906563
1125.5 360906563 361954956 363075600 364362450 364868126 366162453 368341293 369965477 370861816 372267647
1134.1 372267647 373843193 375449219 377352448 379175873 381223068 382453232 383865509 385427284
1141.9 385427284 386228447 386440468 386481552 387308578 388014679 388648911 389207993 389741211 389828186 389789772
1151.5 389789772 390633202 390222206 389312439 389258308 389371109 389279976 389114914 389102859 388548813 388017235
1161.1 388017235 387631073 387589455 387779160 388076172 389066963 391060753 394148216 397044220 399868813
1169.8 399868813 402439575 405006905 407617798 410158386 413113556 415973473 418876305 421597214
1177.5 421597214 424676361 427888336 430905380 434144745 437379799 440013084 441825790 443672066
1185.3 443672066 445377197 446912498 448415565 450022430 451819572 453196945 453574753 453446579 453271370
1193.9 453271370 452583351 451853561 451076584 450189209 449364243 448652039 448099976 447448387 446463737 444927826
1203.6 444927826 443373833 441907768 440709343 440009384 439168358 438516502 438667030 438931999 438536911
1212.3 438536911 438007202 437590179 436893234 436161385 435464516 435140800 434983864 434916115 435378456 435355988
1221.9 435355988 434868927 434522133 434077301 433595581 433185387 432630196 431768608 431316757 431152267 430824089
1231.5 430824089 430416412 429710274 429190025 428698082 428292542 428205070 428185196 428463097 428467369 428258705
1241.2 428258705 428082390 427767105 427334213 426965828 426869965 426359024 425947609 426003075 425867577 425573692
1250.8 425573692 425389786 425494003 424926872 424070358 423887253 423624268 423486595 423488922 423494492 424188843
1260.5 424188843 424786797 424578171 424318657 424489212 424713593 424864426 425385933 426303673 427685165
1269.2 427685165 428843765 429371376 430224419 431432838 432712822 433570061 434036064 434752731 435997467
1277.8 435997467 437284546 438320465 439659691 440973816 442144356 442972450 443887444 445180626 446220703
1286.5 446220703 447085114 448041534 449610291 451255836 452447205 453054237 453671608 454536858 454946709
1295.2 454946709 455061302 455224457 455952911 456602020 457253952 457666283 457584305 457835083 457808037 457630768
1304.8 457630768 457240448 456712303 456097527 455446053 454777145 454261169 454427757 454104347 453305130 452548752
1314.5 452548752 452026749 451207886 450120773 450261879 450884399 451809959 452951241 453911095 454694252
1323.2 454694252 455314255 455672874 455491295 455688286 455664787 455552444 455350266 454758263 454572678 454509468
1332.8 454509468 454409904 453590355 452802925 452298851 451830673 451854286 452110558 453272820 454283409 455172424
1342.4 455172424 455879593 456234283 456802788 457073517 457396431 457730522 458384628 458646049 458590736 458585396
1352.1 458585396 458186340 457967796 457613411 457285461 456571312 455811882 455221291 455009804 455136299 454697914
1361.7 454697914 454356537 453555298 453633690 453577232 452676048 452269592 451929092 451564064 450787048 450621910
1371.4 450621910 450948524 451026497 450921822 450372505 450284576 450213394 450492668 450561180 450855141 451132774
1381 451132774 450611115 449841423 448472824 447709999 447031631 446311874 445054283 444019203 443451309
1389.7 443451309 442164040 441854973 441176605 439668083 437003860 434328537 433730202 432327652 430561028
1398.4 430561028 427697144 426168938 425428543 423848610 422652931 420879402 418067627 415989494
1406.1 415989494 414772301 413009720 410886002 409053802 407385712 406442528 405054245 403889618
1413.8 403889618 403005333 401593552 400315094 398699226 398223495 396710510 395825233 396426735 396250801
1422.5 396250801 396262779 395737839 396173439 396529083 395976257 396330376 396680679 397211494 397495956 398845901
1432.1 398845901 400296326 401143265 402524109 403491249 404657402 405874977 407939186 409245682 410605125
1440.8 410605125 412504349 413896713 415774536 416855087 418495674 419915695 421300583 422860374
1448.5 422860374 424214516 426162148 426966591 428585243 430048027 431560211 433086166 433562088 434636154
1457.2 434636154 435762825 439725342 441900520 444162025 445970955 447363701 449087029 449767838
1464.9 449767838 453380852 455755272 458092270 460509796 462738953 465339012 466884689 469855957
1472.6 469855957 472720871 475983582 478866348 481465187 484431725 486502724 488154068 489559975
1480.3 489559975 491273994 493008080 494354591 495503464 495870667 496470146 496602287 495746346 495946579
1489 495946579 494495544 494548302 495390892 495349770 494497833 493360023 492246590 487696686 487551346 486451874
1498.7 486451874 484226189 484076958 483129387 482349091 481303520 481159744 479871178 474890022 473399773
1507.3 473399773 474825401 476104965 475160599 475631142 474711533 473687363 473778992 472885590 472230110
1516 472230110 470172844 469202538 470002289 471083755 469136543 466422005 468266411 469522934 470529747
1524.7 470529747 468581161 468716469 468976974 468106880 468043518 467733994 467479172 467031136 466581078 465096397
1534.3 465096397 466645622 467169418 466888695 467407455 462203026 461583824 463594284 464809837 464668007
1543 464668007 465361481 466240463 465144958 466474953 466430244 466457062 465736809 464764328 465429993 465489311
1552.7 465489311 466194725 463447037 463690224 464663849 464538345 462068634 456031189 459681435 459257736
1561.4 459257736 460135841 459383163 458720245 457154541 455238266 454287376 451659431 450306587 444047432
1570 444047432 443444710 442552185 439505959 437203026 434360428 432541199 422950096 422621155 420687180
1578.7 420687180 417425652 414524841 409967232 406934547 402125740 399150391 394964142 391513939
1586.4 391513939 388108215 383482285 380649338 376243134 373951569 369157982 366240959 363198700
1594.1 363198700 359210777 357066803 352748222 351065331 347618866 345788231 342775803 339816322
1601.9 339816322 338308258 335312386 334466629 331142654 329871712 326953468 325561867 324352570
1609.6 324352570 321576157 321708145 319022865 318669949 316668148 316764755 316429844 310565701 312367039
1618.2 312367039 311001015 311665726 310239086 310666485 310066490 308359337 309775543 308827648 310082607
1626.9 310082607 308075180 309016819 309487362 309976635 310936241 310259819 312024651 311480350 312620335
1635.6 312620335 311194954 312998524 314216805 314707699 316956139 317332840 319686584 319855881 321482735
1644.3 321482735 322545090 322180634 325398903 324493332 328169174 329054413 331551590 332930908 332665672
1653 332665672 336942444 336363564 340309410 341352158 344003830 345525818 347550125 349701004 351259384
1661.6 351259384 355333061 356515045 359676704 362051849 365227394 367830009 370061760 372849617
1669.4 372849617 373674126 378341713 380876808 384931679 388245049 391204262 395073242 398394279
1677.1 398394279 402760849 405010109 409055901 412131424 416226845 420457115 420891495 427963295
1684.8 427963295 430257874 435871277 439815521 443344002 447610703 451505737 456270142 460329781
1692.5 460329781 464936447 468965225 473250351 475411987 480684776 486620636 491775246 496921120
1700.2 496921120 496257019 502973824 508107948 512267609 515874405 519295998 522636719 526154861
1707.9 526154861 530721092 533329582 535906639 539039345 541473160 544313698 545780945 547870216
1715.6 547870216 551474953 553435287 552684746 556448059 559671631 561725197 563676186 565191040
1723.4 565191040 566613083 568637238 571029510 572602196 574048996 576161613 576668892 577384491 580210190
1732 580210190 582727089 581620522 580758095 585380211 588960495 590836830 593461685 594495697 594233322
1740.7 594233322 598050957 600845261 601947174 604250870 607569885 610144196 611970634 614204597
1748.4 614204597 616307716 620794334 623166389 624836617 629449463 632499275 635502968 638665581
1756.2 638665581 639784508 641722107 644297638 646541672 649289932 649794312 650801620 653780060
1763.9 653780060 655681839 657834244 660104218 661661301 660578232 662037048 664733353 664490814
1771.6 664490814 663967896 664872818 669073410 671180191 671309967 673675766 674700928 675974274 676168213
1780.3 676168213 675955963 677562332 679319763 681013107 681062698 681788483 683475266 684580383 685343323
1788.9 685343323 686708603 686596451 686305466 685932312 686177826 689584732 690828552 691132126 692741089
1797.6 692741089 694183426 693965149 692666473 694630432 695192413 695948334 697527237 698718338 700213470
1806.3 700213470 700916977 701534271 702076797 702987976 702241669 702553787 703463821 703788986 705506668
1815 705506668 706314163 707180786 707325058 707826996 708584213 708624725 709556351 709372177 710058136 710738449
1824.6 710738449 709875412 710457077 712134018 713735809 713375778 711648178 712208786 714038773 714536743
1833.3 714536743 715051956 715749359 716176758 716745300 716655807 717603073 717541122 717819901 717902069 718505478
1842.9 718505478 719631653 716437531 718539734 720392609 720651321 720726242 720879364 721668777 721563644
1851.6 721563644 722134705 722081985 722455597 723036346 723394012 723938599 723892059 724849167 724830017 724816742
1861.3 724816742 724536514 724385300 724832916 724678955 724906387 724655380 725728760 725617218 725186539
1869.9 725186539 726193619 726604843 727122803 726987686 727305756 727392502 727914276 728645020 728938599 729048080
1879.6 729048080 728785553 729346542 728899536 728681259 728483276 728527985 729349518 729717026 730887222 730592422
1889.2 730592422 729740829 730300369 730767517 730543213 730390472 730509872 730008850 730842819 731456604 731740494
1898.9 731740494 731795044 731773758 732138748 732001953 732323151 731962280 731858826 731902542 732170410 732839127
1908.5 732839127 732758713 732746506 732657928 733264999 732767258 732449112 732638474 732650986 733638306 732946091
1918.2 732946091 733097992 733766785 734063263 733984604 732908401 732897720 733155746 733576965 733443069 733684006
1927.8 733684006 734075241 734229431 734369812 734005966 734175720 733604050 733262405 733084488 733076019 733249359
1937.5 733249359 733209305 733749084 733536682 734190598 734175720 732976532 733133621 733069992 732963257 732981491
1947.1 732981491 733646851 733641510 733462448 733482437 733295441 733331299 733166046 733247375 732779617 732894135
1956.7 732894135 732794952 732368851 732911224 733221817 733352737 732769394 732405624 732364426 732322006 731960907
1966.4 731960907 731350555 731513367 731728058 732357559 732589493 732914658 732829056 732180023 732019043 731627045
1976 731627045 731733246 731792374 731959000 731723099 731428680 731774902 731889572 731866913 731051025 730793991
1985.7 730793991 730873489 730837936 730614853 730336075 730845642 730573349 730241013 730457077 730826950 730608444
1995.3 730608444 730066452 729950943 729490204 729424210 729488068 729674530 729454498 729285126 729154129 728528442
2005 728528442 728488312 728133163 728197174 728402405 728408203 728298035 727974777 728245697 728286819 728171768 727519760
2015.6 727519760 726906357 726411209 726360550 726894913 726878357 726844940 726366882 726331177 726098251 725728531
2025.2 725728531 725692749 725237427 725274048 724838181 724662628 724701309 724686813 724633179 724276047 724112320
2034.9 724112320 723454666 723427582 723416290 723335037 723180313 722703552 722610779 722439346 722506256 722184982
2044.5 722184982 722437744 722372589 721709290 721515503 721050034 721185760 721336975 721718597 721733551 721290894
2054.1 721290894 720987930 720777283 720857010 720337296 720238037 719930725 720042877 720269089 719946442 720334702
2063.8 720334702 720265427 720171890 719608688 719385376 719197388 718563004 718708801 718559875 718773346 718862076
2073.4 718862076 718963699 719011536 718717957 718465271 717931519 717788696 717682800 718004227 717787628 717670517
2083.1 717670517 717829895 717364044 717524261 717370605 717233810 716972504 716738129 716634064 716634979 717109070
2092.7 717109070 716944275 716688995 715934601 715445938 715385666 715421829 715519714 715122681 715215988 715129776
2102.4 715129776 715046310 714925308 715266953 715417175 714775391 714627075 714070282 713893814 713790359 713886108
2112 713886108 713964539 713787384 713987656 713672638 713668289 713076248 712791824 712801437 712651749 712900772 712383575
2122.6 712383575 712362900 712348557 712494736 712386703 712055664 712033157 711805038 712178955 711577072 711564713
2132.3 711564713 712045364 711775284 711870270 711846085 711948700 711759415 711751480 711340256 711076660 711525955
2141.9 711525955 711567383 711518555 711435089 711944122 712137375 711817627 711182480 711041260 711346893 710906372
2151.5 710906372 711218491 711839447 712116241 711619415 711429672 711639862 711213989 711244278 710993042 711012344
2161.2 711012344 711024933 711192017 711547165 711419601 711577835 711586609 711798935 711429291 711160660 710954361
2170.8 710954361 710845184 711615982 711772385 712105789 712086945 711957932 712169113 712444305 712661209 712256851
2180.5 712256851 712048569 711671143 712047195 712537155 712497330 712354279 712230682 712679901 712681427 712734146
2190.1 712734146 712432861 712414856 712760162 712772751 713097000 713209076 713337860 712769012 712752991 713158493
2199.8 713158493 713240509 713386459 713151169 713589325 713666763 713994598 714324188 714073105 714096375 714094315
2209.4 714094315 714277420 714018478 714316788 714467392 714275360 714070435 713871613 714303741 713833008 713672714
2219 713672714 713763123 713840179 714139862 714509506 714988785 714612808 714721985 714527969 714239578 714371033
2228.7 714371033 714351349 714581528 714825745 715110550 714631424 714737930 714715271 714143677 714109268 714136505
2238.3 714136505 714616699 714520264 714570618 714514084 714565964 715014038 714620514 714506989 714338303 714493103
2248 714493103 714604492 714304047 714492874 714728317 714673233 714548035 714744415 714744415 714776840 714535446 714450760
2258.6 714450760 714524155 714408722 714573288 714227142 714307175 714535828 714751282 714824829 714743652 714805145
2268.2 714805145 714444199 714830551 714799881 714609070 714397430 714165421 714676971 714514999 714322968 714184952
2277.9 714184952 714576569 714672165 714425583 714619064 714413834 714477997 714327621 714485016 714233627 714001999
2287.5 714001999 714229202 713879623 713760757 713375168 713677902 713460007 712978134 713156128 713085632 713225250
2297.2 713225250 712727432 712705688 712240982 711753922 712072754 712159576 712233047 711490021 711197662 710920258
2306.8 710920258 710682068 710480194 710188065 709857559 709146423 709824600 709628220 709241943 709110260 708370590
2316.4 708370590 707820587 707191772 707405243 706820908 706630783 706380844 705623550 704834824 704271927 705035782
2326.1 705035782 704280014 704374390 704544754 703858795 703657761 703641815 703632431 702718430 703604965 703500214
2335.7 703500214 702715759 702667694 703033447 703020401 701900711 702945328 702573395 702540054 703090973 703044357
2345.4 703044357 703652039 703690720 704569397 705020370 704609909 702696762 701505280 701608963 700392761
2354.1 700392761 700101547 699486008 699004974 698670197 699262772 698891449 697619553 697916107 696505127
2362.7 696505127 695876236 695785980 697528610 699586182 700271759 701168900 700826874 700193100 700528030
2371.4 700528030 701867142 701906052 702501755 703287506 703308105 703998871 704386673 705168839 705275345 705328217
2381.1 705328217 705763016 705671921 705505676 705655365 706459732 706516342 706341782 706033325 705824280 705962219
2390.7 705962219 705569382 705447006 704929810 704622040 704722519 704887466 704836273 704492111 704562759 704197464
2400.3 704197464 704053268 703559036 703000641 702946701 703069153 703309784 702737961 702730179 702551575 702263718
2410 702263718 702285233 701847687 701884842 701848373 701567917 700835876 700400467 700213699 700088959 700426788
2419.6 700426788 700327072 700502090 700320969 699511566 698919067 698830109 698863907 698494797 698119278 697703552
2429.3 697703552 697836533 697923203 697671585 697474823 697135315 696792984 696409302 696146393 695978622 696014175
2438.9 696014175 695571060 695210724 695260925 695304108 695250397 694463806 693930817 693388214 693419495 693725433
2448.6 693725433 693273544 692955322 692186203 691746368 691695786 691909485 692051392 691511688 690868149 690161438
2458.2 690161438 690045853 689937363 689952393 689769821 689354706 689313812 688967209 688686676 688278122 688307648
2467.8 688307648 688096619 687392502 686911240 686334381 686203156 686082382 686213837 686076355 685584259 685151825
2477.5 685151825 684579620 684118347 683467178 683136597 682722168 682376862 681886749 681734772 682156143 681642609
2487.1 681642609 681173477 680626907 680293732 679945679 679215088 678981094 678662109 678516388 678230743 677919388
2496.8 677919388 677483978 677221451 677291718 676682053 675810089 675134277 674915237 674252930 673789368 673723450
2506.4 673723450 673417435 673461456 673221207 672960434 672340546 671849823 671663895 671205444 671005096 670496674
2516.1 670496674 669914780 669600449 669397964 668846359 668750992 668852921 668245926 667990646 667858734 667808609
2525.7 667808609 667391510 667189178 666964569 666060638 665689163 665307007 665327377 665138474 664459686 663996277
2535.4 663996277 663624573 663537827 663035660 662696686 662468338 662110901 661752853 661481094 661351471 660926895
2545 660926895 660554810 660063629 659818573 659420013 658994980 658681641 657959824 657626038 657497177 657692871
2554.6 657692871 657534027 657029190 656612701 656122284 655910645 655460129 655329208 655170212 654733429 654410934
2564.3 654410934 654492569 654778519 654208603 653657303 653274612 652770767 652094193 651502762 651065063 650708542
2573.9 650708542 650948792 650667114 650110779 649947968 650040741 649854736 649086761 648669815 648446960 647986298
2583.6 647986298 647417221 647429352 647275543 646800079 646637726 646346207 646047897 645555801 645248566 644544220
2593.2 644544220 644087601 644103012 643479309 643319931 643274002 643164749 642625656 641879730 641326447 640663452
2602.9 640663452 640468979 639906044 639322777 638773346 638397141 638348312 638361053 638388481 637413063 636714668
2612.5 636714668 636185684 635590286 635445976 634876175 634256363 634030571 634051743 633510170 632909241 632402573
2622.1 632402573 632045784 631985245 631301994 630778732 630413895 629912033 629316406 628913307 628613091 627932320
2631.8 627932320 627461128 627164993 627023811 626341743 625677261 625544662 625169449 624870682 624365616 623959389
2641.4 623959389 623666763 623137894 622373085 621613884 621334000 621280251 621067200 620294952 619694901 619558754
2651.1 619558754 619290848 618670349 618222389 618056297 617634964 617276421 616681213 616361580 616227989 615675507
2660.7 615675507 615200462 614890556 614721260 614343338 614087410 613422394 612797737 612844810 612505455 611950798
2670.4 611950798 611474190 611294594 610648193 609928665 609684181 609558144 609553795 609158096 608945580 608345108
2680 608345108 608039246 607877769 606784363 606184120 605749321 605688400 605789490 605397758 604817734 604451485
2689.6 604451485 604440575 604027557 603574181 603066292 602497635 601692657 601421356 602108765 602008514 601280899
2699.3 601280899 600897827 600914688 600409546 599745407 599179916 598763809 598857422 598403053 598203087 598183899
2708.9 598183899 597774544 597038727 596389542 596146622 595678940 595671654 595178146 594508972 594372330 594195213
2718.6 594195213 594300995 594323502 594320259 593550186 592699394 592403793 592151489 592035904 591648827 591455841
2728.2 591455841 591462440 591503334 591154480 590731087 590354996 589618034 589204369 588954849 588966217 588851013
2737.9 588851013 588715668 588669548 588695869 588864250 588431053 588007584 587408829 586985779 586820793 586606407
2747.5 586606407 586646080 586414833 586208191 585756302 585301666 584986610 584859238 584816742 584567757 584604607
2757.2 584604607 584341354 584065056 583788223 583677025 583683510 583413010 582997284 582121925 581587067 581400681
2766.8 581400681 581736107 581457787 580621338 580699234 580406952 579990921 579366837 578923836 578898010 578376961
2776.4 578376961 577727966 577486610 577515793 576602402 576142273 576116295 575536804 575137482 574710197 574563446
2786.1 574563446 574050636 573765869 573777046 573205376 572771873 572525787 572056770 571198616 570535851 569811668
2795.7 569811668 569271851 568951340 568506737 568314819 567874031 567150993 566215057 565709801 565094147 564040604
2805.4 564040604 563534660 563375092 563103867 562675209 562628555 561813965 560672493 559837036 558920364 558421860
2815 558421860 557258682 556446495 555737228 554978828 555034981 554410133 553747482 553370132 552732239 551424828
2824.7 551424828 550153809 549440079 548520164 547812119 546827393 545831604 545392685 544738007 543511734
2833.3 543511734 542625923 541959648 540552788 539487343 538485794 536967201 535524101 534337273 532900238
2842 532900238 530693703 528441391 526412392 524745445 522988777 520551682 517838936 515622597 514287376
2850.7 514287376 513181877 512296638 511781273 511239662 510536995 510427933 510761604 510614967 510021210
2859.4 510021210 509617195 509902344 509857674 509935951 509975319 509080887 507999268 506567421 505813789 505551109
2869 505551109 504834900 504143410 503542137 502974167 502423325 501957741 501193085 500654564 499954948 499026718
2878.7 499026718 498462868 497965279 497823334 497230225 496641960 496017799 494710960 493306122 492001953
2887.3 492001953 491263962 490468597 489644852 488773994 488001137 487456894 486669960 485735168 484255753
2896 484255753 483209076 482220383 481243019 480719490 480056229 479963989 479418411 478175659 476921692 476057281
2905.7 476057281 475415421 474358978 473564987 472761459 471797104 470678864 469558754 468441086 467257729
2914.3 467257729 466014481 464406242 463079834 461473465 459749107 458615685 458028946 457541885 456513634
2923 456513634 455911179 455613136 455592308 455887299 456033058 456371613 456765594 457038345 457193832 457363319
2932.7 457363319 457293816 457509575 458005829 458469353 459541931 460526733 460946159 461370468 462067223 462639999
2942.3 462639999 463316422 463993187 464555130 465394630 465780029 466174164 466564369 466443024 466618462 467272720
2952 467272720 467628670 467669373 468154678 468660927 469069405 469233322 469541512 469962578 470261459 471467972
2961.6 471467972 472140656 471895409 472044029 472641792 473265152 474209061 475234718 475331726 475624313 476199074
2971.2 476199074 477136269 478149757 478529816 478996086 479045906 479320221 479920311 480540314 481090317 481320801
2980.9 481320801 481346321 480929985 481141548 481526680 481843262 482048073 481896477 482133636 482307854 482570953
2990.5 482570953 482640533 482731323 482756767 482154121 481467743 481379128 481825256 481227608 480476799 480175781
3000.2 480175781 480145454 480317535 479765396 479450989 479001694 478386650 477893791 477070541 476446495 476008263
3009.8 476008263 475473404 474885826 474865608 474470901 473708115 473409042 472929459 472179146 471124268 470251999
3019.5 470251999 469399605 468737564 468429718 467645416 467008514 466861572 466395264 465274887 464081955
3028.1 464081955 463426094 463429146 462583275 461101608 460605354 459967384 459363441 458917236 458340187 457700081
3037.8 457700081 456521645 455654831 454898262 453893890 453237495 452762489 451825752 450895119 450293770
3046.5 450293770 449363518 448478813 447873001 447225990 446012917 445058289 444766617 444087715 443450928
3055.1 443450928 442805824 442018852 441179810 440313911 439469910 438607712 438254128 437869263 437054634 436111412
3064.8 436111412 435575867 435275612 434621391 433851089 433067513 432415276 431612282 430453644 429382896
3073.5 429382896 429132767 429056053 428397179 427855835 427042694 426256371 425801506 425163727 424339714 423413696
3083.1 423413696 422658691 421835480 421160851 420733757 420272522 419522629 418802376 418485527 417984695 417286682
3092.7 417286682 416528778 416114235 415595093 414526024 413608131 413086166 413001366 412589951 411767387 410856857
3102.4 410856857 410073814 409182167 408049316 407568092 407218742 406828728 406244125 405220146 404462891
3111.1 404462891 404014778 403620300 402793427 401733627 401007957 400567131 399946327 399334755 398554115
3119.8 398554115 397462463 396814423 396041031 395222244 394568481 393889580 393144073 392402382 391987534
3128.4 391987534 390961571 389828796 389001884 388366699 388191338 387787323 387025948 386074371 385648994
3137.1 385648994 385063286 383881798 382979889 382200966 381537933 381019821 380488930 379438782 378621521
3145.8 378621521 378197708 377373428 376415825 375437126 375146523 374963531 374122925 372981911 371970100
3154.5 371970100 371279564 370553055 369984703 369238777 368271141 367268219 366475601 365790901 364889183
3163.1 364889183 364243202 363608437 363116913 362575989 361897659 361012726 360060425 359392281 358389816
3171.8 358389816 358000755 357578506 356502953 355795021 355320816 354821472 353818855 352907295 352077866
3180.5 352077866 351504021 351194115 350532150 349955978 348876839 347931938 347591286 347159767 346515503
3189.2 346515503 345716400 344892807 343707390 342829819 342451248 342023811 341463318 340647697 339942665
3197.9 339942665 339827232 339649353 338663788 337557335 336627998 335926208 335256996 334552956 333990555
3206.5 333990555 333415451 333068733 332185097 331288109 330827713 330331650 330056076 329233589 328180695
3215.2 328180695 327544708 327117653 326510582 326067123 325492020 324483795 324299507 323887024 323256683
3223.9 323256683 322752876 321865654 321403160 320824051 320170250 319479485 318883209 318426666 317758751 317456665
3233.5 317456665 317013474 316690922 316311474 315276146 314656219 314452915 314073467 313286667 312354755
3242.2 312354755 312113361 312089481 311690006 311410637 310795708 309983406 309539185 309004288 308365498 307899017
3251.9 307899017 307715912 307286091 306803703 306579704 305981064 305150452 304515343 304139938 303772793 303579025
3261.5 303579025 303236198 302667007 302293835 301908550 301998005 301855087 301142673 300746231 300385399 300016518
3271.2 300016518 299780712 299257603 298590717 298384323 297949104 297439899 297292385 296809788 296401310 296074524
3280.8 296074524 295848103 295685120 295076752 294702625 294584045 293947868 293431950 293285332 292853203 292778778
3290.4 292778778 292715263 292241955 291919708 291655178 291304283 290762672 290802689 290674953 289707222 288988552
3300.1 288988552 288647785 288646927 288776894 288912296 288546181 287990875 287351322 286411686 286046143 285378838
3309.7 285378838 284871788 284801311 284422340 284375877 284029503 283451843 283073406 282680836 282111835 281384888
3319.4 281384888 280825157 280540771 280557384 280133209 279299088 278577461 277817936 277079163 276720009 276472874
3329 276472874 275593166 274698505 274093609 273582497 273385048 273230934 273089848 272769127 271739330 270706387
3338.7 270706387 270470772 270110607 269392109 268871803 268296261 267810192 267611465 267237320 266501980 266128197
3348.3 266128197 265959320 265720100 265272141 264399796 264052715 263859253 263257961 262540417 262259789 262569370
3357.9 262569370 262441540 262124977 261808338 261107674 260334206 259869118 259588566 259200878 258823299 258438511
3367.6 258438511 258301411 258185749 257903576 257624722 257439842 257261314 256660767 256026077 255441341 255127316
3377.2 255127316 255137959 255279465 255453377 255187378 254839725 254123363 253396740 252979431 252847309 253216381
3386.9 253216381 253163986 253320370 253236523 252470932 252216949 252096195 251980400 251917000 251941128 251969624
3396.5 251969624 251532803 251033592 250998096 250931320 250752468 250785732 250515366 250395470 250427532 250270901
3406.2 250270901 250065861 249758053 249998074 250243740 249989624 249822636 250136890 250565758 250608082 250658169
3415.8 250658169 250613003 250711422 250983429 250657291 250117931 250226364 250442104 250442753 250915890 251370544
3425.5 251370544 251431198 251643715 252017727 252071648 251935673 251761169 251439934 251880188 252718792 253078289
3435.1 253078289 253356209 253685837 253766136 253744354 253868732 254160175 255174217 255621166 255410614 255699234
3444.7 255699234 255840511 256526146 256883984 256895504 257477360 258086834 258969288 259347668 259524727 259842911
3454.4 259842911 260188446 260633488 261105709 261867676 262135582 262485466 262981815 263433533 264359474 264954472
3464 264954472 265351257 265745716 266231480 266879539 267462254 268050480 268622971 268971977 269394417 270319653
3473.7 270319653 271081848 271886902 272849102 273254929 273164024 273400269 274217014 274914227 275706654 276245251
3483.3 276245251 276863728 277913246 278715019 279578819 280187149 280667934 281325302 282091255 282640209
3492 282640209 282894745 283836708 285025425 285985126 286533871 286929741 287444115 287762966 288878059 290293465
3501.6 290293465 290952320 291815395 292652035 292877274 293749428 295103512 296041908 296806374 297365246
3510.3 297365246 298138771 298809910 299213696 300196991 301484661 302407494 303228893 304183960 305071259
3519 305071259 306036873 306861534 308044758 309296055 309337139 309263916 309982491 311619396 313308620 314369221
3528.6 314369221 314958744 315901623 317167358 318071804 319066982 319427586 320405083 321967697 322811852
3537.3 322811852 324100533 325086060 325949364 327105484 328789482 329919891 330388184 331374512 332339439
3546 332339439 334225693 335207138 336579857 338044815 338474655 339851379 340674629 342294312 343832550
3554.7 343832550 345162735 346783104 347607460 349715652 351576004 352744484 353696518 355133057 356373444
3563.4 356373444 356970100 359394569 360719299 362305145 363186378 363590126 366465988 368353119 369882393
3572 369882393 371221008 373073120 375117226 376859665 378938179 379749985 381551476 383434410 384783783
3580.7 384783783 386646843 388336334 389790993 390757065 393644905 396166267 396866302 399136620 400556602
3589.4 400556602 402568893 404720230 407388725 409594078 410815582 412798233 413029251 415632553
3597.1 415632553 419016762 419960289 422184944 424254227 426109924 428769836 431110001 433031387
3604.8 433031387 435165672 437481422 438011055 441716423 444807205 445239143 449832306 451881981 452505264
3613.5 452505264 456384850 456994743 459456825 462821999 465030594 467665520 468409119 470520477 473884735
3622.2 473884735 476618767 479273834 482258301 484902077 488097343 493786011 496333771 491456184
3629.9 491456184 495016861 499838638 504502678 507064819 507696533 511342964 515310936 518370934
3637.6 518370934 520501289 522448196 525409355 528442039 530582314 532558670 535756721 539277954
3645.3 539277954 543869019 545220528 545031509 550579185 551808090 552579002 554166832 558855247 563272209
3654 563272209 566728783 572447891 569102287 570799637 575954323 578026009 581013718 582976341 585993805
3662.7 585993805 587953568 589741325 592108459 593662567 598351593 600646782 600551033 601957245 600086136
3671.4 600086136 603342705 609281006 615859795 616489792 606359177 608300056 615095978 620059662
3679.1 620059662 619327507 620278358 622777710 624781113 626469116 626928444 627142334 630201912 635790596
3687.8 635790596 631330414 629750061 636548843 633242760 632363052 636428413 637490921 639155731
3695.5 639155731 640256882 640233307 641276093 642408905 645242310 647277908 643440475 642518616 646550369
3704.1 646550369 648393555 648286514 649151611 651508942 653442307 647987747 651775818 657870941 649214706
3712.8 649214706 651576385 655101929 655614243 656193466 657641830 658911362 656480865 657405853 661804886
3721.5 661804886 659628677 655770416 658649292 660529938 660943298 659690704 659723053 662078476 662868271
3730.2 662868271 667183533 666041718 659693680 665474548 665213699 660357895 662832031 664029465
3737.9 664029465 664484177 665935211 667756577 665493088 668078613 677753448 671088028 657067490
3745.6 657067490 664312820 668635178 673262711 670801773 661915054 669440842 666508713 663401260
3753.3 663401260 668917007 671829681 673839417 670231171 671747742 676577606 671920013 669998550
3761 669998550 672886124 674522705 674474716 676593475 675571594 672144089 674056931 677627563 678322601
3769.7 678322601 671728439 672978897 675799332 676278152 677673874 677693710 677890930 677162628 678569641
3778.4 678569641 679968414 674772415 675867615 677348175 677618942 678932419 677318344 677195969 678695450
3787.1 678695450 679423218 679658279 679524536 679421921 679063339 679677887 679861221 680409012 682613297
3795.8 682613297 680066986 676768723 678213654 681013718 685055695 681040573 674001846 677421265
3803.5 677421265 679558563 682740097 687580185 680031509 675875549 680163116 681731415 681641083 681759872
3812.2 681759872 681562881 682552032 686286240 684830170 675262222 678887100 682640533 685280151 687445145
3820.8 687445145 675711975 675904388 680031052 681647797 683236008 682803345 680181427 681176147 682812500
3829.5 682812500 684814453 685779037 679737091 681366272 686163940 682224274 681931381 686736984 680494232
3838.2 680494232 676876526 682209320 680555649 681226273 685960846 683597946 680832901 683094864
3845.9 683094864 684287567 684232864 685369186 683964462 683807831 686384659 681512146 686231766 677199936
3854.6 677199936 674005356 681407776 681980591 681441574 682528000 683749313 686129761 682672272 682325897
3863.3 682325897 686500931 682686691 678972626 681567383 684959793 689736633 686016388 677934036
3871 677934036 680078354 684590683 687416153 681128387 681203384 683808975 683488922 685132980 687415924
3879.7 687415924 683262405 678808899 682863083 684177628 684979630 689164505 680579453 680024719 683233871
3888.3 683233871 683918457 686536636 685307846 679724503 681067734 683704224 682990875 683587875 683777313
3897 683777313 684581757 686044769 679931412 683485565 685915298 681980209 684701538 682091980 681033325
3905.7 681033325 681683578 681439667 683014145 683561859 683414230 682528915 682582932 683454056 683428116 683483582
3915.3 683483582 683993530 682218552 680711670 684605331 685578613 681894760 682332153 683105392 683330536
3924 683330536 682094421 680555496 681949539 682885666 683149185 682204285 681767654 683483734 682785645
3932.7 682785645 681876907 682077103 681905136 682777252 683324738 682624359 681653900 681310043 682428055
3941.4 682428055 683296204 681210785 680605087 681594009 682016449 682263336 680959625 681505508 682078476
3950.1 682078476 681242752 682911911 683071899 681817322 681434097 681601639 681864090 681650391 681996155
3958.7 681996155 681524353 682025070 682726364 681741180 681818924 681501007 681300049 681860352 681845856 682243881
3968.4 682243881 682174225 681698456 682122040 681838150 681351089 681869736 682354660 682325668 681918793 682643204
3978 682643204 682898407 681567459 680911713 681340103 682061920 681733704 681960449 682371750 682130432 682402954
3987.7 682402954 681916351 681946182 681536026 680794296 681512299 681621094 681819382 682005234 681644440 681813354
3997.3 681813354 681898270 681417389 680915070
4000.2 680915070
##END=$$ End of the data block
