##TITLE=$$ Begin of the data block
##JCAMP-DX=5.00 $$ ACD/SpecManager v 10.08
##SPECTROMETER/DATA SYSTEM=Varian
##DATE=14 Jan 2013 09:52:46
##DATA TYPE=INFRARED SPECTRUM
##DATA CLASS=XYDATA
##ORIGIN=
##OWNER=
##NPOINTS=3735
##FIRSTX=399.26403809
##LASTX=4000.35498047
##MAXX=4000.35498047
##MINX=399.26403809
##MAXY=73.41798401
##MINY=23.23424339
##XFACTOR=1.0000000000
##YFACTOR=0.000000100000000
##FIRSTY=46.84204483
##DELTAX=0.96440572
##XUNITS=1/CM
##YUNITS=TRANSMITTANCE
##XYDATA=(X++(Y..Y))
399.3 468420448 465316086 454867516 451911469 451243935 453909836 454655838 456463776 452509918 447696190
407.9 447696190 454119720 454236107 450341759 448182983 447922134 454867477 456114349 451486893 449990730
416.6 449990730 442817917 415760307 419230461 445446129 448845177 452664413 457790108 447193718
424.3 447193718 442061424 446214714 442270317 440976677 444143562 442713585 440110359 438957329
432.1 438957329 440965843 444502907 444818611 446953888 452327614 452432899 449123650 443173409 439034386
440.7 439034386 440870705 442640076 445695038 448703575 450626144 450521355 446169586 447495613 448216667
449.4 448216667 445986252 446278839 448221855 448147583 444256744 443392258 441589622 440229759 447353477
458.1 447353477 447415161 444338570 442934265 439878159 436733513 438155136 437175484 434358139 436180496
466.8 436180496 438480453 438074379 438033943 440307274 440274925 436334572 428879471 424353600 426430588
475.5 426430588 427195854 426886139 428787880 429892883 430690269 431227913 429722404 422923965 417991219
484.1 417991219 419763870 420844879 419978180 419576340 422368126 425148735 426349831 426447525 425699310
492.8 425699310 426174431 423892746 420134583 418031960 418822174 422160149 421876450 420851097 424007072
501.5 424007072 428317566 428840561 426056900 422117004 418903427 416932030 417219734 417481575 417836227
510.2 417836227 418559761 419261398 419741669 418224335 416435394 415475121 413298607 410395050 408322334
518.9 408322334 408528252 410139198 411062660 411614876 412378693 412673073 410603523 408386993 406862183
527.5 406862183 405786438 407047539 407161903 406489220 407589455 409164085 409170990 407412148 408020439
536.2 408020439 410686722 410570374 406739578 403986855 403663368 402238159 401027145 401609268 403781815
544.9 403781815 406083717 406135101 404107208 402208977 401238365 399939499 399357872 398102112 396894073
553.6 396894073 396973305 396531868 397271538 397798424 397835045 397140083 396273193 395579681 393986855 395600243
563.2 395600243 396163101 393717537 392889404 393871803 395790939 397775688 400995178 401081238 398471222
571.9 398471222 397479744 395436935 394247971 393901253 392651329 394089928 396241951 396562729 396715889
580.6 396715889 396498375 396683197 396702156 395147133 393313866 391631241 391648026 392965584 394482269
589.3 394482269 396368713 397954597 398408279 397249146 397321091 397241440 396496468 396079674 394192200
597.9 394192200 392950401 393614006 395278664 396402893 397269554 397796898 398264503 398345032 395796776
606.6 395796776 394391899 393111076 390094147 388802643 388603363 389546814 390743637 391524010 392076530
615.3 392076530 392148323 391348495 389397278 387415810 385598755 385489998 387032509 388972588 390840416
624 390840416 392980652 395118446 396204643 397359047 398042412 397914658 397635880 398446808 399602280
632.7 399602280 400631065 402971039 405329475 408194046 410752449 412422485 413743019 413658257 412909355
641.3 412909355 412208061 412674141 413443527 414389801 416917381 418917351 421213341 424777374 426690483
650 426690483 426233521 424896278 424312935 424231682 423683739 423219604 422646179 422795334 424942894 427187500
659.7 427187500 428252869 428390427 427267876 425263824 422966843 421356735 421945496 424346962 428801651
668.3 428801651 428700523 427770615 427403641 429265289 431537857 431726112 431472588 431577301 431201706
677 431201706 430629539 430644951 432286530 435510864 438893623 442199211 444588051 444512100 444249420 444324341
686.7 444324341 443146057 442816544 442709694 443261948 445201073 447100449 450187569 452032051 452278786
695.3 452278786 452594414 452296715 451976242 451196556 451187401 450961647 450043068 451416740 454394341 457297935
705 457297935 459127960 459780312 460336266 460931778 459760933 457902298 458520317 459890709 460253105
713.7 460253105 461421204 464099197 466513214 467787628 468325882 468814240 468476143 466798744 466090279
722.3 466090279 466499214 467499695 467997627 468891983 471180992 472992287 475579033 478203964 478483086
731 478483086 477112846 476836739 477638435 477182617 476813889 477848129 480474815 482616882 483457375
739.7 483457375 484423943 485592232 486044121 484859505 484556694 484773788 484726219 485646629 487270470
748.4 487270470 488911972 490634003 492741814 493368721 494372101 494825668 493960152 493642197 492479782
757.1 492479782 493158951 495221367 497780571 499921303 501381531 504820404 507136154 506962204 505444946
765.7 505444946 504841805 504292374 503342438 503753510 504546509 506311111 507296333 508394241 509615479
774.4 509615479 509341354 508721390 507813873 507331200 505609779 503810654 503281021 503968048 506149406
783.1 506149406 508268204 510184288 510684242 510890923 511271172 511031685 510882721 510460167 509395027
791.8 509395027 508512611 509107018 510119209 512045937 514002914 514040070 513027534 511520424 510085220
800.5 510085220 508453217 506253891 503336334 501638870 500691566 500014877 500774765 500438614 498620796
809.1 498620796 495690536 492886391 490861702 488573608 486288872 484152565 483657532 483893280 482933922
817.8 482933922 482506714 484460258 486435013 486983299 487912827 487877541 487945328 489398270 491003418
826.5 491003418 493600311 497717896 502554741 506751480 511031990 514858093 517696648 519581299
834.2 519581299 520706329 522502098 524047775 525565186 527945518 530964470 533387299 535875626
841.9 535875626 538835983 541855698 544241867 544221382 544037514 543495903 543412056 544240875 545392418
850.6 545392418 547554970 549675140 553027191 555543365 557321053 558307381 558847885 560175514 559806061
859.3 559806061 560711365 561997948 562746658 563826218 565453873 567800560 568765793 569322662 568604584
868 568604584 567352333 565047379 562305222 560943375 559816704 558836021 557444611 557815399 558222237
876.7 558222237 557116508 555682602 554062996 552662468 550663681 549349098 547472610 545591431
884.4 545591431 545919456 547525215 548114662 547439919 547595749 546938248 545456657 543604240 542035294
893 542035294 540768318 539884911 540700645 541464119 542777100 543930130 543975258 542420731 540270195
901.7 540270195 539476814 538209343 538007851 539222069 541309204 544086189 547427139 551738663 555123138
910.4 555123138 557049141 557023201 556647453 555075150 552455444 550428009 548272820 546373367 543925018
919.1 543925018 542749786 541640892 538959885 536057663 533187485 529948502 525545921 521430168
926.8 521430168 516805992 512794113 510265656 507444038 505473633 504255524 502363472 499969978
934.5 499969978 498356476 496643753 494860725 493167267 490863800 489424133 488330803 487331619 486541367
943.2 486541367 486463585 487160721 487089920 486712456 485974770 485287857 484923325 484507103 483833389 483144989
952.8 483144989 483208313 482934189 482194862 481650734 480936241 478741455 475656433 472908440 470254707
961.5 470254707 468048248 465270958 462800217 461918259 460919533 459693604 458744240 456885719 454268036
970.2 454268036 451990356 448803902 444722633 440760841 436706352 433486938 430747833 427347298
977.9 427347298 424032669 420770721 416937256 411938438 406371727 400921326 394062576 387329636
985.6 387329636 382226219 378154106 374518890 370773773 367290916 363646355 360677071 357366638
993.3 357366638 353671150 350604362 347168198 343791542 340712624 338375092 336069756 333674355
1001.1 333674355 331484489 329599037 327467003 325171890 323399353 320477982 318337593 316977520
1008.8 316977520 315172462 313030357 310564556 308971825 307253799 306146927 304711647 302682552
1016.5 302682552 300445194 298013554 295927658 292850113 290400562 288514862 287004166 285097313
1024.2 285097313 283246078 282148724 280893192 280596924 279183083 277507725 275695438 274166031
1031.9 274166031 273257999 272445412 273426151 274106960 275421200 277164726 279454956 281253452 282266846
1040.6 282266846 283964672 284373131 285388031 286102867 286299686 286206284 286050739 285610657 284066391
1049.3 284066391 283758621 281902065 280084553 278703575 276793365 275726681 274262600 273534393 272827396
1058 272827396 272913494 273035469 274564323 276906376 278501377 281158524 283156796 284792404 285574856
1066.6 285574856 287899876 290056057 291138706 293138332 294054947 295301533 295820255 296645069 296734505
1075.3 296734505 296642132 297157383 296485062 297365398 297958908 298954887 299928665 301209469 302633400
1084 302633400 303267155 304925385 305076618 306095600 307146912 307996368 309341221 309644814 310910587
1092.7 310910587 312466736 314706974 315908871 316974258 318707790 319877987 320691414 320811348 321900597
1101.4 321900597 322592354 324140434 326183510 327302475 329169312 330427399 331115456 332323799 333666573
1110 333666573 333370705 332821846 333151054 333684158 334492607 335539017 337415466 338145103 338032150 337911873
1119.7 337911873 338170242 338325119 337108307 336225319 336210899 337254639 338308563 340167694 342193031
1128.4 342193031 343543587 345961990 348275032 350506554 352104530 354068947 356019821 357379684
1136.1 357379684 359392052 361303253 364091301 366850014 369075851 370984001 372931213 374581337
1143.8 374581337 375084991 375429420 375356255 375596466 375714035 375625076 375619698 375626030 376908607 377721329
1153.4 377721329 377800446 377433090 376489029 375476608 374000702 372304230 370765343 370119781 369853554
1162.1 369853554 370437660 371891212 373792915 375877686 377310066 379462280 382149429 384383659
1169.8 384383659 385973320 388658638 392387009 395784340 399565582 403272476 406993637 410361366
1177.5 410361366 413436623 416186714 417917290 419760170 421958046 423381577 424741936 426751633
1185.3 426751633 429090385 431440735 433066864 434566956 435799026 436357040 436294212 435686455 435081406
1193.9 435081406 434286613 433478928 432822418 432573967 432458725 432220001 431520615 430256233 429220200
1202.6 429220200 427790146 425971756 424095230 422830429 422555542 422360497 422385712 422584801 423144951
1211.3 423144951 423447151 422623901 421684723 420903549 419931717 418842850 418304558 417786522 417125587
1220 417125587 417079124 417076187 417046738 416792450 416179771 414917068 413500137 412732086 411542816 410054703
1229.6 410054703 408857803 408497734 408596077 408025093 407515182 407227478 407167702 406848869 406256714 405728836
1239.3 405728836 405008850 404650879 404310455 404331512 404463997 404342117 404517860 404140778 403345718 402670860
1248.9 402670860 401968460 401440506 401304245 401033897 400670395 400437546 400245628 400657883 400983658 401052818
1258.5 401052818 401026878 401166992 401249008 400697289 400542183 400721130 401452980 402553864 403605690 404780006
1268.2 404780006 405646286 406400948 407299232 408288345 408489952 408805695 409852257 411112709 412587013
1276.9 412587013 413890991 415409889 416810760 418007545 419127045 420329285 421647873 422991829
1284.6 422991829 424475441 425682564 427101364 428596001 430082016 431568298 432747803 433548241
1292.3 433548241 434463234 435463753 435723419 436075363 436433678 436679726 437119217 437794609 438677635
1301 438677635 439325905 440002670 440273666 440148163 439589195 438801231 438008766 437089195 436489983 436063271
1310.6 436063271 435527306 434833908 434776993 435020485 434863625 434656906 434539566 434436607 433873749 434085808
1320.3 434085808 434950905 435830421 437159500 438378563 439540520 440419998 441070709 441333466 441259422
1328.9 441259422 440537148 439282227 438453217 437797661 437306557 436769981 436944389 437824059 438304825
1337.6 438304825 438665733 438830528 439177742 439013100 439200745 439774628 440110779 441056290 442243309
1346.3 442243309 443630943 444958305 446189995 446479912 446016884 445452423 444660606 444072952 443122864
1355 443122864 442681007 442678032 442820854 442891846 443060570 443418922 443196945 443520432 442286072 441320305
1364.6 441320305 440795441 439313049 438649979 438173409 437936287 437855682 438102379 438694267 439504280 439942169
1374.3 439942169 438986511 438764610 438556442 438306618 437714653 437230263 437275314 436935539 436169090 434871178
1383.9 434871178 434027176 433385811 433056030 430615921 427890472 426583252 424484749 422922325 421427345
1392.6 421427345 420434570 418835449 415808296 414227791 412433586 411037445 406899261 402785683
1400.3 402785683 400789108 398254852 396478996 395139236 393095284 390644608 389074135 387590637
1408 387590637 385706635 383752747 381512108 380062485 378414536 377085953 376116066 374758224 374105682
1416.7 374105682 373849068 375234108 373366547 371162567 371547432 371268387 372021599 371167679 371448784
1425.4 371448784 372808723 373429298 374708710 375728760 377303658 377992821 379625702 381082878 382060661
1434.1 382060661 384527855 386670914 388039360 388912735 391855202 394238205 396598778 398929443
1441.8 398929443 400054932 402229500 403866386 405934830 407527695 409268875 410656166 411769981
1449.5 411769981 414214630 415800858 418251114 419868164 422227745 425051842 427031898 430019417
1457.2 430019417 428886108 431187973 431943817 434297485 436420937 438186188 441994667 443391953
1464.9 443391953 444749832 446702805 449515686 452126312 454484291 458085327 461289673 464723206
1472.6 464723206 465745087 469231644 473417206 475930786 477517738 479531555 481763229 483721046
1480.3 483721046 485702782 487021866 488465805 490172157 491835098 494401512 495896645 496317902
1488.1 496317902 498769646 500164413 498070831 497092285 497043839 496230927 496031952 497105865 492720261
1496.7 492720261 492404022 492234154 488862000 488474464 487301903 485479851 484044037 484756241 486915855
1505.4 486915855 486842270 481480751 479117622 480141220 479507141 480078850 479408760 476984901 477000732
1514.1 477000732 476411591 476065254 475222321 472184868 473212700 476088409 477874870 476452179 474749146
1522.8 474749146 474455795 476263008 476616936 476838455 477500191 477578430 478543320 479710045 480857086
1531.5 480857086 482544441 484035454 481021309 481846542 482773323 483248863 486079674 488538704 484606133
1540.1 484606133 483476601 484637947 483931427 485237083 486390038 483949776 485026588 485413399 486054802
1548.8 486054802 485783234 484061813 484617538 485111275 487051201 485252953 484466248 486648293 489596405
1557.5 489596405 487698631 478650322 477276001 476097183 476770058 475584335 474927673 472356796 469158173
1566.2 469158173 468284912 466608582 466698227 456620026 452493820 450260086 446409187 443591576 440928497
1574.9 440928497 440696144 427094841 424877014 421935959 416895905 412209282 405913277 401687698
1582.6 401687698 395371552 391452675 385664597 381006508 376858292 371305199 367831726 361823692
1590.3 361823692 358536911 352733421 348973732 344724312 339505272 336712761 331347809 328970757
1598 328970757 324243584 322127609 318814945 315653915 314147015 309925900 308426170 304555054 303410206
1606.7 303410206 300347328 298782673 297440109 294379387 294886608 292507401 292892570 291016941 291802025
1615.4 291802025 293278065 286862946 287681236 285906239 287091045 286130295 287716694 288886204 286482372
1624 286482372 287399464 287254581 289832420 288230495 288808002 289477215 290551682 291865749 291705475
1632.7 291705475 294709740 295753822 298908157 297698956 300016289 300825691 301658325 304265690 304217167
1641.4 304217167 306837215 307566891 310509815 313743820 314679565 317986221 316966019 320045547 321388664
1650.1 321388664 325285835 329393578 332097740 327145538 326746025 331612206 333500175 336272736
1657.8 336272736 337977715 340754890 343939171 346790924 350623894 350511398 353497734 355276604
1665.5 355276604 358188744 361888084 366108093 370193977 371348076 376873436 378930397 382886810
1673.2 382886810 387735062 391639709 392843399 395578690 400468369 403919678 409024620 412305374
1680.9 412305374 417100449 424238548 430536308 434501152 434063454 439230270 443667297 447928696
1688.6 447928696 452290268 455920906 460465279 465077629 470890541 477474861 485670624 486825905
1696.4 486825905 490200539 496693916 504463806 513019829 505131416 510516586 516199532 521506157
1704.1 521506157 525296974 529568253 532782402 534805794 539011078 541617203 542578278 544132957
1711.8 544132957 546411781 549606743 551194916 552594452 557002525 561404381 557658501 558741112
1719.5 558741112 561555252 563313179 564875946 565425034 564952621 565659904 567279663 568805771 570936737
1728.2 570936737 574238014 575523224 575573883 579434662 584353561 585008469 578707733 580044823 583205109
1736.9 583205109 585296173 589001503 590920944 589437790 593698578 598230972 600777283 602294159
1744.6 602294159 605450325 608700638 611377411 614783630 615925674 620352898 623442192 624675751
1752.3 624675751 629756775 633304443 637111778 641582718 642463303 643241043 645513840 647981339 652183075
1761 652183075 653158951 652585907 656028290 658614731 660976028 663894424 666749344 664930878 665945358
1769.7 665945358 670758820 672490845 671113663 667871628 671423874 674827957 674423065 676474152
1777.4 676474152 677828903 679923859 680766907 679133072 679525681 681083603 683331299 683217392 682990646
1786 682990646 684835739 686566391 687656479 689828720 691072769 691345520 689846573 687769470 690686874
1794.7 690686874 692422638 692268524 693484116 696172791 697653885 696530914 698596573 698243866 697705536
1803.4 697705536 698946609 699257355 700124435 700804596 701446991 702627792 704767456 704480362 704815445
1812.1 704815445 705904846 705691757 706445084 706132355 706744232 706689453 706931839 708185654 708437195
1820.8 708437195 710097122 710450287 711621857 713698959 711541977 710306396 711823120 714299698
1828.5 714299698 715792923 712542953 711793213 714363327 715384598 715892334 716246033 716364288 716555786
1837.2 716555786 715727615 716306381 716286011 717028732 717783890 719575882 722708130 718158646 718692398
1845.8 718692398 720800171 720882263 720160217 719804306 720247116 719927750 720704575 720875397 721379166 722186203
1855.5 722186203 722897797 724024200 723857651 724095917 723741608 723415070 722822723 722649384 723034058
1864.2 723034058 723328629 725006256 725845261 727359314 727262573 725372543 725701599 725952148 725730515
1872.8 725730515 724987106 725204620 725207367 725672379 726435928 727150803 728158493 728338623 729079819 728841858
1882.5 728841858 728486176 727961502 727211838 726896820 726406555 728193359 729570770 728693619 729041595
1891.2 729041595 730241699 730303955 730206604 729804306 728313370 728462524 728220825 728421173 729070663 729392624
1900.8 729392624 730040207 730270920 731162415 731060104 730832443 730758057 730431900 730369568 730182571 729927979
1910.4 729927979 729397278 730385513 730883865 731811142 732539139 732445679 734179840 732407990 730188141
1919.1 730188141 730260849 730365753 731206055 731019440 730825653 731552124 732451096 732587128 732874451 732757874
1928.8 732757874 732210464 731663742 730771790 730491257 730036163 730613403 731241379 731698456 732248840 732496796
1938.4 732496796 733078003 732401352 732801666 732528305 730068207 729910583 730592880 730882874 730606384
1947.1 730606384 731256027 731865692 732396393 732693787 732042007 731330032 730562286 730408249 730030518 729841309
1956.7 729841309 729946289 730301056 731073608 731554718 731960220 731687622 731454849 731008530 730644531 730239716
1966.4 730239716 729305573 728974075 729345398 730433044 730731659 731101913 731424026 731048965 730798721
1975.1 730798721 730609894 730420685 729347687 728966827 728924103 729113846 729562683 729716415 730593796 730740356
1984.7 730740356 730715256 730242233 729691772 729015961 727814178 728233948 728806763 728613815 728408051 729173279
1994.3 729173279 729741974 729749908 730108109 729792786 729114761 727825317 727209473 727005463 726826248 727292862
2004 727292862 727595062 728181229 728526840 728928833 728913879 728338699 727439041 726453247 725867996 725140533
2013.6 725140533 725271530 725853729 726450119 726486435 726798019 727122345 726533890 726581955 725786743 724842300
2023.3 724842300 723919067 723397675 723862305 723864822 724262695 724541168 725302200 725835495 725532608 724854813
2032.9 724854813 723735352 723002701 722230453 722212143 722018204 721857071 722599716 723587952 723837738 723294678
2042.6 723294678 723624191 723280792 722745590 721828918 720698776 720472031 720243988 720802460 721182938
2051.2 721182938 721591415 721831207 722348862 722812271 722026520 721367035 720237045 719748306 719271774
2059.9 719271774 719065323 719478760 719463730 720553360 721464920 721799850 721531448 721192780 720820465 719831772
2069.6 719831772 718931732 717898788 717699203 717922897 718539734 719306107 720048370 720686111 720703125 720579834
2079.2 720579834 719681473 719008942 717959518 717001419 716784439 716784286 717657700 718123245 718739166 719214554
2088.9 719214554 719374161 719183731 718477859 717535095 716216583 715892334 715516891 715618439 715982437
2097.5 715982437 716271591 717265854 717760925 717782516 716819992 716171112 715541534 714756470 714282532 713635178
2107.2 713635178 713884201 714088058 714690247 715203934 715678177 716322861 716058197 715514679 714496841
2115.9 714496841 713736343 712916870 712517624 712431488 712494202 713241043 713878403 714868011 715099106 715062790
2125.5 715062790 714696350 713889847 713252106 712380219 712219238 711999664 712315826 712842331 713325195 714086456
2135.1 714086456 714374924 714328613 713760986 713607559 712855377 712157593 711912003 711474762 711784897 712312622
2144.8 712312622 713359833 713817368 713888779 713976288 713944702 713665619 712715607 712403717 711832733 711476593
2154.4 711476593 711510468 711831665 712489700 712980881 713676224 713791199 714023056 713391571 712582703 712437057
2164.1 712437057 712054977 711982803 712051773 712970428 713510818 713962555 714331741 714207001 714204254 713580475
2173.7 713580475 713372040 712868729 712605972 712628632 712859421 713314362 713127747 713975067 714451752 714391861
2183.4 714391861 714110031 713710937 713676910 713371429 713339996 712867737 712997131 713469696 713913498 714434967
2193 714434967 714444122 714656525 714365463 714123230 713870697 713734131 713664322 713618927 714034958 714161835 714545593
2203.6 714545593 714805450 715058670 715123291 715170670 714852371 714084702 714207764 714213562 714533234 714452820
2213.3 714452820 714365387 714924774 715152130 715548706 715678024 715895615 715295334 714618759 714422226 714484940
2222.9 714484940 715330429 715219574 714900742 715097198 715605011 715518723 715249176 715453568 715106354 714876251
2232.5 714876251 714477463 714429779 714563675 714771500 714958267 715039139 715541229 715329895 715316162 715207062
2242.2 715207062 715051651 714700089 714216156 714545593 714682083 715144424 715115738 715271378 715406570 715140686
2251.8 715140686 715285950 714757156 714742508 714619904 714659119 715101700 715364304 715643845 715592651 715882416
2261.5 715882416 715671692 715678177 715800018 715718994 715234833 714498367 714675903 714555359 714807053 714913635
2271.1 714913635 715156555 715618134 715576553 715691147 715165863 714802856 714256210 714272385 714276657 713944855
2280.8 713944855 714316101 714310455 714811554 714754181 714753189 715011292 715029221 715160370 714531326 714545517 714224091
2291.4 714224091 714506607 715202484 715498581 716297073 715988617 716209106 716691284 716506729 716052704 715501785
2301 715501785 715483856 715609818 716018066 716339493 717240448 717686157 717860260 718704758 718899155 719060745
2310.7 719060745 719110031 719256363 719009933 718736954 718873138 718795700 720076904 721783981 722928848
2319.3 722928848 724213104 724941940 724477158 724001694 723707275 723470383 723993301 724489365 725180435
2328 725180435 726227417 727000504 727099915 726902466 726457367 726421432 726792984 726794586 726402435 724920425
2337.7 724920425 725830841 727582626 726892853 727092133 727608643 727270660 726511459 724674911 721849899
2346.3 721849899 719423447 717018356 717266464 721005096 723731384 725755157 727414856 729107056
2354.1 729107056 731875916 732993317 733281555 731894073 731751328 730513535 730048447 730399857 729932480
2362.7 729932480 730615005 728955612 728096771 726402359 725606689 724021149 721118546 720680161 718628235
2371.4 718628235 717270737 716193848 714554977 713536224 712703629 711882553 710570374 709427795 707642670
2380.1 707642670 706144333 704990845 703828430 702643433 701501389 701664734 702064362 702146454 701856003
2388.8 701856003 701870575 701653900 700893936 700580521 699676895 698973236 698731232 698998947 698959579 698795776
2398.4 698795776 699306030 699193878 699450226 699066238 698147278 697558289 697131958 697045212 696558990 696373291
2408.1 696373291 696221085 696689301 696982956 696693649 696473160 695849152 695631332 694785995 693825684 693160858
2417.7 693160858 693172531 693830719 693701324 693648987 693617020 693785248 693536224 692833328 692304687 691976318
2427.3 691976318 691598206 690475693 689822922 689483337 689701767 689935074 690080261 690568466 690051041
2436 690051041 689562149 688993225 688453903 687665787 686808701 686775818 686603546 686681976 686559372 686463928
2445.7 686463928 686348114 686067200 685872345 685290680 684538498 683647385 683484039 683352432 683109741 682881546
2455.3 682881546 682454758 682446213 682331696 682365723 682253418 681723557 680567093 679808578 679656525 679125748
2465 679125748 679095001 679000092 678864746 678444824 678022003 677849731 677455139 677117615 676186142 675525284
2474.6 675525284 674835815 674609680 674816437 674495926 674488602 674229050 674191284 673804779 673099976 672467270
2484.2 672467270 671699982 671330719 670738602 670513458 670319748 670123367 670003815 669719772 669505463 669110489
2493.9 669110489 668653336 667683792 666958618 666328659 665847168 665578766 665052795 664786148 664351196 664281998
2503.5 664281998 664088058 663733673 663176422 662399750 662110748 661394806 660791168 660304108 660237122 660186310
2513.2 660186310 659795227 659817352 659399261 658860550 658183823 657643814 656868896 656071167 656053772 655684891
2522.8 655684891 655408249 655493164 655742493 655685959 655235977 654444275 653350220 652660904 651900101 651313477
2532.5 651313477 651300964 651336441 650731583 650640182 650812073 650056839 649801483 649594421 649108582 648418045
2542.1 648418045 647872925 647407684 646700134 646672668 646440430 646330948 646449585 646437988 646043396 645285492
2551.7 645285492 644712296 643518372 642810669 642656784 642262878 641697769 641400375 641366959 641291046 641617050
2561.4 641617050 641107635 640400543 639765282 639255257 639047699 638217850 637481766 636683540 636836624 637138939
2571 637138939 637162361 637206955 636068306 635406380 635152512 634886971 634090424 633326645 633304787 632813416
2580.7 632813416 632741432 632738914 632681427 632508163 632098961 631784058 631151772 630337257 629566422 629339485
2590.3 629339485 628811569 628472786 628376122 628080864 628221092 627878113 627232780 626578751 626258392 625560150
2600 625560150 624395142 623852654 623739395 623891869 623232079 622712784 622759590 622531052 622356224 621985779
2609.6 621985779 621281509 620163193 619229660 618605385 618325729 617776451 617157516 617439995 617449493 617079926
2619.3 617079926 616679649 616275673 615437622 614456635 613888397 613275337 612618179 611789169 611502876 611241302
2628.9 611241302 610934639 610796738 610292854 610033989 609362679 608390732 607662163 607222862 606762962 606578293
2638.5 606578293 606481438 605559845 605297012 605365181 605176353 604752312 603909302 603106384 602340813 601867409
2648.2 601867409 601091614 600659752 600391159 600148392 600424004 600237312 599834595 599059410 598399353 597754211
2657.8 597754211 596906471 596377602 595957451 595810356 595526047 595463257 595302658 595051117 594819145 594206696
2667.5 594206696 593688011 592895699 592225990 591677628 591454697 591293373 590695992 590499496 590543747 590746422
2677.1 590746422 590389557 589650955 589295387 588779984 587856941 587006645 586586380 586468735 586622009 586215439
2686.8 586215439 585896530 585875168 585453339 585073242 584529953 584060555 583236809 582602119 582544212 582560883
2696.4 582560883 582529488 581898842 581641083 581342773 580872917 580517235 579813766 579419556 578991966 578491631
2706 578491631 577995949 577784119 577827873 577784958 577791138 577277756 576800385 576629601 576017342 575281143 575055046
2716.6 575055046 574754066 574216537 574134750 574351234 574418526 574133759 573882103 573776016 573628883 572992249
2726.3 572992249 572263069 571904106 571297646 570933266 570628777 570543289 570824089 570811462 570620689 570311317
2735.9 570311317 570126877 569525223 568978729 568718681 568204651 568015671 568152618 568263245 568158646 568246651
2745.6 568246651 568194504 568138428 567838402 566986618 566612282 565974045 565297585 564950600 565023460 565502434
2755.2 565502434 565304298 564715881 564460373 564677467 564476967 564096985 563526230 562956543 562875328 562412415
2764.9 562412415 562167511 561758652 561713638 561972160 561351166 560763397 560479279 560513420 560013885 559329185
2774.5 559329185 558765526 558437271 558588638 557886200 557207870 557160301 557396355 556821289 555627861 555258446
2784.2 555258446 554596558 553624229 553144760 553399391 553422165 552976151 552900734 552525558 551774559 550939980
2793.8 550939980 550146523 549229622 548719864 548386345 547609291 546999321 546431046 546171112 545870819 545397263
2803.4 545397263 544702454 543740158 543130531 542415733 541892471 541444702 540733070 539667435 538526649
2812.1 538526649 538127365 537890854 537433815 536578445 535616188 534846878 533772736 532694588 532077827
2820.8 532077827 531435547 530609207 529924622 529047623 528554764 528143120 526978607 526044769 525289574
2829.5 525289574 524083824 522769508 521692009 520957794 520420036 519494324 518557587 517667198 516365166
2838.2 516365166 515230751 513791809 511945801 509957199 507997437 506121178 504112473 502281342
2845.9 502281342 500085487 498117523 496418190 494659653 493297729 491837883 490618858 489369812
2853.6 489369812 488357506 487946281 487508850 487358589 487466583 487398300 487238388 487303162 487012482 486323547
2863.2 486323547 485554161 484999809 484624672 483662796 482603340 481752052 481204834 480472031 479649124
2871.9 479649124 479323769 478882599 478472328 477445793 476032372 475193596 474571037 473965721 473512497
2880.6 473512497 472991371 472128639 471616478 470733566 469506149 468620071 467328339 466107407 465331345
2889.3 465331345 464801369 463857918 462665939 461717262 460682983 459825287 459418983 458919182 457599220
2897.9 457599220 456683769 456138573 455272560 454361916 453384552 452963753 452117844 451101112 450622711
2906.6 450622711 450218544 449667282 448661308 447676888 446286850 445039749 443699112 442188072 441408920
2915.3 441408920 440115852 438722572 437365379 435767708 434537163 433618584 432609634 431511650
2923 431511650 431307259 431113358 430448990 430459175 431166420 431559181 431396561 431188812 431346893 432097168
2932.7 432097168 432292099 432188530 432470016 432993088 433553162 433637695 434391289 435770073 436744156 437236214
2942.3 437236214 437494812 437850037 438774567 439969368 440071564 439968643 440362854 441040115 441914215
2951 441914215 442483673 442998962 443464470 443941536 443830528 443943939 444955215 445316849 445158577 445328941
2960.6 445328941 446322060 447475777 448025818 448508873 449307289 449767113 449958267 451003952 451847725
2969.3 451847725 452225075 452799759 453298721 454252357 455467911 456033897 456022758 456507339 457469826 458137436
2979 458137436 458332558 458118095 457967949 458368073 458862686 458787270 458894615 459309540 459662056 459782715
2988.6 459782715 459643021 459738274 459576721 459431381 459264336 458732796 458746300 458847008 458402977 458008995
2998.2 458008995 457771301 457468529 457279358 456708221 455992737 455382233 454529266 454221802 454013863 453354340
3007.9 453354340 452911224 452848473 452550125 451934242 451055641 449784012 449072838 448622551 447965851 447258873
3017.5 447258873 446621056 446258965 445689354 444938812 444201126 443814545 443370209 442685699 441836128 440827980
3027.2 440827980 440244675 439374504 438630257 437962456 436994057 436207085 435579262 435457840 434628181 433267403
3036.8 433267403 432041283 431130943 430765343 429902878 429153633 428759079 428212700 427466850 426520844
3045.5 426520844 425290184 424269753 423899994 423145561 422297173 421601334 421038132 420245934 418917847
3054.2 418917847 418064499 417435112 416805878 415892792 414929237 414121704 413271103 412693787 411908875 411214828
3063.8 411214828 410676193 410183640 409655609 408848724 407859230 406899300 406511040 405758858 404598694
3072.5 404598694 403824158 403386459 403055878 402521133 401986961 401309547 400454865 399557343 399096375 398451958
3082.1 398451958 397212639 396454926 395692673 394877396 394586411 394361382 393516083 392624245 391811714
3090.8 391811714 390711594 390027466 389340096 388963776 388585358 387756920 387066116 386133118 385609245
3099.5 385609245 385423622 385031776 383990593 383005142 382689514 381764717 380951004 380339088 379273949
3108.2 379273949 378349457 377647324 376987343 376563263 376428986 375829315 374714012 373647652 372992783
3116.9 372992783 372326813 371486740 370612564 369939041 369804726 369211044 368249931 367268906 366601372 366247330
3126.5 366247330 365313301 364410896 363504066 362768974 362209511 361485901 360369034 359190445 359172935
3135.2 359172935 358807411 357803764 357174187 356421242 355349426 354178886 353364677 352683258 352119331
3143.9 352119331 351435966 350698700 349958344 349346390 349300842 348805695 347931480 346877327 345724068
3152.5 345724068 344784203 344029617 343479118 342391357 341600037 341599007 341120529 339848938 338861542 338369370
3162.2 338369370 337565842 336510544 335388985 334735184 334408302 334051971 333407555 332483139 331874924
3170.9 331874924 331022682 330194473 329623337 329153671 328459854 327280388 326209831 325284882 324943008
3179.5 324943008 324503021 323982201 323849602 323081741 321891251 320925713 320396729 319584160 318603611
3188.2 318603611 317921333 317314835 316936054 316368198 315588017 314876099 314302101 313407173 312909622 312720699
3197.9 312720699 311825352 311258411 310274868 309252605 308851547 308210983 307524624 307048855 307438049
3206.5 307438049 307252903 306437397 305589409 304176998 303627300 303077259 302346821 301593304 300355968
3215.2 300355968 300046806 299843102 299423923 299300690 298493214 297401848 296753120 296166725 295616589
3223.9 295616589 295357952 294905815 294216213 293780327 293411579 292907448 292206116 291659508 291240711 290245724
3233.5 290245724 289398270 288896236 288292484 287975101 287487984 287103481 286801968 285775719 285162201
3242.2 285162201 285274067 284968128 284429855 283974361 283183117 282248459 281708832 281805191 281552811 280725346
3251.9 280725346 280611553 280603962 280322704 280001373 279252148 278415737 277497444 276987305 277090473 276781731
3261.5 276781731 276073170 275537968 275101357 274900818 274827175 274536667 274224854 273783112 273350677 272545357
3271.2 272545357 271653309 271785030 271955509 271546745 271173306 271101189 270558472 269563580 269210453 268925495
3280.8 268925495 268499012 268086319 267832508 268087540 268098621 267701168 267432919 267165833 266749630 266649208
3290.4 266649208 266461353 265943642 265346069 264792690 264552784 264100189 263710747 263500290 263432007 263399467
3300.1 263399467 262606430 262158165 262296906 261934986 261254368 260715752 260529194 260478306 259762058 258947506
3309.7 258947506 259185791 259310646 259037895 258775043 258159103 257459259 256930714 256737461 256203728 255653114
3319.4 255653114 255424023 255005817 254677811 254279747 253818455 253126507 252422562 251699753 251060524 250909138
3329 250909138 250097504 249275188 249079933 248771000 248527966 248142376 247589989 247231503 246634865 245532761
3338.7 245532761 244939861 244851036 244449444 244005756 243667011 243032284 242038364 241695461 241895256 241654682
3348.3 241654682 241121349 240721436 240262203 239507008 239248428 239398174 239605255 239651203 239109993 238714943
3357.9 238714943 238450203 238367195 238147507 237236290 236869259 236886578 236651764 236574879 236339073 235989780
3367.6 235989780 235844479 235973892 236050243 235576363 235209618 234992561 234730091 234697189 234484024 234192238
3377.2 234192238 233941765 234295197 234955387 234777374 234109554 233384323 233457661 233824062 233466606 233177509
3386.9 233177509 233182812 233461266 233648949 233359318 232992859 232905521 232765083 232589302 232763290 232647705
3396.5 232647705 232342434 232740097 233137894 232664700 232423306 232571583 232651176 232828331 232399826 232358875
3406.2 232358875 232562351 232404957 232645187 232697964 232733669 232913074 233332787 233763466 233897858 233735275
3415.8 233735275 233261185 233722630 234424152 234319668 234056683 234231548 234177036 233966522 234567852 234743271
3425.5 234743271 234932289 235375519 235375690 236006832 236671391 236735878 236736069 237271137 237797871 238020077 238406353
3436.1 238406353 238593388 238970108 239468536 239675217 240119972 240605526 240275440 240271397 241019745 241910267
3445.7 241910267 243297329 243452187 242977772 243496056 244190063 244629955 244613476 245223122 246217041 246586285
3455.3 246586285 246798992 247349262 247672806 247729759 248723907 249915047 250740948 251179333 251323242 251953259
3465 251953259 253115177 254116707 254288712 254844875 255625153 256149845 256811924 257243652 257800674 258428974
3474.6 258428974 259006004 259459248 260359535 261433182 262203064 263066216 263385124 263524876 263842144
3483.3 263842144 265180664 266601372 266887665 267468510 267926178 268425236 269202442 269973278 270538006
3492 270538006 271005211 272159328 273300381 274538879 275513649 276102562 276949444 277778225 278625355
3500.7 278625355 279519215 280544205 281294823 282082825 282992992 283756390 284440613 285537186 286812916
3509.4 286812916 287380886 288731861 289820023 290095806 290943737 291935024 292843571 293510990 294253483
3518 294253483 295033989 296113472 297355423 298602524 299938927 300806313 302072372 303104992 304046173
3526.7 304046173 305223122 305901947 306415062 307559757 309020004 309701538 311044712 312868938 314532394
3535.4 314532394 315236530 315115108 316673393 318217621 319324322 320666733 322091293 323393173 325508690
3544.1 325508690 327283592 326946754 328552361 330208702 331296463 332327347 334003525 336885490
3551.8 336885490 336836052 337729874 339091759 340452995 342804909 344407997 346537552 347655106 349149399
3560.5 349149399 350431709 352420425 354188004 354774170 359804955 362502518 362671623 363239899 362261429
3569.1 362261429 365117149 366647148 367855492 369966621 372408409 374277000 376147270 379172630
3576.9 379172630 380002708 381997108 384212532 384943542 386587486 389113312 391743050 393126259 396963463
3585.5 396963463 400046883 400377808 402024765 401021042 403115082 406583633 410681267 413394012
3593.2 413394012 414514351 418066826 417512360 419107895 423347740 424820442 428035622 429869690
3601 429869690 430735207 433835754 436549377 438613358 441792908 445335617 445266647 449036331 450766640
3609.6 450766640 449604530 456685944 459601440 458353844 462768135 462505836 466702042 472965775
3617.4 472965775 475049095 477431450 477013092 477942772 481077652 484458885 487574997 490576820 493764381
3626 493764381 497394829 506361542 511862221 500965767 502229500 506374817 513194237 517177010
3633.8 517177010 515981140 518687744 522670898 526129150 527770653 529639854 532627487 535674477
3641.5 535674477 538031807 539319038 542236023 547168961 555534286 559151421 557016563 564276009
3649.2 564276009 566540070 561551247 557741089 562604065 567796097 572116547 579136772 571959152
3656.9 571959152 572598877 579706841 582517357 584663239 585237732 587639427 589195824 591079063 594007034
3665.6 594007034 595220261 600922127 605527763 607182541 609970589 601266403 600896263 609404259
3673.3 609404259 621353874 626691360 607357788 605742798 612977715 618702736 617459145 617689514
3681 617689514 620213814 622241821 624162750 624711876 625373383 630120964 639378738 633120003 627502747
3689.7 627502747 636574669 630453796 628037148 633286057 634233589 635977554 636479454 636385880 637682915
3698.4 637682915 638080559 640888214 645631638 642319489 638396950 642489853 644272308 644314270 644496536
3707 644496536 647663422 654720001 648537903 650947800 657035294 641567078 643634262 648167038
3714.8 648167038 648756714 649690628 652354202 654443130 651020203 651746597 658808212 656880951 650793991
3723.4 650793991 655266113 656891174 657151031 655017242 653929138 657431717 658507233 665105896
3731.2 665105896 663109665 653357620 663285446 666991882 657869339 656153412 657651062 656886978
3738.9 656886978 658352051 662763290 659191055 660949020 674660187 669988403 647084656 656169281
3746.6 656169281 662971191 670038300 668916855 656797562 668823700 664995117 653760529 658521500
3754.3 658521500 662817764 667664185 662417450 663252792 670526123 663873215 660259781 664032898
3762 664032898 666066437 666709442 671042862 669342194 662823257 665096436 671179123 673661499 663342438
3770.7 663342438 663441849 666643143 666703796 667930984 667918930 668718338 668928452 672578888 674628448
3779.4 674628448 665685120 666550293 669187317 670969391 673969040 671156387 668773880 669259262 670046310
3788 670046310 670988464 671079330 671084518 670811996 670954361 670578461 671959610 676712799 673914337 667878723
3797.7 667878723 669883575 675320206 683993073 680384598 666847153 668999481 670199051 674304962
3805.4 674304962 681969757 673273315 666193466 670532532 673007812 673207474 673455124 673682632 674993820
3814.1 674993820 681281509 682922668 667666931 670092392 675983887 682567291 690033035 671437912
3821.8 671437912 667277374 671781616 673695755 676949463 678254852 673330383 671937027 673478394
3829.5 673478394 677422562 681264877 672209015 672682037 680891190 675258789 673876801 685112610
3837.2 685112610 679855499 671436691 678842163 673816986 671772919 680021439 678302612 672252808
3844.9 672252808 674022598 675777740 676533661 678639374 677839203 679527817 687468414 685780716 687816925
3853.6 687816925 671231842 667220688 678464508 677810440 673527298 674692764 676904984 680704346
3861.3 680704346 675836563 674730606 682542572 678373413 670400772 673216553 678452988 686233902
3869.1 686233902 682397461 669813080 671531219 678640213 684900665 674549789 672222061 676084747
3876.8 676084747 675571747 678027191 684712524 681530533 671404190 675319290 676852112 678878098
3884.5 678878098 686453323 672591476 670609207 675012360 675816345 681393509 682553711 673940201
3892.2 673940201 674069672 677229538 675678787 675606995 676314087 679599152 683782349 672741852 676380310
3900.9 676380310 680960083 674367294 678836746 677280197 674641113 673906479 673534012 675982971 675797729
3909.6 675797729 675814285 675792770 675844345 675861282 675321045 676918182 679628143 677544556 673197098 677003555
3919.2 677003555 677803421 672533722 673638992 675556564 678005524 677375259 673179550 674033432 675619202
3927.9 675619202 677373123 676772232 675071335 677235565 676356964 675028076 676025391 675471191 675497208
3936.6 675497208 675968857 675484695 674750519 674450912 676426468 678650894 675330658 673013992 673691559
3945.2 673691559 674963303 676572342 674532623 674792709 676007843 674019394 675003281 675367432 674763565
3953.9 674763565 674840240 675181046 675500488 674700089 675164719 675025940 675274124 675713654 674072418 674172287
3963.6 674172287 674887238 674482498 674154205 674276428 674598999 674263763 673734818 674497681 674525909 673917313
3973.2 673917313 674856796 675114288 674667053 673711243 673857117 674653168 674030304 674816055 675484161 675091171
3982.8 675091171 674459991 674197540 674984741 674986191 674447861 674163742 674875336 674839630 674096375 674239349
3992.5 674239349 674742966 675412750 674620209 674399796 674912872 674915237 675229187 674863281
4000.2 674863281
##END=$$ End of the data block
