##TITLE=$$ Begin of the data block
##JCAMP-DX=5.00 $$ ACD/SpecManager v 10.08
##SPECTROMETER/DATA SYSTEM=Varian
##DATE=14 Jan 2013 09:52:44
##DATA TYPE=INFRARED SPECTRUM
##DATA CLASS=XYDATA
##ORIGIN=
##OWNER=
##NPOINTS=3735
##FIRSTX=399.26403809
##LASTX=4000.35498047
##MAXX=4000.35498047
##MINX=399.26403809
##MAXY=73.57907104
##MINY=23.33030701
##XFACTOR=1.0000000000
##YFACTOR=0.000000100000000
##FIRSTY=46.47244263
##DELTAX=0.96440572
##XUNITS=1/CM
##YUNITS=TRANSMITTANCE
##XYDATA=(X++(Y..Y))
399.3D64724426K929611p036514n388717m570122n427475L226318N773659m080010
407D50151176n359382J540756L641739N61523j32331K719268j109886m298973L519211
415.7D51233101L722916r66225N862465q313790o214370O618919J344643j050530Q21610
424.3D53058739J728019k618599p895050k495422n38025K684555M578285m74891q47740
433D47179871k185135m02603n5199j694908K236519Q46901k720681J04943K353706
441.7D45663414J238289J346245k219239m87251M401665K449684k315979l333359k782745
450.4D43960724n227203K622108M669723k764015j679687l435288J087303j178131
458.1D38055534o332L883705m041366k325211J216888K550469j364403l565979M140625
$$ plain form
399.3 464724426 467654037 460617523 455228806 450658684 445231209 448457527 454231186 450151176
407 450151176 444791794 446332550 449974289 450535812 450403481 453122749 452012863 447713890 451233101
415.7 451233101 454956017 453989792 459852257 451538467 445324097 451943016 453287659 452237129 453058739
424.3 453058739 454786758 452168159 444273109 441777687 441239662 443924217 448502502 448027611 447179871
433 447179871 444994736 444592133 444536934 442842026 445078545 445925446 443204765 443309708 445663414
441.7 445663414 446901703 448247948 446028709 445541458 449943123 452392807 450076828 446743469 443960724
450.4 443960724 438733521 441355629 446025352 443261337 441581650 438146362 439233665 438055534
458.1 438055534 438049202 441932907 437891541 435566330 436783218 439333687 437969284 434403305 438543930
466.8D38543930K743340J054649K38686k828064l526574l189392j577949k65198L230667
475.5D34424095J613426j893158m813728k741280K932892l27873k495041k485466k445526
484.1D21768341n57556q50487K083283K047996L78838K109947J199112j74217p28608
492.8D27276649p20291k012291m948845k782745J770668M111061K025032p88803K90985
501.5D24221420r26056q60939m24347j001625R03359k036209k021332K58560m42047
510.2D17670784J182442J404495P17621l81279k062874k097054k857360k410546M02680
518.9D11568909K756653M26826k520027j791458l5172K605133K173767l108253k620621
527.5D09455757j08299m32816j009292q81653P7286J837196J612511l03536l85284
$$ plain form
466.8 438543930 441287270 442341919 442580605 439752541 436225967 433036575 431458626 431193428 434424095
475.5 434424095 436037521 434144363 429330635 426589355 429522247 429194374 426699333 424213867 421768341
484.1 421768341 421210785 420360298 422443581 424491577 424870415 426980362 428179474 428005257 427276649
492.8 427276649 426556358 424544067 419595222 416812477 418583145 422694206 424719238 423930435 424221420
501.5 424221420 423295364 422434425 422010078 421008453 421911812 419875603 417854271 418112831 417670784
510.2 417670784 418853226 420257721 420975342 420594063 418531189 416434135 413576775 411166229 411568909
518.9 411568909 414325562 414752388 412232361 410440903 410405731 413010864 415184631 412076378 409455757
527.5 409455757 409347458 408914642 407905350 407023697 407100983 408938179 410550690 410247154 409861870
536.2D09861870j240387j239052q05016k678489j598473M93012P11174o2447p057J715813
545.9D05150948N81398j413689j176758r82857k569923k005920j67122r80873o75126
554.5C95760078J89324J568718J385689j90850O43463l33900j801262j277847k45438
563.2C95697975l27339j377029r995J756935J184120N14794J042213M10080j351967
571.9C97539787j970634j426277n51453J27296O07758O75774J323318J595917R70383
580.6C98891869o91948j578408k02713P79457o75621k503204q88176J420593J755028
589.3C96306877K080574J007118N11513J021347j80740j581497j378937j038246j772194
597.9C94975815n91812J734581J617927J049195J368522M22859j289062k087402j096611
$$ plain form
536.2 409861870 408621483 407382431 406577415 403898926 402300453 402793465 403504639 403442192 403435135 405150948
545.9 405150948 405732346 404318657 403141899 402159042 399589119 397583199 397416077 396435204 395760078
554.5 395760078 395949402 397518120 398903809 398712959 399356422 399022522 397221260 395943413 395697975
563.2 395697975 395370636 393993607 393983612 395740547 396924667 397439461 398481674 398891754 397539787
571.9 397539787 395569153 394142876 393591423 393718719 394326477 395002251 396325569 397921486 398891869
580.6 398891869 398199921 396621513 396418800 397198257 396522636 394019432 393131256 394551849 396306877
589.3 396306877 398387451 399394569 399906082 400927429 400746689 399165192 397786255 396748009 394975815
597.9 394975815 394384003 396118584 397736511 398785706 400154228 400577087 399288025 397200623 396104012
606.6C96104012q61702k607041k126465l42712J81122O94160J042557N66254q32405
615.3C91817780o9695M43230j997338k679672j022110R85298J206703J248360K217941
624C92150497K444077J330757Q60291J901550J219635L95203j96572n55877J093940
632.7D00643501K237282K426529K169304J766586J972046K070999K091446J122093
640.4D16499786p77664r64165n07545m51622N87158K516899L123436K948227L123398
649D26097908J530418K95830l83110j486015j372070p15218M95186N29403L70980J581764
658.7D26945076J549110L12653L39813n62935k265854j121864j444855n53512K850075
667.4D26047707L562507o66694q8692J078606K082710J206703n67474j496125J49575
$$ plain form
606.6 396104012 395242310 392635269 390508804 390166092 390347214 391041374 392083931 392650185 391817780
615.3 391817780 391748085 392191315 390193977 387514305 386492195 387477493 388684196 389932556 392150497
624 392150497 394594574 395925331 396785622 398687172 399906807 400302010 400105438 399549561 400643501
632.7 400643501 402880783 405307312 407476616 409243202 411215248 413286247 415377693 416499786
640.4 416499786 415722122 414757957 414250412 413798790 414385948 416902847 420026283 422974510 426097908
649 426097908 427628326 427924156 427541046 426055031 424682961 423967743 424462929 424992332 425363312 426945076
658.7 426945076 428494186 428806839 429146652 428583717 426317863 425195999 423751144 423197632 426047707
667.4 426047707 429610214 428943520 428854828 429933434 432016144 433222847 432655373 431159248 431308823
676.1D31308823K14119K18429J484261J807670K339211K517128K642288J541863P98034
684.7D44871826N26924m47616p22275l10364Q12836R31053R25293J775093K189407
693.4D50552177K006188J264953M82598p5073p78923r15680o63567j386223J91117
702.1D50677567K532157K185135K352906K737426J467400l52097n35125m60930p48863
710.8D59855576J82952J160050R27124R98802K617683J903763J140786J701850O52047
719.5D71140633n24903j909828p45201L07693j69448J070251K389488K370682J623001
728.1D75552368K348061J824417k87018n67055L68729N10864k17285M6883M51774J401902
737.8D81433640J897506K491532J865844p28454l74298m98505j056213k71836M82712
$$ plain form
676.1 431308823 431522942 431741371 433225632 435033302 437372513 439889641 442531929 444073792 444871826
684.7 444871826 445398750 444951134 444228859 443918495 444731331 445662384 446587677 448362770 450552177
693.4 450552177 452558365 453823318 454305916 454230843 453451920 452536240 451872673 450486450 450677567
702.1 450677567 453209724 455394859 457747765 460485191 461952591 461600494 461065369 460604439 459855576
710.8 459855576 460038528 461198578 462125702 463124504 465742187 467645950 468786736 470488586 471140633
719.5 471140633 470615730 468705902 467960701 468268394 468098946 469169197 471558685 473929367 475552368
728.1 475552368 477900429 479724846 479437828 478870773 479239502 479750366 479533081 479579964 480031738 481433640
737.8 481433640 483331146 485822678 487688522 486960068 486585770 486087265 485031052 484759216 485241928
746.5D85241928R52797J352615K446785K322998K466889J590614r2239n27458r41124
755.1D94813805n24254Q99277K025032Q26187P83539K027435K353363K341156J881409
763.8E07426949J206932p01523q58727j317558j238670N22079P83386J321411R99604
772.5E08143883R12475R03664N61409r90829j927071n46761j132087q94051l80058
781.2E04650574P85331J909600K070236K675018N73731N82885Q80585p27348j516113
789.9E11884499j597214m70009K57492R29680Q86497R33953J036987L93982p20291
798.5E13535576o39382n89714k996368k423019j080552j127166j603928j686859o16837
807.2E00771751m85801j53885j451988k427712l161354l696861k716866k380142l46107
$$ plain form
746.5 485241928 486194725 487547340 489994125 492317123 494784012 496374626 496282387 495754929 494813805
755.1 494813805 494289551 495188828 497213860 498040047 498823586 500851021 503204384 505545540 507426949
763.8 507426949 508633881 507932358 507073631 505756073 504517403 505039482 505822868 507144279 508143883
772.5 508143883 509056358 509960022 510521431 509530602 507603531 507056770 505924683 505030632 504650574
781.2 504650574 505435905 507345505 509415741 512090759 512664490 513247375 514127960 513400612 511884499
789.9 511884499 510287285 509817276 510074768 511004448 511890945 512824898 513861885 514255867 513535576
798.5 513535576 512896194 512306480 509310112 506887093 505806541 504679375 503075447 501388588 500771751
807.2 500771751 500285950 500132065 498680077 496252365 493091011 489394150 486677284 484297142 483951035
815.9D83951035J44157j71661O87713Q50601J594696Q68149q8157k20070O45981J493988
825.5D89756432K223014L644143L897399L941117L710747M504661M494896K929421
833.3E19101830J845512J046410J143455J605530J816635J387100K835617M178505
841E34960594M139977K629432Q75817Q47282k28538Q28361P44934M04244J323776P34787
850.6E47260666J600037K002677K779084K465667K183838J360550l66363P09648O69784
859.3E60665588P72591O71387O16111J609040K613907K516098J011696J37481r07821
868E69706078j113129k930145k727661j244660j899452r40285j33705N61676j34582
876.7E59144135j078110j557350j220322j222611k555694j330948j047745p53822n83153
$$ plain form
815.9 483951035 484095192 483923531 484611244 485461845 487056541 487924690 487836533 487616463 488262444 489756432
825.5 489756432 491979446 495623589 499520988 503462105 507172852 511677513 516172409 519101830
833.3 519101830 520947342 521993752 523137207 524742737 526559372 527946472 530782089 534960594
841 534960594 539100571 541730003 542605820 543453102 543224564 544052925 544797859 545202103 546525879 547260666
850.6 547260666 548860703 550863380 553642464 556108131 558291969 559652519 559286156 559995804 560665588
859.3 560665588 561438179 562109566 562725677 564334717 566948624 569464722 570476418 570613899 569706078
868 569706078 568592949 565662804 562935143 561690483 559791031 558850746 558717041 559278717 559144135
876.7 559144135 558066025 556508675 555288353 554065742 551510048 550179100 549131355 548377533 547794380
885.3E47794380m40407K27242l26920K11449l03879n55458j230583j568604r72442
894E42834778j089707r8190O98090J380500O15120q0680p24717j462783j202813j025772
903.7E39843826n20591n44777J758041L510590M152717M004822K537155J921082k05269
912.3E56457596L71399q80852k747231j952934k611389k251358k258835j156692j774865
921E41194839k452011k201423l224831k826042m400673n093765m579659l856430k993011
929.7E09566994k655487j465416j167565j416244k379494j763382j131325k076416
937.4D95511665k380485k264595r41048j026306q56133k22663l24822K43225m32625
946.1D87306213n30853m06914o34231q26187o48194K7924n94750n15060Q1444l53775
$$ plain form
885.3 547794380 547353973 547581215 547254295 547465744 547161865 546606407 545375824 543807220 542834778
894 542834778 541745071 541646881 542344971 543725471 544340591 544259911 543535194 542072411 540869598 539843826
903.7 539843826 539323235 538778458 540536499 544047089 548199806 552204628 554741783 556662865 556457596
912.3 556457596 556828995 555948143 553200912 551247978 548636589 546385231 544126396 542969704 541194839
921 541194839 538742828 536541405 533316574 530490532 526089859 520996094 516416435 512560005 509566994
929.7 509566994 506911507 505446091 504278526 502862282 500482788 498719406 497588081 495511665
937.4 495511665 493131180 490866585 489925537 488899231 488043098 487820435 487495613 487738838 487306213
946.1 487306213 486775360 486368446 485734215 484908028 484259834 484287758 483693008 483177948 483259392 482905617
955.7D82905617r71947j187134j878776k940140l351479k715377j952057k384110j732635
964.4D63791962p72324j390266j789818j199341j334152k581749k709389k914543l674164
973.1D45426216m217491m049339l106842k910843k902336l572808l954773l872566
980.8D16839218n124664n408898n989532o653404n313721n237808m874878m282837
988.5C73953476m175491l289109k922477k573319l729439l729629l234978l664589
996.2C46634445l170471k944031k177925k486877k454453k099037j841812j999054
1004C27460785k472458j862221k703819k056160k131672k486648j480275j456318j211128
1012.6C09600086k171154j173973r95464k139549k095051k702961k615586k268219
$$ plain form
955.7 482905617 481933670 480746536 478867760 475927620 472576141 469860764 467908707 465524597 463791962
964.4 463791962 463019638 461629372 459839554 458640213 457306061 454724312 452014923 449100380 445426216
973.1 445426216 441208725 437159386 434052544 431141701 428239365 424666557 420711784 416839218
980.8 416839218 411714554 406305656 400316124 393662720 388348999 383111191 378236313 373953476
988.5 373953476 369777985 366488876 363566399 360993080 357263641 353534012 350299034 346634445
996.2 346634445 343463974 340519943 338342018 335855141 333400688 331301651 329459839 327460785
1004 327460785 324988327 323126106 320422287 318366127 316234455 313747807 312267532 310811214 309600086
1012.6 309600086 307428932 306254959 305259495 303119946 301024895 298321934 295706348 293438129
1020.3B93438129k098198k895736j760483j131973j675263j357784j835957j227092
1028.1B79455643j024323q46519j799317j280460n86414j075898M59690N76249J513424
1036.7B75392075J883564K206459J731834J106987J640244O90193J008796J60103M845
1045.4B85825100k78378k26402L09601r28841p42073j664428j670838j940117j604519
1054.1B77079105j573696j821518j63002j098137J79692O35833J487332J977901J457424
1062.8B78160934K657528J699677K396698J110248R78127J452408J558838L047542
1070.5B93062000J676922J617718M85515o2332J72730J49269k43740k59056J369877
1079.2B97968903J50165J033440J189174Q94490J302814Q44650R73340L27358K057342
$$ plain form
1020.3 293438129 291339931 288444195 286683712 285551739 283876476 282518692 280682735 279455643
1028.1 279455643 278431320 277584801 275785484 274505024 273918610 272842712 273302402 273878651 275392075
1036.7 275392075 277275639 279482098 281213932 282320919 283961163 284651356 285660152 285820255 285825100
1045.4 285825100 285546722 285320320 285629921 284701080 283959007 282294579 280623741 278683624 277079105
1054.1 277079105 275505409 273683891 273520889 272422752 272602444 273238277 274725609 276703510 278160934
1062.8 278160934 280818462 282518139 284914837 286025085 287003212 288455620 290014458 293062000
1070.5 293062000 294738922 296356640 296842155 296779823 296952553 297101822 296858082 296599026 297968903
1079.2 297968903 298119068 299152508 300341682 301236172 302538986 303383636 304356976 304684334 306741676
1087.9C06741676R93729J07517N34516J177806K737179J239357J437645J313744J637115
1096.5C17920284J498051O00624P46002N01709J331101K86407O91071J386947K218247
1105.2C27180443K705078N71785P03277J270981J496773K23160o98815l39431L66096
1113.9C33479347J721993J166954J235962N28602R8229P69195j36223p56263k24800
1122.6C37882996M2686m57687P5073Q37288J973610J696968J499748K154388J791039
1131.2C47496109K560349K137794K105865J542168J915169L182487J877327J875077
1139C64692345K004165K554245K031823J166877J482125R36546N63393n81894n8861
1147.6C74790764O14509J40534O02112M31328K10609M61960N05523n30853o74858r46579
$$ plain form
1087.9 306741676 307735405 307842922 308377438 309555244 312292423 313531780 314969425 316283169 317920284
1096.5 317920284 319418335 320018959 320764961 321266670 322597771 322884178 323575249 324962196 327180443
1105.2 327180443 329885521 330457306 331160583 332431564 333928337 334151497 333452682 333113251 333479347
1113.9 333479347 335201340 336368294 337604256 338132858 338231087 339000282 338864059 338107796 337882996
1122.6 337882996 337925682 337467995 337543068 338380356 340353966 342050934 343550682 345705070 347496109
1131.2 347496109 350056458 352194252 354300117 355842285 357757454 360939941 362817268 364692345
1139 364692345 366696510 369250755 371282578 372449455 373931580 374868126 375431519 374849625 374790764
1147.6 374790764 375405273 375545807 376147919 376579247 376789856 377251816 377757339 377226486 376551628 375605049
1157.3C75605049j854019j596947j374092m88548M4174O18630R42153J292000J895600
1166C75084000J914520K660561K830810K622528J773300K348557L316994L215484L436775
1174.6C99203529L417244M131852L473281K717667K545280K000809K071495K213936
1182.4D21775093K225990J666069J750946K260285K252045J891059R41010M41589N94254
1191D35798340J55067n78575j335373q58879L55950k32773n87883j56594k64473o62918
1200.7D31631889j139259j335640j303062j223030j666718j558037j039696m05883
1208.4D21960564M51812K61269L93181K57797n67016m03176o58951j222953j179696
1217.1D19292831p52029m36096j95465N5732n2223n9204l85055r30825j369056j321450
$$ plain form
1157.3 375605049 373751030 372154083 370779991 370291443 370335617 370954247 371896400 373188400 375084000
1166 375084000 376998520 379659081 382489891 385112419 386885719 389234276 392551270 395766754 399203529
1174.6 399203529 402620773 406752625 410225906 412943573 415488853 417489662 419561157 421775093
1182.4 421775093 424001083 425667152 427418098 429678383 431930428 433821487 434762497 435204086 435798340
1191 435798340 435953407 435374832 434039459 433180580 433536530 433303757 432715874 432559280 432294807 431631889
1200.7 431631889 430492630 429156990 427853928 426630898 424964180 423406143 422366447 421960564
1208.4 421960564 422412376 422673645 423066826 423324623 422757607 422354431 421695480 420472527 419292831
1217.1 419292831 418540802 418104706 417909241 417964973 417912750 417853546 417468491 416537666 415168610 413847160
1226.7D13847160r64431j124840j140290r44557n94940m21486m01764k07596m03938
1235.4D07643318k91405n18417m96063k44064p29142m13627k00157k28615M005K4605
1245D04550438j30501m05655m10537m93584n50766n26886l37372l82919n69458O5040
1254.7D00807800N43404J43394p8315K38647k14271l03345P4081Q660J49269K22511
1264.3D01591835P40852Q51365R56535J146736Q99353O99425N44128R42192P27425
1273D09099846N23758O50368J036109J309319J364632J759452J322938J178550J186142
1281.7D19431114J464081J467285R54514J063003J265030J600723J345292J611213
1289.4D30202255J772690J441841J116066P96509O90269J11924L21884L46679M18778
$$ plain form
1226.7 413847160 412882729 411757889 410617599 409673042 409078102 408656616 408254852 408047256 407643318
1235.4 407643318 407351913 406833496 406337433 406093369 405364227 404950600 404750443 404521828 404525833 404550438
1245 404550438 404419937 404014282 403603745 403110161 402559395 402032509 401695137 401312218 400742760 400807800
1254.7 400807800 401351204 401494598 401416283 401654930 401440659 401137314 401211395 401220055 401369324 401591835
1264.3 401591835 402332687 403184052 404140587 405287323 406186676 406886101 407430229 408372421 409099846
1273 409099846 409623604 410273972 411310081 412619400 413984032 415743484 417066422 418244972 419431114
1281.7 419431114 420895195 422362480 423316994 424379997 425645027 427245750 428591042 430202255
1289.4 430202255 431974945 433416786 434532852 435329361 436019630 436131554 436453438 436800117 437218895
1298.1D37218895N89447N08881P89413P37534O86569J96342J37368m20189q10128o22558
1307.7D39011574j404534j235809l95470N3902k39220l12271K01111j80473o53534
1316.4D34845276j30463N60036j37405j31875M74854P55997J225357J258507J573524
1325.1D40293808R65309K07634O0120k42996q00896q95195n90058p72895m46091k49214
1334.7D37529526N913L74679N82810R02977K88124K36396j2321R8534M61464M97398
1344.4D40965500P82738R00993J538925J664314J351891K2774m54293j89170j076088
1353.1D45507584j053124p28721k21787j81313j42707J8959K53067L41797k1401N08042
1362.7D44280396j517830j462288n97420p94258m96979r54704k79999M9400N03884
$$ plain form
1298.1 437218895 437808342 438317223 439106636 439844170 440530739 440727081 440864449 440444260 439634132 439011574
1307.7 439011574 437607040 436371231 435975761 436029663 435790443 435478172 435679283 435498810 434845276
1316.4 434845276 434714813 435274849 435137444 435005569 435480423 436236420 437461777 438720284 440293808
1325.1 440293808 441259117 441466751 441526871 441283875 440482979 439587784 438997726 438224831 437778740 437529526
1334.7 437529526 437535439 437910118 438492928 439395905 439684029 439920425 439908104 440006638 440468102 440965500
1344.4 440965500 441748238 442649231 444188156 445852470 447204361 447227135 446772842 446583672 445507584
1353.1 445507584 444454460 443725739 443503952 443322639 443179932 443198891 443451958 443793755 443772354 444280396
1362.7 444280396 442762566 441300278 440702858 439908600 439411621 438456917 438176918 438226318 438730202
1371.4D38730202N67283K53792K03781n58471J53999o2027k65656p03201m87251j0109
1381D37822342n53703p04041r57909n52177o95496p44819k574158k297630j179199
1389.7D27563210k285424j763229j592369o05583j606789m145813j759682j562576
1397.4D12241745j334114m048081l668022j607742k402802j950302j640854j906204
1405.1C93683624k103386j386375j648522k001647j634751k493934j804429j830902
1412.8C78779678j687889o50902n21011j08337n93643L14331k466546j319313J001358
1421.5C72747726r7084N30816j278000k90299J052628R84611J837502J015472R46312
1430.2C77449684P27463K062645J731224J123161K313500K039489J249695O65169K844620
$$ plain form
1371.4 438730202 439297485 439551277 439755058 439196587 439350586 439288559 439022903 438319702 437832451 437822342
1381 437822342 437268639 436564598 435606689 435054512 434359016 433614197 431040039 428742409 427563210
1389.7 427563210 425277786 423514557 421922188 421316605 419709816 415564003 413804321 412241745
1397.4 412241745 410907631 406859550 403191528 401583786 399180984 397230682 395589828 393683624
1405.1 393683624 391580238 390193863 388545341 386543694 384908943 382415009 380610580 378779678
1412.8 378779678 377091789 376440887 375919876 375811539 375217896 375532227 373065681 371746368 372747726
1421.5 372747726 372650642 373181458 371903458 371613159 372665787 373650398 375487900 376503372 377449684
1430.2 377449684 378177147 380239792 381971016 383094177 385407677 387447166 388696861 389362030 392206650
1438.9C92206650K109947K232704K461090J450806K375259J657830K138290J549988
1446.6D08182564J716881J244049R55696K537727J843948K536927J450233K311058
1454.3D22779083K634163J385422K909889n32455K396431J059341K671700J983871
1462D37287445J373940L612213J831131J845054J837120K599945K575493K520752L590050
1470.7D59073143L045044L707161J093216K911949L841591K565765J803437K164955
1478.4D80206261K244720K127113K029610R46808J529617J901589J636772K530174
1486.1D95152664J691704J73607J831627J584244j601830p32536P858q57620j09597
1494.8D97140121R17626m131737m08478r74655l677063k10266r78584j581497j125985
$$ plain form
1438.9 392206650 394316597 396549301 399010391 400461197 402836456 404494286 406632576 408182564
1446.6 408182564 409899445 411143494 412099190 414636917 416480865 419017792 420468025 422779083
1454.3 422779083 425413246 426798668 429708557 429176102 431572533 432631874 435303574 437287445
1462 437287445 438661385 442273598 444104729 445949783 447786903 450386848 452962341 455483093 459073143
1470.7 459073143 462118187 465825348 466918564 469830513 473672104 476237869 478041306 480206261
1478.4 480206261 482450981 484578094 486607704 487554512 489084129 490985718 492622490 495152664
1486.1 495152664 496844368 497017975 498849602 500433846 498832016 498099480 498107338 497249718 497140121
1494.8 497140121 498057747 493926010 493517532 492542877 488865814 488655548 487676964 486095467 484969482
1503.5D84969482R45168J772537j876640m118462j096344J240921o78558L67622n70221
1512.2D80955505k626915n03997q81844j57738m32472l042068J282768L171005R02062
1520.8D78666306k644577j285363L63236J994514m06418K28234J494484j49498L41262
1529.5D78602180J652718J805077J460189J488648k535896M05006Q17566O80199K673149
1538.2D87048836J719589l223763j317825R51348L24668J822052J460381k666054N22576
1546.9D86641808m1352N74417O4392j985054L36190P65304K405319j414756j063004
1555.6D86283264K285118L767205k64512q276786l031350k266006J80664j540489j210823
1564.2D75926285k770081k846107q00667j929436j33934r501686m274712k292518l955155
$$ plain form
1503.5 484969482 485914650 487687187 485810547 481692085 480595741 481836662 481158104 481525726 480955505
1512.2 480955505 478328590 477824593 476942749 476785011 476352539 473310471 474593239 477764244 478666306
1520.8 478666306 476021729 474736366 475099602 477094116 476687698 476915932 478410416 478260918 478602180
1529.5 478602180 480254898 482059975 483520164 485008812 482472916 482877922 483695488 484375687 487048836
1538.2 487048836 488768425 485544662 484226837 485178185 485502853 487324905 488785286 486119232 486641808
1546.9 486641808 486600456 487174873 487239265 485254211 485590401 486355705 488761024 487346268 486283264
1555.6 486283264 488568382 492335587 492071075 483794289 480762939 478496933 478677597 477137108 475926285
1564.2 475926285 473156204 470310097 469509430 467579994 467446060 457944374 453669662 451377144 447421989
1572.9D47421989l104820k626495n97305j3346444k414093l083305m278412m544029
1580.6D13427086o247559m037475o613846m175987n878334m623414m411125n507507
1588.4C71931839l029900n956115l324051n924721l795090m266700n497971k990570
1596.1C37146721n223961j916161m454231k067451l370514l400822j932354m571972
1603.8C10209255j472835l851033q14876k724075j723214j243782k989025K39163k747860
1612.5B92881718R9487j717796J167450J164856p272015J352653j242618J251335j335907
1621.1B86349163J510963J103058k356510J308251j32504K430763j697998Q93307O17352
1629.8B90025845O38637J523705J96972L056812J116600K607422j484013K614441J180859
$$ plain form
1572.9 447421989 444317169 441690674 441093369 427746925 425332832 422249527 417971115 413427086
1580.6 413427086 407179527 403142052 396528206 392352219 386473885 381850471 377439346 371931839
1588.4 371931839 368901939 362945824 359621773 353697052 349901962 345635262 340137291 337146721
1596.1 337146721 331922760 330006599 325552368 323484917 320114403 316713581 314781227 310209255
1603.8 310209255 308736420 304885387 304070511 301346436 299623222 298379440 295390415 295629578 292881718
1612.5 292881718 292981205 291263409 292430859 293595715 286323700 287676353 286433735 287685070 286349163
1621.1 286349163 287860126 288963184 286606674 287914925 287782421 290213184 288515186 289408493 290025845
1629.8 290025845 290664482 292188187 292385159 295441971 296558571 299165993 297681980 300296421 301477280
1638.5C01477280R37233K580566l05386K327443P84492K931728K867566O25171L482666
1647.2C17708759j050358L266888J325894L708725L766365J935806j790123o63452
1654.9C28208504M236603J663322L107147K057228K472191K749291K686195M086113
1662.6C51266594K59857L038025K012024K821693L125611L291092L838844K208786
1670.3C71862526N536194K262802M434814M941979M267883J118775K309989M738579
1678D01473541L384667N232696L483582M609566O639137O109237M835358j078529N689583
1686.7D40378838N124054M091491M190102L525429M525642M699669N588760O435814
1694.4D78559799P930565J365547L636437O183510P346763P950287p102356N733986
$$ plain form
1638.5 301477280 302414513 304995079 304689693 307017136 307801628 310733356 313600922 314226093 317708759
1647.2 317708759 316658401 319925289 321251183 324959908 328726273 330662079 328871956 328208504
1654.9 328208504 332445107 334108429 337215576 339272804 341744995 344494286 347180481 351266594
1662.6 351266594 351526451 354564476 356576500 359398193 362523804 365814896 369653740 371862526
1670.3 371862526 377398720 379661522 384096336 389038315 393306198 394424973 396734962 401473541
1678 401473541 404858208 410090904 413574486 418184052 424823189 430932426 435767784 434689255 440378838
1686.7 440378838 445502892 449594383 453784485 457309914 461835556 466535225 472123985 478559799
1694.4 478559799 486490364 487855911 491492348 497675858 505022621 512972908 505870552 511604538
1702.1E11604538N732536N038872L950348M420853K886772J902046L930626K873840
1709.9E42340431J621285J603355K227974L203850J598244J146926M278679M246979
1717.6E62267723l621979J336365K739716J720352J464691N39093j75056R72824J703834
1726.3E68947563J468468K204361L472366J108933l18070L953896M860801n9433o501045
1734.9E79137840J701012L569221K030106L592072K145957j453285M522362M339523
1742.7E99584808J995850J671066L293724L354531K609863L065681J226998M958954
1750.4F21761475L460655R15413M981079L465957L696290M484176J030426R74426K218171
1759F46988068K394256M237595N94024o73294L767395K856293K414551K619095K601471
$$ plain form
1702.1 511604538 517337074 522375946 526326294 530747147 533633919 535535965 539466591 542340431
1709.9 542340431 543961716 545565071 547793045 550996895 552595139 553742065 558020744 562267723
1717.6 562267723 558645744 559982109 562721825 564442177 565906868 566445961 566270905 567243729 568947563
1726.3 568947563 570416031 572620392 576092758 577201691 576883621 580837517 585698318 585638885 579137840
1734.9 579137840 580838852 584408073 586438179 590030251 592176208 590722923 595245285 599584808
1742.7 599584808 601580658 603251724 606545448 609899979 612509842 615575523 616802521 621761475
1750.4 621761475 625222130 626137543 631118622 634584579 638280869 642765045 643795471 644769897 646988068
1759 646988068 649382324 653619919 654213943 653540649 657308044 660164337 662578888 665197983 667799454
1767.7F67799454j639939J027604M907913J907348k046203l119278M068527L513260
1775.4F76418686n63126K030106J466141K027206O13022j833954L09143J710892K294235
1784.1F84472351j87454j8006J920548J800919J383361K447052J518479M99267j890335
1792.8F91946182k482910L004685J683883l17230J082306K613373J689071j357650
1800.5F97861710J724395l0517j70212J266937J61438R68933R27658N31769J023026
1809.2G04265137J853866m32052N72815J244735k6855P96585l68424M30604j62507
1817.9G08173904K96250J305847O63376J738052J46408J068192J605301k357788r99985
1826.5G11639557J634903K549972J230698l462524k97165K765274P75604N54123N17883
$$ plain form
1767.7 667799454 666159515 667187119 672095032 674002380 671956177 668836899 672905426 676418686
1775.4 676418686 675855560 677885666 679351807 681379013 681992035 680158081 680467224 682178116 684472351
1784.1 684472351 684284897 684266891 686187439 687988358 689371719 691818771 693337250 693836517 691946182
1792.8 691946182 689463272 692467957 694151840 693834610 694916916 697530289 699219360 697861710
1800.5 697861710 699586105 699555588 699385376 700652313 700813751 701782684 702710342 703242111 704265137
1809.2 704265137 706119003 705686951 706259766 707504501 707477646 708274231 707905807 708336411 708173904
1817.9 708173904 708470154 709776001 710439377 712177429 712323837 713392029 714997330 712639542 711639557
1826.5 711639557 713274460 715824432 717055130 713592606 713295441 716060715 716836319 717390442 717908325
1835.2G17908325K43302K33383j196900M39072K5253O87485P15103J984711K845840
1843.9G23885574n382385J006088K514801L78495n38407l81393N87311l63160O10733
1852.6G22317657J35346O66504J137695O51245O96030m85382J04980j70974J12686
1861.3G25165787m40903k84882K20795L22418J896439R80682J492691o61926k010803
1869.9G26680298N34134K42843P4234n43441J85775j48773L21655Q53501Q32977J016846
1879.6G30050049k25372J75933k77633L08456j13144j068115k51236k69470J493072
1888.3G29822540R31931r71146N08042J319885L23257K15302j67923j630020l17993
1896.9G30033875l40500L14026N08117L26462Q68759M51889J073609j27411k93656
$$ plain form
1835.2 717908325 718151627 718385010 717188110 717627182 717652435 718339920 719055023 721039734 723885574
1843.9 723885574 718503189 719509277 722024078 722402573 721864166 721482773 722070084 721706924 722317657
1852.6 722317657 722453003 723119507 724257202 724908447 725604477 725119095 725224075 725053101 725165787
1861.3 725165787 724724884 724440002 724660797 724983215 726879654 727860336 729353027 728691101 726680298
1869.9 726680298 727214432 727457275 727531509 726988068 727173843 727025070 727346725 728200226 729033203 730050049
1879.6 730050049 729824677 730000610 729722977 730031433 729918289 728850174 728598938 728329468 729822540
1888.3 729822540 730754471 729783325 730291367 731611252 731934509 732149811 731981888 730351868 730033875
1896.9 730033875 729693375 730007401 730515518 730841980 731710739 732162628 733236237 733108826 732815170
1905.6G32815170k9678m70123n31388n06668k04773m84924J178436Q54492J012879
1914.3G33633423O56891j49460J649856j789093k041778J91650j1825N31768l45611
1923G32325821j70517O42090J098938N73807M46319k63824p91931p21055p44781K56882
1932.6G32651749l72925Q926L06778O23551R92660M57382K58637j028824M58755K0524
1942.3G34377213k377244k83584O00281M07028k23694O19812O99615K40479j20316
1951G33939590m46167j64947n93720m56848n99899k26822J82572M92477N96619L19061
1960.6G33041916M70734k62757l00827p07474k99301L24326n87845o14624J84631Q19550
1970.2G32068329L01132P36237R3612o43310j07422l92456j96533p55997j91574j18790
$$ plain form
1905.6 732815170 732785492 732315369 731783981 731277313 731072540 730587616 731766052 732620544 733633423
1914.3 733633423 734290314 734140854 735790710 734001617 731959839 732151489 732139664 732671432 732325821
1923 732325821 732155304 732797394 733896332 734470139 734916458 734652634 733860703 733139648 732394867 732651749
1932.6 732651749 732278824 732287750 732594528 733218079 734210739 734668121 734926758 733897934 734356689 734377213
1942.3 734377213 731999969 731716385 732316666 732723694 732500000 733119812 733819427 734059906 733939590
1951 733939590 733493423 733328476 732734756 732277908 731678009 731451187 731633759 732126236 732722855 733041916
1960.6 733041916 733512650 733249893 732949066 732241592 731942291 732266617 731678772 731064148 731248779 732068329
1970.2 732068329 732369461 733105698 733199310 732556000 732448578 732056122 731859589 731103592 730912018 730793228
1979.9G30793228k67334P47910P73391O87256J36643J21994n63202n64270p90863j321869
1989.5G29752884M22897M31290n60684j91193J017838O15692m5090M11682j84707p80945
1999.2G30889664j253205l38821l02200n60456L84903N25360L80860K83127P55844
2007.8G30765076o8894o75277r73740j001434n30091o58569K40478L24402P32498L82233
2017.5G28536682J16196L69491n17120j70059p08008n83572j000824q87604L79562
2026.2G25534744J30081M70429K19269N31234K14081k74811n65872q82187k73208q40988
2035.8G24262772k64359m16870k90146Q43048J040573N83725l28827J91727o05850
2044.5G25015793o09665m79355r73434o62613o59104O12259N81131M46625M14276M71191
$$ plain form
1979.9 730793228 730525894 731273804 732047195 732734451 732871094 732993088 732429886 731865616 731074753 729752884
1989.5 729752884 730175781 730607071 730046387 729855194 730873032 731488724 731443634 731855316 731670609 730889664
1999.2 730889664 729636459 729297638 728995438 728434982 728819885 729345245 729726105 730009232 730765076
2007.8 730765076 730696182 730020905 729047165 728045731 727515640 726857071 727097549 727421951 728154449 728536682
2017.5 728536682 728652878 729022369 728505249 728335190 727627182 727043610 726042786 725155182 725534744
2026.2 725534744 725664825 726135254 726354523 726885757 727099838 726825027 726259155 725376968 725103760 724262772
2035.8 724262772 723998413 723581543 723291397 724134445 725175018 725758743 725429916 725621643 725015793
2044.5 725015793 724406128 723926773 722953339 722290726 721631622 722243881 722825012 723271637 723685913 724157104
2054.1G24157104M58985m18778n69458j396713p03812m52880m75617P9575L42560J258697
2063.8G22279663Q73718O77338k61536n89294n51605q36487n11627r68018j87607J16272
2073.4G20040817M16489O38428O41861P90939J678j67160q69751p08541o84891p56989
2083.1G19342880l53927o3858Q41369O05545N67704K76184K29492l01666q31757o40717
2092.7G19671249j191024n08728m12598J56097L91312J64642N34439L53775P27997
2101.4G19887161m43802q37860p93762p97653n21546o25915J93024j06049O59485R55963
2111G17569046L43018Q3007n44281k66800o17370p71256r51995m08249L1967J47018
2120.7G14614105P02820M63791P44247J92948M2114k34375o73904m89045o94809l71398
$$ plain form
2054.1 724157104 724616089 724197311 723627853 722231140 721527328 721074448 720598831 720678406 721020966 722279663
2063.8 722279663 723153381 723830719 723569183 722979889 722428284 721591797 721080170 720112152 719924545 720040817
2073.4 720040817 720457306 721095734 721737595 722528534 722530212 722363052 721493301 720784760 720099869 719342880
2083.1 719342880 718988953 718925095 719766464 720372009 720939713 721215897 721445389 721143723 720311966 719671249
2092.7 719671249 718480225 717971497 717558899 717714996 718106308 718270950 718805389 719159164 719887161
2101.4 719887161 719443359 718605499 717811737 717014084 716492538 715866623 716059647 715953598 716613083 717569046
2111 717569046 717912064 717995071 717450790 717183990 716566620 715795364 714843369 714435120 714467087 714614105
2120.7 714614105 715316925 715780716 716524963 716717911 716760025 716525650 715851746 715362701 714667892 714296494
2130.3G14296494m86680L76282N34516N34591Q80814K02331J73722l33634n94024j053467
2140G14530945o31638j93710m05579M40369Q07800R63440K96784P9422L4866l2654
2149.6G15890045l26767q93402l14026m87976j8844P7590K85035O84204K82364M14581
2159.3G15592804J4496K94952l66363o64368k38724j07269J40686k89688M47922L80859
2168.9G15205307L02048J00937J55944L05100o44760j90125m98047k56881j92795K22778
2178.5G14509506Q40073J5488O76727L47290J94626r9564l57437j85165o37665p8354
2188.2G15225525k40707L33175M07791J59531K38037K64816O15464k59858l31726n84716
2197.8G15827332m6998L09678j74866N5542O87O69174M41208L50494K5558j29165j75095
$$ plain form
2130.3 714296494 713809814 714186096 714720612 715255203 716136017 716338348 716512070 716178436 715584412 714530945
2140 714530945 713899307 713705597 713300018 713740387 714548187 715511627 715808411 715887833 715922699 715890045
2149.6 715890045 715563278 714669876 714355850 713867874 713849030 713926620 714211655 714895859 715178223 715592804
2159.3 715592804 715607300 715902252 715535889 714871521 714632797 714525528 714666214 714376526 714824448 715205307
2168.9 715205307 715507355 715608292 715764236 716069336 715424576 715234451 714736404 714479523 714286728 714509506
2178.5 714509506 715349579 715365067 716041794 716389084 716583710 716484146 716126709 715941544 715303879 715225525
2188.2 715225525 714984818 715317993 715725784 715885315 716123352 716388168 717003632 716743774 716412048 715827332
2197.8 715827332 715780334 716090012 715915146 715970688 715971375 716640549 717081757 717432251 717457809 717328644 717153549
2208.4G17153549p06329J11084o1188R7275M3259L24249M31824k63138M36706J85852
2218.1G17753143J13602n11627n51224l0441l27683M8065P4082N23987K29416K55584
2227.7G17576904J25656k40478P248m77371r1019j36337l70331l34625M17480N91965
2237.4G17069092L45993O59103m48837k81220j97753j04142p9574m83246J71127J81809
2247G16832352O08291J95542J40228O4392j71890K2125m60205K0828n30166j65482
2256.7G16556015J88141L4408K76719P1716O62918j92947K3574K32239k34833l10287
2266.3G17307663n45502J6785k13928L98712K12784K72598K93655k59399K40097m83551
2275.9G17239914l27148n43366m1885J7089m29382M39377m5853M15802k3880L02887
$$ plain form
2208.4 717153549 716447220 716558304 716497116 716594391 716637650 716961899 717393723 717130585 717567291 717753143
2218.1 717753143 717866745 717355118 716803894 716773453 716445770 716493835 716567917 717091904 717321320 717576904
2227.7 717576904 717702560 717462082 717469330 716991959 716900940 716764603 716394272 716059647 716477127 717069092
2237.4 717069092 717415085 718074188 717625351 717344131 717146378 717042236 716962662 716479416 716650543 716832352
2247 716832352 717440643 717636185 717776413 717840805 717668915 717691040 717230835 717251663 716721497 716556015
2256.7 716556015 716744156 716778564 717055283 717126999 717789917 717596970 717620544 717852783 717617950 717307663
2266.3 717307663 716762161 716778946 716565018 716963730 717176514 717449112 717742767 717483368 717723465 717239914
2275.9 717239914 716912766 716369400 716327515 716344604 715915222 716354599 716308746 716724548 716700668 717003555
2285.6G17003555O40106m45556l44086p23419R5901J52970L68042N04684K63367P96814
2295.2G18312378q9798L1509j91955J22909P8812q49762p2174K06299K34680Q8043
2304.9G17870941J041107J087265M82560O79473l7307K03628p095O0806j17111o30798
2314.5G20633469o87M71878J579971J723786R88998N17349L83225l03345n69992K71988
2324.2G25696640M196K80838O66962Q69217P28912L18146N77240Q8119J54953M31137
2333.8G29816360p07397r47647l35999n60989L12500J061935L90625M53721L91387
2342.5G29874496o86111j032181j321182k039948k491531l140716K72750L932953K640686
2351.2G26009216J325226J015244K027664K023163R43832K245789o14395j933365j231842
$$ plain form
2285.6 717003555 717643661 717198105 716854019 716130600 716226501 716379471 716747513 717252197 717515564 718312378
2295.2 718312378 718222580 718254089 718062134 718185043 718263855 717414093 717341919 717548218 717782898 717870941
2304.9 717870941 718912048 719999313 720481873 721161346 721124039 721327667 721320572 721381378 721264267 720633469
2314.5 720633469 720632782 721104660 722684631 724408417 725397415 725914764 726297989 725994644 725424652 725696640
2324.2 725696640 725700836 725981674 726648636 727517853 728246765 728564911 729142151 729230270 729385223 729816360
2333.8 729816360 729108963 728161316 727825317 727264328 727576828 728638763 729029388 729483109 729874496
2342.5 729874496 729188385 728156204 726835022 724795074 722303543 719162827 719435577 723368530 726009216
2351.2 726009216 727334442 728349686 730377350 732400513 733344345 735590134 734975739 733042374 731810532
2359.8G31810532J925888J25808j569519J025391j265945o31485k128067k313538j833115
2368.5G25145950j647186o97708k017212p59125j642380j661529r88236j152267p67670
2377.2G13812637j493225j231003j363601j368485j609878j167069p70721j025086
2384.9G03783569J40152J11008j6174j43051j43052k67334q39004m30756p11517m28925
2394.6G01054916m09164Q3771N02929j97143J42975J97143J91574n38559n65948m95987
2404.2F99966507r40170k86179k77862p1412J14212M73328J18790l05252n0431o83899
2413.8F98057632n27267n25665o18515o67115n22918Q1329K43912N3711k64054J12076
2423.5F95423126l67737n41915m87900o18744k93274q47015o08368j02234L28750L64075
$$ plain form
2359.8 731810532 733736420 733862228 732292709 733318100 732052155 731420670 729292603 726979065 725145950
2368.5 725145950 723498764 722801056 720783844 720024719 718382339 716720810 715732574 714580307 713812637
2377.2 713812637 712319412 711088409 709724808 708356323 706746445 705579376 704808655 703783569
2384.9 703783569 703923721 704034729 704018555 703875504 703732452 703465118 702626114 702195358 701483841 701054916
2394.6 701054916 700645752 700729523 701232452 701035309 701178284 701375427 701567001 701028442 700462494 699966507
2404.2 699966507 699026337 698740158 698462296 698390884 698505096 698978424 699097214 698791962 698741531 698057632
2413.8 698057632 697530365 697004700 696386185 695719070 695196152 695277481 695521393 695575104 695311050 695423126
2423.5 695423126 695055389 694513474 694025574 693406830 693113556 692266541 691658173 691555939 691884689 692248764
2433.1F92248764K53143j04446p21588j01471m63410p58056q33512o55136k20794n25666
2442.8F88117828K09580L97644j30234m58526o7750m4631p39823r79614q99277J03760
2452.4F85508957k62070n96695o3019l280L69491L8453l33558m86373p05643r92203
2462.1F82474060n11856l12881o76194k11105M3793K30865k87857m07944n28335p10831
2471.7F79101715l13415o01807l81622n35584j64719j80435n54123j12609k33994K0905
2481.3F76044312m92173m87365p49207q98361j50528p48673n06668j91040Q2474q2932
2491F71819839l80249j37100m38003k73743o95648p83692q36639p70416k18354j93939
2500.6F67092056j45340l35464j22299m83628n34439m49295q05816n10254n52445p57904
$$ plain form
2433.1 692248764 692501907 692397461 691675873 691574402 691110992 690352936 689519424 688864288 688643494 688117828
2442.8 688117828 688327408 688725052 688594818 688136292 688068542 688023911 687284088 686304474 685405197 685508957
2452.4 685508957 685246887 684650192 684587173 684583893 684953384 684991837 684658279 684171906 683466263 682474060
2462.1 682474060 681962204 681649323 680973129 680762024 680805817 681036682 680748825 680340881 679812546 679101715
2471.7 679101715 678788300 678186493 677804871 677269287 677104568 676924133 676370010 676257401 676023407 676044312
2481.3 676044312 675552139 675064774 674315567 673417206 673266678 672518005 672011337 671820297 671902771 671819839
2491 671819839 671439590 671302490 670864487 670590744 669895096 669111404 668274765 667504349 667285995 667092056
2500.6 667092056 666946716 666611252 666488953 666005325 665470886 665021591 664215775 663705521 663153076 662395172
2510.3F62395172q23517K36206K51770l58963p9651m79507l63541n24978p34940q20770
2519.9F58697281n71213j62277m82254l06702Q7280J60447n59693k56271Q7051o20269
2529.6F56073380q90351j187744p33643l27453j84250l24020k8000K64358l53699l56063
2539.2F51952515n78766m19998n42450o11954l20740p61490o42547k49024P1793j17951
2548.9F47779388R8038l67203r50317m49753n73501m36478p17545m84008k91748j90735
2558.5F43416138J85013k33689N7907l15551n84794r71298q34656j66549o35262m09660
2568.1F39507599n01480k6055R8229j67580k16636p86820n37681p25785k72941l49541
2577.8F36021309n50079k26441o80694j30501n837q6288j24855j95084m38309q73947
$$ plain form
2510.3 662395172 661571655 661807861 662059631 661700668 661621017 661141510 660777969 660252991 659518051 658697281
2519.9 658697281 658126068 657963791 657481537 657174835 657262115 657422562 656862869 656606598 656693649 656073380
2529.6 656073380 655183029 653995285 653261642 652934189 652749939 652425919 652397919 652662277 652308578 651952515
2539.2 651952515 651373749 650953751 650411301 649799347 649478607 648717117 648074570 647825546 647897339 647779388
2548.9 647779388 647877426 647510223 646559906 646110153 645536652 645100174 644382629 643898621 643606873 643416138
2558.5 643416138 643601151 643367462 643425369 643109818 642525024 641553726 640719070 640552521 639917259 639507599
2568.1 639507599 639006119 638980064 639078293 638910713 638694077 637907257 637369576 636643791 636370850 636021309
2577.8 636021309 635471230 635244789 634564095 634433594 634427757 634341469 634216614 634021530 633583221 632709274
2587.4F32709274o17370m79393l81050p71904m08707j47324k69394R8153j4916j09749
2597.1F29607620o24923n54390q04444j037941p25441o77681m1847q3885L3073j84631
2606.7F24905510l46832j55411p97463q65173p65457o70433p51915m53110k75841l90052
2616.4F19433823o6567p5493j74942n76324o73104r86137q28628l41645n82580o27213
2626F14501190o27785k632k39639l57933j78261n65643m90341j140747p79457l78266
2635.6F09740486o61659n25627m84810n09911o55746J05667O7291m76112m90189o69174
2645.3F05440216p21970p02362n45921p05414l04870k72065l84292l1700k0867j3847
2654.9F01736908q61626r08584n80788r07898o15120j51443r9755l65791j97334j38283
$$ plain form
2587.4 632709274 632091904 631612511 631231461 630459557 630050850 629903526 629634132 629732285 629717369 629607620
2597.1 629607620 628982697 628428307 627623863 626585922 625860481 625182800 625140953 625057068 625090141 624905510
2606.7 624905510 624558678 624403267 623605804 622740631 621975174 621304741 620552826 620099716 619823875 619433823
2616.4 619433823 619367256 619291763 619116821 618540497 617867393 616881256 616052628 615710983 615128403 614501190
2626 614501190 613873405 613870773 613631134 613273201 613094940 612529297 612038956 610898209 610118752 609740486
2635.6 609740486 609078827 608553200 608068390 607558479 606902733 607008400 607075691 606599579 606109390 605440216
2645.3 605440216 604718246 604015884 603469963 602764549 602459679 602187614 601803322 601771622 601750755 601736908
2654.9 601736908 600875282 599966698 599385910 598478012 597862892 597711449 597611694 597245903 597048569 596910286
2664.6E96910286k67487m33311l71170k29073n00869r10874r71756p1602j26915n16357
2674.2E92510872k03247K29759J30234o07338m73404p80029n25246m92439r65615l00254
2683.9E88523293l46680R575j04599l51944j07079m71649n54199p35245n66482n26810
2693.5E84768181l48396l99514l61099K28310k11754l29285j45645l14903o10771m14925
2703.1E81860199k90985o26412m64553o13594n58167j06316M01116q2932o71997j27525
2712.8E78718834l5210j78261p78884q84324l13148p0458k33001l76473P5226k28271
2722.4E75696030m94614r6474J15013n64231o86493j63269n13916k45781m71993l67164
2732.1E72207108K02026N2147j01700m13246j89476o85616m66804m7531l09258P2823
$$ plain form
2664.6 596910286 596642799 596209488 595838318 595609245 595108376 594197502 593225746 593154144 593027229 592510872
2674.2 592510872 592307625 592537384 592667618 592060280 591586876 590806847 590281601 589789162 588823547 588523293
2683.9 588523293 588176613 588186188 588081589 587729645 587622566 587150917 586596718 585861473 585294991 584768181
2693.5 584768181 584419785 584020271 583659172 583887482 583675728 583346443 583200798 582885895 582275124 581860199
2703.1 581860199 581569214 580942802 580478249 579864655 579306488 579200172 579601288 579518356 578846359 578718834
2712.8 578718834 578683624 578505363 577726479 576842155 576529007 576458549 576225548 575849075 575924301 575696030
2722.4 575696030 575201416 575104942 575219955 574655724 573969231 573805962 573292046 573046265 572574272 572207108
2732.1 572207108 572409134 572461281 572359581 571946335 571756859 571071243 570604439 570556908 570247650 570320473
2741.7E70320473k08359K0065m158j19247N0926k99110m29802n72777m77181o04133
2751.4E67676697n50652l60374K69050M68483j51901k4643j78909k73590m73099n08652
2761E65892410m39491o14166o31943n89981k6703l10364p3051J41220l64838k30636
2770.7E62752457k42386n2262n51872p36313o93893n85098j74294k59018J62659l83377
2780.3E59236603o97518m36630n82695n55382m46281P25m25415q74749q18824k66495
2789.9E54133339J23634r9983l83186j054535q07495o46515n49469m26026q55827q63647
2799.6E48570290o85273m3792k1401m65507o98929n87731o93664j243858q42286n26504
2809.2E42761345l77846q27865j307183o48460k72255n32189p93037o18286q20770
$$ plain form
2741.7 570320473 570112114 570132179 570128021 570008774 570059700 569760590 569330788 568758011 568280830 567676697
2751.4 567676697 567126045 566765671 567034721 567503204 567351303 567326660 567147751 566874161 566401062 565892410
2761 565892410 565452919 564838753 564206810 563616829 563590126 563279762 563206711 563347931 562983093 562752457
2770.7 562752457 562510071 562457809 561905937 561169624 560475731 559890633 559716339 559457321 559619980 559236603
2780.3 559236603 558539085 558102455 557519760 556964378 556518097 556518822 556093407 555218658 554399834 554133339
2789.9 554133339 554256973 554156990 553773804 552719269 551911774 551265259 550715790 550289764 549433937 548570290
2799.6 548570290 547885017 547841225 547819824 547354317 546655388 546067657 545373993 544130135 543287849 542761345
2809.2 542761345 542383499 541555634 540248451 539599991 539327736 538795547 538002510 537384224 536563454
2817.9E36563454o60439n33905r89151r64012j026421q41598n98679l72047o82755
2826.6E29894447j263847j031113q43696r59893q90083o86722j122589j242714j194191
2835.3E20659599j004333q20961j371918r45320j152000j895218j917992j782150j622467
2843.9E08147240j836624j681214k144699k447319k024651j734123j725082j789742
2851.7D92763786j211738j062393m52157j34162m77715l28522j81274L79181J45263
2860.3D89440269n22117o91757k86255l13759j044960r44977q75130r78317r30481
2869D82852516l49808j27792o33240p29370p95707p77970r17854p43981q10394r80263
2878.7D75986137p08580o60858m34074o41518o70967o96411r27315q89664j214675
$$ plain form
2817.9 536563454 535903015 535369110 534379959 533415947 532389526 531547928 530949249 530577202 529894447
2826.6 529894447 528630600 527599487 526755791 525795898 524905815 524219093 523096504 521853790 520659599
2835.3 520659599 519655266 518834305 517462387 516517067 515365067 513469849 511551857 509769707 508147240
2843.9 508147240 506310616 504629402 502484703 500037384 498012733 496278610 494553528 492763786
2851.7 492763786 491552048 490489655 490037498 489903336 489425621 489097099 488915825 489295006 489440269
2860.3 489440269 488918152 488226395 487940140 487626381 486581421 485636444 484761314 483782997 482852516
2869 482852516 482502708 482374916 481741676 481012306 480216599 479438629 478520775 477776794 476966400 475986137
2878.7 475986137 475277557 474616699 474182625 473541107 472870140 472173729 471246414 470356750 469142075
2887.3D69142075j361962r97772n00832p67250j156616j230316r45740m80385m85382
2896D61215820q02765j389389r38339q08182j317024r38949k21177m1084r23233r31663
2905.7D52904015o34537o97899p72705p78160p86438j592407j285325j153907j319695
2914.3D43882942j163444j392136j192131j657066j659813j143379p11251p17354p62176
2923D33484192n41344r45129k81639o0425J89018P86133L00293P6256Q4953K62909
2932.7D33355217j73416J85127R76296N60684L02124M11644N76057O45104J010627
2941.3D37849464O49682K97508N15136O40793J080551M75502O180M34876Q76312Q75092
2951D43701096M48951K47078L74451M80461j09062J74942N81474N41840N40924L53203
$$ plain form
2887.3 469142075 467780113 466782341 466281509 465514259 464357643 463127327 462181587 461701202 461215820
2896 461215820 460413055 459023666 458085327 457277145 455960121 455021172 454799995 454758911 453835678 452904015
2905.7 452904015 452269478 451571579 450798874 450020714 449234276 447641869 446356544 445202637 443882942
2914.3 443882942 442719498 441327362 440135231 438478165 436818352 435674973 434963722 434246368 433484192
2923 433484192 432942848 431997719 431716080 431655655 431844673 432630806 432931099 433007355 433092308 433355217
2932.7 433355217 433181801 433366928 434343224 434903908 435206032 435617676 436193733 436838837 437849464
2941.3 437849464 438499146 438796654 439311790 439952583 441033134 441508636 441514816 441949692 442826004 443701096
2951 443701096 444150047 444397125 444771576 445252037 445142975 445317917 445899391 446441231 446982155 447335358
2960.6D47335358J041793J022339M77257L14827M21944O57425R70649P83196r728O29807
2970.3D53644867Q33321Q62159J032563M43687M66804K37465O36483R11827O69021
2979D59738197L97911j38931r7618k02599J71967M95567M41094K59971k61764j95732
2988.6D60608063K43339K98538r422l2501m46701l53394P3662j69334K2392J54877
2998.2D60389519N0964m94156q65898p92160m87366m60777p37953m24957p83463q32024
3007.9D54561729m53796j90659l53012n97992j47514p88765p52563q28896r95788l03307
3017.5D49149437n23834k87133o04743r25828p24716n78804m80919q73184o53686j062241
3027.2D42434349j173706o13594n57022o03638q69751n93223j68763m49714j103859
$$ plain form
2960.6 447335358 448377151 449399490 449876747 450191574 450613518 451270943 452241592 453024788 453015060 453644867
2970.3 453644867 454478188 455340347 456372910 456816597 457283401 457520866 458157349 459069176 459738197
2979 459738197 460136108 459997177 459899559 459696960 459868927 460364494 460805588 461065559 460803795 460608063
2988.6 460608063 460851402 461149940 461140518 461108017 460661316 460307922 460381584 460212250 460234642 460389519
2998.2 460389519 460440483 459946327 459080429 458288269 457800903 457340126 456602173 456177216 455393753 454561729
3007.9 454561729 454107933 453917274 453564262 452966270 452818756 452029991 451277428 450448532 449452744 449149437
3017.5 449149437 448625603 448338470 447733727 446807899 446083183 445504379 445023460 444150276 443496590 442434349
3027.2 442434349 441260643 440647049 440090027 439486389 438616638 438023415 437854652 437404938 436301079
3035.9D36301079j052284j206513j269417m72374m25338p76177j037559q27103o89583
3044.5D28544731r45816j041832p57027m89921r88617o84509m23813q27904j034050
3053.2D21351242j022720o80275o28281o41746r48143p61910p90977j170617m94117
3061.9D14212456l43781r05494j101380m29077k99988p21550q99620q77457n56488
3070.6D08077621r37423p99828n20744n17845o96259p16324k89535j007042p66602
3079.2D01826019o36940r71260n26199p83997p68051j009483p20329q2474m78020q76656
3088.9C94972610n60646l06854r50126q65975o73141o66924p47414r32197l33710n20782
3098.5C88414841j078873q68721l63655o75545o66351m67034r36012n40352q92257
$$ plain form
3035.9 436301079 435248795 434042282 432772865 432300491 431875153 431098976 430061417 429234314 428544731
3044.5 428544731 427598915 426557083 425800056 425310135 424321518 423637009 423213196 422385292 421351242
3053.2 421351242 420328522 419648247 419019966 418378220 417430077 416668167 415877190 414706573 414212456
3061.9 414212456 413868675 412963181 411861801 411432724 411132736 410411186 409511566 408634109 408077621
3070.6 408077621 407140198 406340370 405819626 405301781 404605522 403889198 403599663 402592621 401826019
3079.2 401826019 401189079 400217819 399691620 398907623 398139572 397130089 396409760 396327286 395849266 394972610
3088.9 394972610 394411964 394105110 393154984 392289009 391615868 390948944 390201530 389269333 388935623 388414841
3098.5 388414841 387335968 386467247 386103592 385428047 384761696 384294662 383358650 382818298 381926041
3107.2C81926041j140099o75239o13518n58243q90617m65813k59705o31408q52547
3115.9C75838852r93462q66546q79631o78749o69823o44150j078949j493378m51889
3124.6C68082275K51809l89138j155662j054573r02672j006737r31740l76053j42746
3133.3C62374763q77838q65974n16586m98314n34935r22470j347046j168709n54314
3141.9C55088577o37779j073189j170501p13425k26441n02204p47872m80766n45578
3150.6C48990822j020012p19147m26712p72133r35974r71260r27887m20303q4915r24302
3160.3C41788177j093597o65817r71184j144295r98077n99136o98739o90803n28488
3168.9C34398041m32205l00408q46634p22732n69763q58460j059494r25560o64787
$$ plain form
3107.2 381926041 380785942 380110703 379497185 378938942 378048325 377582512 377322807 376691399 375838852
3115.9 375838852 374845390 373978844 373099213 372420464 371750641 371106491 370027542 368534164 368082275
3124.6 368082275 368334084 367944946 366789284 365734711 364832039 363825302 362893562 362517509 362374763
3133.3 362374763 361496925 360630951 360114365 359616051 359081116 358158646 356811600 355642891 355088577
3141.9 355088577 354450798 353377609 352207108 351493683 351267242 350765038 350017166 349536400 348990822
3150.6 348990822 347970810 347251663 346824951 346052818 345116844 344145584 343217697 342797394 342712479 341788177
3160.3 341788177 340694580 340028763 339057579 337913284 336915207 336316071 335617332 334926529 334398041
3168.9 334398041 333965836 333665428 332818794 332096062 331526299 330667839 329608345 328682785 328017998
3177.6C28017998j098633o81381l90892n13192m13360m75350l23715r77134j132546
3186.3C22011795p43523n84259l87191j012783r04713m94156p91302n68695n68046
3195C15957127o54679m44889p32517r00860j015167o11115j77192r72481q79250l50361
3204.6C09218616l39851n30701q63895n06210p74212o88286k81544n15480l21922r88121
3214.3C03408394j182652n10940l57609q1329n58339j011810n51586p17220j129933
3222.9B97306976p97577k61020k86732o76403n31006l92208m26445k53334k58999l15399
3232.6B93107853r38950j241245q56895o39439l37734k52648l55835q45336p06940
3241.3B86932831j00250l10612m01631m95719l66803m91562j020088o56833j6785m2839
$$ plain form
3177.6 328017998 326919365 326237984 325847092 325333900 324920540 324445190 324121475 323144341 322011795
3186.3 322011795 321268272 320684013 320296822 319284039 318379326 317885170 317093868 316525173 315957127
3195 315957127 315302448 314857559 314125042 313224182 312209015 311597900 311420708 310448227 309568977 309218616
3204.6 309218616 308878765 308348064 307484169 306977959 306203747 305515461 305233917 304718437 304396515 303408394
3214.3 303408394 302225742 301714802 301357193 301275864 300717525 299705715 299154129 298436909 297306976
3222.9 297306976 296509399 296248379 295961647 295285244 294754238 294362030 293935585 293682251 293423252 293107853
3232.6 293107853 292168903 290927658 290070763 289431324 289093590 288840942 288485107 287639771 286932831
3241.3 286932831 286832581 286521969 286120338 285624619 285257816 284766254 283746166 283089333 283072548 283029709
3250.9B83029709n86758k13146J63422q70324j265144n36594k04983n26962o68335
3259.6B78320885l82519o7291k2316k98691m87080l25508m40502o15501n03254m95358
3269.2B74682865k14996m29821p17831l11756l74146k97279M7035O2294j86462m13075
3278.9B71846828k41317k69795p62157o58093k65178n76897m38023k08645j79519R7923
3288.5B68345127j44272m77218o45638j84326k78587q66738m52862j41677m3393k47783
3298.2B64862633k14634m34857p32784j02119l02887m63372k11238k74830k71721k02999
3307.8B61651192k24018l88947k12002n05943o94618n37682k60048J42174j38416m83380
3317.4B58348312j171856j010685j59358k25869o8378O5384k39620p23668r17320r71279
$$ plain form
3250.9 283029709 282442951 282229805 282393227 281522903 280257759 279721165 279516182 278989220 278320885
3259.6 278320885 277938366 277871075 277848759 277550068 277062988 276737480 276296978 275681477 275178223 274682865
3269.2 274682865 274467869 274038048 273320217 273008461 272634315 272337036 272384071 272446365 272259903 271846828
3278.9 271846828 271605511 271335716 270573559 269915466 269650288 269073391 268635368 268426723 268247204 268345127
3288.5 268345127 268200855 267723637 267077999 266893673 266615086 265748348 265295486 265153809 265110416 264862633
3298.2 264862633 264647999 264213142 263480358 263378239 263075352 262611980 262400742 262125912 261854191 261651192
3307.8 261651192 261427174 261038227 260826225 260320282 259625664 259087982 258827934 258970108 258831692 258348312
3317.4 258348312 257176456 256165771 256006413 255780544 255712166 255777550 255537930 254814262 253896942 252925663
3327.1B52925663r13448m89807l60280k44998l88489n19734m91733n63469m58870n37014
3336.7B47957821n38197o14547p43542o98967p18613m45461K30446K70233n13515q24833
3346.4B43360825n89638l37124o49242o42605j45169l69892k91309k71301j65673L56713
3356B40255585j3924m93641n39970l24555p9822k38953o10218m73289k06242n5771
3365.7B37219200M79202N9643o16302k55223J25962k33460p94277k91824Q0166k04277
3375.3B35568810l44220k85816L09639J05133o35109n02949R003L01323j84441k77881
3384.9B34063492L18031J00613k51923k13718m7150o3038l34072l4580L37295K08760
3394.6B34083710J54800j60122n16510p3604J02348J4496J35860l82385n5523M53262
$$ plain form
3327.1 252925663 252012215 251522408 251162128 250917130 250528641 250008907 249517174 248953705 248494835 247957821
3336.7 247957821 247419624 246805077 246061535 245362568 244643955 244198494 244428940 244699173 244185658 243360825
3346.4 243360825 242771187 242434063 241784821 241142216 240997047 240627155 240335846 240064545 239898872 240255585
3356 240255585 240241661 239748020 239208050 238883495 238803673 238564720 237954502 237481213 237274971 237219200
3365.7 237219200 237698402 237758045 237141743 236886520 237012482 236779022 235984745 235692921 235773087 235568810
3375.3 235568810 235224590 234938774 235248413 235353546 234718437 234215488 234224491 234525814 234341373 234063492
3384.9 234063492 234381523 234482136 234230213 234016495 233969345 233906307 233572235 233537655 233874950 234083710
3394.6 234083710 234238510 234078388 233561878 233488274 233590622 233605118 233740978 233358593 233303070 233756332
3404.2B33756332m3125Q0834J46026M6902l3627j63745O6776L59669L33519k36893
3413.9B34312668k68727j73873K81486P03659K01874M18129M9400m23965k7161L24497
3423.5B35397987Q15926J17435o6795O92940K31132k34642j0299O7711L40957O71044
3433.2B38023396M55284K29034K53983O90059N37892r022M16107N04818J74027K3746
3442.8B41299324J41411K62470Q16689J207008j1330M4785O97899M63066L54900M71173
3452.5B45747395J050014Q08907K22740K98614M54731M79260O88591R23958P93285
3461.1B51467495M92668j32103K42558P25765O36082O71939M96502Q49820L58772J18770
3470.8B55928268Q44136J037483J255703R86614O33602L75920N85174P24011M51221
$$ plain form
3404.2 233756332 233713207 233794041 233940067 233986969 233953342 233789597 233856373 234216042 234549561 234312668
3413.9 234312668 234043941 233870068 234151554 234855213 235057087 235475216 235524616 235100651 235073490 235397987
3423.5 235397987 236213913 236331348 236264553 236957493 237188625 236953983 236943684 237011395 237352352 238023396
3433.2 238023396 238478680 238707714 238961697 239651756 240189648 240180626 240596733 241101551 241275578 241299324
3442.8 241299324 241440735 241703205 242519894 243726902 243715572 243760357 244458256 244921322 245276222 245747395
3452.5 245747395 246797409 247606316 247829056 248127670 248582401 249061661 249750252 250674210 251467495
3461.1 251467495 251960163 251828060 252070618 252796383 253432465 254104404 254600906 255450726 255809498 255928268
3470.8 255928268 256772404 257809887 259065590 260052204 260685806 261061726 261646900 262370911 262822132
3479.5B62822132P68013R27906P49836J1635N24578J464615J117439J068688P35855
3488.1B70190697K77862L30773N33065R98230J243763Q54893P87182J292877O38581
3496.8B77147923J43566O80408J068077Q10433J025810J548252L62854J93939J030140
3505.5B84011402R82590R99126J338406O69556q8482J294059J592331J144638Q54741
3514.2B92798367N44071R24568J112499J123219Q95710J345863J117172R89571J157284
3522.9C02008324M50210J317806J015301P22790Q95767P35722J201458J079330J164894
3531.5C10591602O22616J136017J661491J703244J452407R9125J156025J518441R64565
3540.2C20905533R61494J424370K022896K136307J889572P70340J171036K92549R87663
$$ plain form
3479.5 262822132 263590145 264518051 265267887 265279522 265804100 267268715 268386154 269454842 270190697
3488.1 270190697 270468559 270799332 271332397 272330627 273574390 274429283 275216465 276509342 277147923
3496.8 277147923 277291489 277971897 279039974 279850407 280876217 282424469 282787323 282981262 284011402
3505.5 284011402 284993992 285993118 287331524 288001080 287912598 289206657 290798988 291943626 292798367
3514.2 292798367 293342438 294267006 295379505 296502724 297398434 298744297 299861469 300851040 302008324
3522.9 302008324 302458534 303776340 304791641 305514431 306410198 307145920 308347378 309426708 310591602
3531.5 310591602 311214218 312350235 314011726 315714970 317167377 317266502 318422527 319940968 320905533
3540.2 320905533 321867027 323291397 325314293 327450600 329340172 330110512 331281548 331574097 332561760
3548.9C32561760K007217J802521K323151k06642R15184K437553J851158J829453J023941
3557.6C46545296J880035J845398J534538O50826J964302K224579Q68911M549637K788506
3566.2C64852028J61590J564m66346K916298J499595J739769K135849J923867J492919
3574.9C76257133J614647K779999J065178K902794K746963J046181K015763K304840
3582.6C92733498J949005M25949M194984M100533n31235J201325n77507K548828L324966
3591.3D09370346L659859K983475J204109L058090m45595K337685M600982J484299
3599D28253250K762070J659431J129189K610435K593880K190132L143120L731804L03459
3607.7D48376770L790932P53441r50013P999154L630828j467323M084282k7580L718948
$$ plain form
3548.9 332561760 334568977 336371498 338694649 338488007 339403191 341840744 343691902 345521355 346545296
3557.6 346545296 348425331 350270729 351805267 352456093 354420395 356644974 357513885 362063522 364852028
3566.2 364852028 365013618 365015182 364548836 367465134 368964729 370704498 372840347 374764214 376257133
3574.9 376257133 377871780 380651779 381716957 384619751 387366714 388412895 390428658 392733498
3582.6 392733498 394682503 395108452 399303436 403403969 402872734 404074059 403496552 406045380 409370346
3591.3 409370346 413030205 416013680 417217789 420275879 419830284 422167969 426768951 428253250
3599 428253250 431015320 432674751 433803940 436414375 439008255 441198387 444341507 448073311 448376770
3607.7 448376770 452167702 452921143 451971130 459970284 463601112 462133789 466218071 466190491 469909439
3616.4D69909439N456696K066650L216705j64451M85191L373795L426551L284340L543549
3625.1D94598465K931519L490028Q843002M659386r453354J470413L628197O320610
3632.8E16488266L792038r66034K395973M506645M120408J090164J644211L050308
3640.5E36121979L178444K326431J279907K997513M344101P476501K380829k328033
3648.2E57777672P910576K721328m501648l551368M446792N644150N750427P708931
3655.9E83906860o609954k5101O216965K909469K299538N68962J745567J363564K151565
3664.6E94527435K736321J658706N564805M079399J546783K571983p573204M37432
3672.3F05549660Q776855J2382012O418380k3070602k180939Q608208N854645j793633
$$ plain form
3616.4 469909439 475366135 477432785 480649490 480485039 480970230 484344025 487770576 491054916 494598465
3625.1 494598465 497529984 501020012 509863014 514522400 505069046 506539459 510167656 516488266
3632.8 516488266 520280304 519314270 521710243 526216888 530337296 531427460 533071671 536121979
3640.5 536121979 539300423 541626854 542906761 545904274 550248375 557724876 560105705 557777672
3648.2 557777672 565688248 568409576 563907928 560356560 564803352 570447502 576197929 583906860
3655.9 583906860 577296906 577271805 583488770 586398239 588697777 589266739 591012306 592375870 594527435
3664.6 594527435 597263756 598922462 604487267 608566666 610113449 612685432 605112228 605549660
3672.3 605549660 614326515 626708527 633126907 610056305 607875366 616483574 622338219 620544586
3680F20544586j27983K694855K226181J937523J162758J033210M346848Q331070p480774
3688.7F34668274n583115J0276375m998970k762718N482788J103172J807175O69022
3696.4F40662003j56327J228867M17862K746734L906479l706054l624878M283142K274856
3705.1F48032684j40457K29035L460769O161881p498932K612762P325745j4694519
3712.8F45488968J420135M109879M49600J029358K802506K234268l133087N92041O539840
3721.5F61533508j952133n856705M506531K100144N74417k274857j272735L402175
3729.2F60760345R22699O815033q66699j0582428Q690720M014740q083649j815872
3736.9F59854889Q19168l76587K259369M118423l795852K546005J4495926m848175
$$ plain form
3680 620544586 620416603 623111458 625337639 627275162 628437920 629471130 633817978 642149048 634668274
3688.7 634668274 629085159 639361534 634362564 631599846 637082634 638185806 639992981 640662003
3696.4 640662003 640505676 641734543 642152405 644899139 648805618 645099564 641474686 645757828 648032684
3705.1 648032684 647892227 648121262 651582031 657743912 650244980 652857742 660183487 645488968
3712.8 645488968 646909103 651018982 651468582 652497940 655300446 657534714 654401627 654993668 661533508
3721.5 661533508 659581375 653724670 658231201 660331345 660905762 658630905 657358170 660760345
3729.2 660760345 661683044 668498077 667631378 657048950 665739670 669754410 661670761 659854889
3736.9 659854889 660674057 660297470 662556839 666675262 662879410 665425415 679921341 675073166
3744.7F75073166k3630066Q567581O174698P134781k28653j1637192J1713028l930435
3752.4F69236908j1133804N159301M284592L621674n408173J460495O649475o734695
3760.1F67135773l223038L398437J500474L65142M479370j746978o325226L107605
3767.8F68691559O446533K336121j0794754m197M065934O71920J102524n19714K42233
3776.5F72238159q8348L322372J644364r099732J605377K667084Q50754L065872k036056
3785.2F74169846j744233O42243L41034L14560o4087L93066O180N87387n47180J171341
3794.8F75270157M953232k896347n832444J406937N087738Q361740l942489j1966629
3802.5F70441895J912536J460266M726486Q162308q338165p600861L987427J724930
$$ plain form
3744.7 675073166 651443100 660010681 666185379 673320160 673091507 661454315 673167343 669236908
3752.4 669236908 658103104 663262405 667546997 671168671 665760498 667220993 673870468 667135773
3760.1 667135773 663912735 667311172 668811646 669176788 673656158 671909180 665583954 668691559
3767.8 668691559 675138092 677474213 666679459 666675262 670741196 671413116 672515640 671995926 672238159
3776.5 672238159 672149811 675472183 677116547 668016815 669622192 672289276 673140030 676205902 674169846
3785.2 674169846 672425613 673067856 673408890 673723450 673659363 674052429 674058609 674645996 674098816 675270157
3794.8 675270157 680223389 677327042 671494598 672901535 677989273 686351013 682408524 670441895
3802.5 670441895 672354431 673814697 678541183 686703491 678365326 670764465 674751892 676476822
3810.2F76476822j64108m2191j22528K159958P336731J641083j6652146K380524O714401
3818.9F79728546O571045N913925j7839966k960739M487000J679077L396378J319351
3826.6F82294617n674057j127014J797943L247680L400727q665924O22940P934646
3834.3F83831558n261078n44433J1107483o286316q220825P842102n627366k536087
3842.1F74305038Q821640p92388o293030J751938J277694k43606K087097o46133K127532
3850.7F82395782P772446k100754L944245j8566971m813232J1337738K89154l454514
3858.4F76803894Q09250K351608M015503m793777r56879Q309860m137192q679122L107223
3867.1F76830368N300293Q064270l223724j3263855P52868O554337O841888j0345764
$$ plain form
3810.2 676476822 676312714 676270523 676147995 678307953 685644684 687285767 670633621 673014145 679728546
3818.9 679728546 686299591 692213516 674373550 671412811 675899811 677578888 680975266 682294617
3826.6 682294617 676620560 675493546 677291489 680539169 683939896 675273972 675896912 683831558
3834.3 683831558 678570480 678026047 689133530 682847214 674626389 682468491 676841125 674305038
3842.1 674305038 683126678 682334290 676041260 677793198 679070892 678827286 680914383 680268250 682395782
3850.7 682395782 690168228 688067474 692011719 673444748 668631516 679969254 680258408 676803894
3858.4 676803894 677613144 679964752 683980255 679186478 678229599 686539459 682402267 673723145 676830368
3867.1 676830368 682130661 690194931 686971207 673707352 674460220 681014557 687856445 677510681
3874.8F77510681k759476L774186j71891L277817P054291l812866j0586014M367447
3882.6F78654175J932754K119370P155914j4192428j280365M820022R24225N154495
3890.3F85288162J200485q545532p08694K750625k046051K40555J696167L843537M132385
3898.9F87851639j1051407L946609M073487o586304M241180k782440k491531k49252
3906.7F76951981p1869K205352j79977M98200j54877k00577q7204o96411J917267L382568
3916.3F83564453k387924n051117L588791P53326m673080J991501K412567J895676
3924F82094193j152573m104080J086578J620102J234741o40716j399002K444839j452408
3932.7F79731674l107071N94940M18396Q17261Q22220j15738o31561p90711J541672
$$ plain form
3874.8 677510681 674751205 678525391 678353500 681631317 688685608 684872742 674286728 678654175
3882.6 678654175 680586929 682706299 689862213 675669785 674389420 679209442 680133667 685288162
3890.3 685288162 686488647 677943115 677234421 679985046 677938995 678179550 679875717 683719254 687851639
3898.9 687851639 676800232 680746841 684820328 678234024 682475204 679692764 677201233 676951981
3906.7 676951981 676880112 679085464 678905487 679403687 679248810 679048233 678961029 678264618 680181885 683564453
3916.3 683564453 681176529 676125412 679714203 680467529 675794449 677785950 680198517 682094193
3924 682094193 680941620 676837540 677924118 679544220 680778961 680138245 678739243 681184082 679731674
3932.7 679731674 676624603 677219543 677637939 678455200 679277420 679161682 678530121 677739410 679281082
3941.4F79281082K329559k966842k345047M50897J344528K517777j593781l17230P78961
3950.1F79479904k476806J178741O43311m39835M80423N1269J43509q09936L68500
3958.7F78619080k3652K97089M85230j658707O2332L75061o53763k27737Q47015J009064
3968.4F79131012r16290p55692N34058m43344n06363M53949K17819J80359n48706J52435
3978F77499237O79245j11160M08935k40783Q926j80130n19409L57132l46985m30451
3987.7F77124557L663P16171o5994p35627Q2169K93350P74002k21634m54559K37198
3997.3F77753296N63888O49186o1493
4000.2F78904877
$$ plain form
3941.4 679281082 681610641 678643799 676298752 676749649 678094177 680611954 679018173 678700943 679479904
3950.1 679479904 677003098 678181839 678825150 678385315 678865738 678917007 679060516 678250580 678619080
3958.7 678619080 678595428 678892517 679377747 677719040 677781372 678156433 677502670 677274933 678121948 679131012
3968.4 679131012 678214722 677459030 677993088 677549744 677043381 677497330 677715149 677895508 677346802 677499237
3978 677499237 678178482 678067322 678476257 678235474 678244400 678064270 677544861 677901993 677555008 677124557
3987.7 677124557 677128220 677844391 677778397 677042770 677124939 677418289 678192291 677970657 677516098 677753296
3997.3 677753296 678317184 678966370 678904877
4000.2 678904877
##END=$$ End of the data block
