##TITLE=$$ Begin of the data block
##JCAMP-DX=5.00 $$ ACD/SpecManager v 10.08
##SPECTROMETER/DATA SYSTEM=Varian
##DATE=14 Jan 2013 10:21:30
##DATA TYPE=INFRARED SPECTRUM
##DATA CLASS=XYDATA
##ORIGIN=
##OWNER=
##NPOINTS=3735
##FIRSTX=399.26403809
##LASTX=4000.35498047
##MAXX=4000.35498047
##MINX=399.26403809
##MAXY=72.83386993
##MINY=19.48484421
##XFACTOR=1.0000000000
##YFACTOR=0.000000100000000
##FIRSTY=37.90470123
##DELTAX=0.96440572
##XUNITS=1/CM
##YUNITS=TRANSMITTANCE
##XYDATA=(X++(Y..Y))
399.3C79047012J153412J1658402K383117k87704M493370L433j265068l439102M402580
$$ 379047012 380200424 391858826 394241943 393954239 398447609 398451042 397185974 393746872 398149452
407.9C98149452K571984n433617Q63342l094940j858978N587425J582184l360748J184043
$$ 398149452 400721436 395287819 396151161 393056221 391197243 396784668 398366852 395006104 396190147
416.6C96190147N607224M156380j2818375p671509N504875L813362J11008m50477J124916
$$ 396190147 401797371 405953751 393135376 385463867 390968742 394782104 394893112 394442635 395567551
425.3C95567551n510750o562309L523368K261162L4867l240509J56326O596603l56712
$$ 395567551 390056801 383494492 387017860 389279022 389313889 386073380 386229706 392826309 392469597
434C92469597k570877L768959N484352l303146j794968P94449m004669n157013n66635
$$ 392469597 389898720 393667679 399152031 395848885 394053917 394848366 390843697 385686684 385120049
442.7C85120049Q442039K052536j852608l629989n247231M904747J558228m96064K922593
$$ 385120049 393562088 395614624 393762016 390132027 384884796 389789543 391347771 390851707 393774300
451.3C93774300J507187q29392l599281k068405j964646l407554o86570N778008M253502
$$ 393774300 395281487 394452095 390852814 388784409 386819763 383412209 382725639 388503647 392757149
460C92757149M78744l860893l872566k127457l16963K303047k171745j551171K83852
$$ 392757149 393235893 389375000 385502434 383374977 383058014 385361061 383189316 381638145 381921997
468.7C81921997m89387J410980p35970K075997J541023p00417r86252l637008j824989
$$ 381921997 381432610 382843590 382107620 384183617 385724640 385024223 384037971 380400963 378575974
477.4C78575974l1205j585312j90277K040100j415634j681289j944275K592544L151360
$$ 378575974 378544769 376959457 376769180 378809280 377393646 375712357 373768082 376360626 379511986
486.1C79511986l746948o11878m45747l77541j09749j573639p55539m28810K736550
$$ 379511986 375765038 375153160 374707413 374329872 374220123 372646484 371890945 371462135 374198685
494.7C74198685P51762K70157j453285j128884J256180k018471q32862j556740J409797
$$ 374198685 374950447 375220604 373767319 372638435 373894615 371876144 371043282 369486542 370896339
503.4C70896339L447342L97072k277565l546257j564140j236382J194344K20642k19269
$$ 370896339 374343681 374740753 372463188 368916931 367352791 366116409 367310753 367531395 367312126
512.1C67312126r45968k276230L68919l98521O10847J12839J51443k661323l878365
$$ 367312126 366366158 364089928 364458847 364060326 364671173 364784012 364935455 362274132 358395767
520.8C58395767J134148k8877N89294J048737M28581k42844j644859l21007O42128
$$ 358395767 359529915 359501038 360090332 361139069 361567650 361324806 359679947 359358940 360001068
529.5C60001068p5035j921844o07148o03370K40860R35554n85060L9673q02956k50511
$$ 360001068 359926033 358004189 357397041 356793671 357034531 357970085 357385025 357424698 356621742 356371231
539.1C56371231j488113j165657J767692J106415j025620j805801N51453p9651m4251
$$ 356371231 354883118 353717461 355485153 356591568 355565948 353760147 354311600 354231949 354187698
547.8C54187698p04193k130241r18694j020050K78855k38724J88331r31587k553901
$$ 354187698 353483505 351353264 350434570 349414520 349693375 349454651 349642982 348711395 346157494
556.5C46157494m57497K71606M51355l35197R64050J77689o59752L48053q84132l88184
$$ 346157494 345699997 345971603 346422958 346087761 347051811 347229500 346569748 346917801 346033669 345645485
566.1C45645485J81618J872215L14255j262970M96330o34384j252251J12419J577225
$$ 345645485 345827103 347699318 348013573 346750603 347246933 346612549 345360298 345472717 347049942
574.8C47049942l71819j281356O55861J531639r2659l034630j304169O53420K136612
$$ 347049942 346678123 345396767 346052628 347584267 347491608 344456978 343152809 343806229 345942841
583.5C45942841Q38890j628456o57387j76583J009751K65388J77269J134377o5308
$$ 345942841 346781731 345153275 344495888 344319305 345329056 345594444 345771713 346906090 346840782
592.1C46840782o22749r4109J316948J224098l45382n88265J376572Q29658q53843
$$ 346840782 346218033 346123924 347440872 348664970 348319588 347731323 349107895 349937553 349083710
600.8C49083710l58048q41064j82076M1580J02425k38380q45528K060j028748j399879
$$ 349083710 348725662 347884598 347702522 347744102 347846527 347608147 346762619 346764679 345735931 344336052
610.5C44336052r81751n69915k53296r8534K04315p68280l50113N19295M5738j80816
$$ 344336052 343354301 342784386 342531090 342432556 342636871 341868591 341518478 342037773 342083511 341902695
620.1C41902695L7574j49917o409O27670R38149M44984N08156K900086L039970J067543
$$ 341902695 341940269 341790352 341783943 342411613 343349762 343794746 344302902 347202988 350242958 351310501
629.8C51310501M39415N70679J89094L07656J736717J869736K452392K230034Q23669
$$ 351310501 351749916 352320595 352509689 352817345 354554062 356423798 358876190 361106224 361929893
638.4C61929893J327973J635971P63588M08859J060219N34058O45103J355476Q85315
$$ 361929893 363257866 364893837 365657425 366066284 367126503 367660561 368305664 369661140 370546455
647.1C70546455J439133Q41980L76358R08775J089440O12373p43370J8234O60439M13437
$$ 370546455 371985588 372827568 373203926 374112701 375202141 375814514 375071144 375089378 375749817 376163254
656.8C76163254O88362J79405p01027r56421p0076Q126l04146M00238R25255l56751
$$ 376163254 376851616 377031021 376329994 375373573 375303497 375311623 375007477 375407715 376332970 375976219
666.4C75976219l394432m035263M961853L406334J179886N53665J142273R6664N82123
$$ 375976219 372581787 368546524 373508377 376914711 378094597 378648262 379790535 379887199 380469322
675.1C80469322J315308J325874J123428P93610J296845J844024J780358O08863M55704
$$ 380469322 381784630 383110504 384233932 385027542 386324387 388168411 389948769 390557632 391013336
683.8C91013336J667900J307144l73230P27768K240334N92613L62168J247596J576767
$$ 391013336 392681236 393988380 393615150 394342918 396583252 397175865 397538033 398785629 400362396
692.4D00362396J187477J35613N15327J110230M69589r956J096153N75485L30849J805115
$$ 400362396 401549873 401685486 402200813 403311043 403780632 403770676 404866829 405442314 405773163 407578278
702.1D07578278J128044Q54301K58446k74963N29823J136322J520004P43141J716118
$$ 407578278 408706322 409560623 409819069 409544106 410073929 411210251 412730255 413473396 415189514
710.8D15189514J852722L1052k57225L96385J369209N95780l70979n97306O97975K355385
$$ 415189514 417042236 417073288 416816063 417212448 418581657 419177437 418806458 418209152 418907127 421262512
720.4D21262512J232071N07240O91987J407165Q52585r2697P89413R51729P11098P72247
$$ 421262512 422494583 423001823 423693810 425100975 425953560 425860863 426650276 427602005 428313103 429085350
730.1D29085350J359940J131897N54275L43895L58887Q62541R7694N23606Q80966M71878
$$ 429085350 430445290 431577187 432131462 432475357 432834244 433696785 433794479 434318085 435199051 435670929
739.7D35670929J012192P3662m58527N78728J098327P43943O28585L12233N112N73921
$$ 435670929 436683121 436756783 436298256 436876984 437975311 438719254 439347839 439660072 439665184 440239105
749.3D40239105J166649J571655J176033L33100K83928P56302J87988R21707K175026
$$ 440239105 441405754 442977409 444153442 444486542 444770470 445526772 445714760 446636467 448811493
758D48811493J018066R92241R21021P75146J337586J026611J129951J162682R42383
$$ 448811493 449829559 450821800 451742821 452517967 453855553 454882164 456012115 457174797 458117180
766.7D58117180J05667l9558p439N63698J563644M83513k05650j54190K02255L3874
$$ 458117180 458222847 458183289 458175850 458739548 460303192 460786705 460581055 460426865 460629120 460662994
776.4D60662994K91863N72586o21910j064301r47227N52025J235962J151313O83594
$$ 460662994 460954857 461527443 460905533 459841232 458894005 459446030 460681992 461833305 462516899
785D62516899j71013J438027J221313k46696l66135J02081N20478M53910Q79250L92532
$$ 462516899 462345886 463783913 465005226 464758530 464392395 464494476 465014954 465468864 466348114 466740646
794.7D66740646p11631o22406P8735j157951j410141k85187m33045q10852j616249
$$ 466740646 466029015 465406609 465485344 464327393 462917252 462632065 462199020 461388168 459771919
803.4D59771919j315994j331520j054611j322937k561722j803436j578522j315689
$$ 459771919 458455925 457124405 456069794 454746857 452185135 450381699 448803177 447487488
811.1D47487488j496659j966590j809159j196060j56250q46291n33065M51202J64986
$$ 447487488 445990829 444024239 442215080 441019020 440862770 440016479 439483414 439934616 440099602
819.7D40099602q7548o82373k2964J687622K022362K422218L230133K493248K594338
$$ 440099602 440012054 439329681 439306717 440994339 443016701 445438919 448669052 451162300 453756638
828.4D53756638L688316L199997K877121L055115K393417J624908K414704K710190
$$ 453756638 457444954 460644951 463522072 466577187 468970604 470595512 473010216 475720406
836.1D75720406K553482K502021J906777K468872K057915J514816J069450J014443
$$ 475720406 478273888 480775909 482682686 485151558 487209473 488724289 489793739 490808182
843.9D90808182J537742K093811K240258N90400J978836K282525M94270M35943R58252
$$ 490808182 492345924 494439735 496679993 497270393 499249229 501531754 502026024 502461967 503420219
852.5E03420219J319428R24301K700539K229461J774102J891479J023789J635742N88150
$$ 503420219 504739647 505663948 508364487 510593948 512368050 514259529 515283318 516919060 517507210
861.2E17507210J350059J47324p74384L75595M95758J022530k03972m8332q09708n62019
$$ 517507210 518857269 519004593 518230209 518605804 519101562 520124092 519920120 519871788 519062080 518500061
870.9E18500061n30548k484436k729683j882324q8463j292954p90519O6032o18286
$$ 518500061 517969513 515485077 512755394 510873070 510784607 509491653 508701134 508767166 508148880
879.5E08148880m76799j460304j156197q73566p41043j929016j233978j54915j93825
$$ 508148880 507672081 506211777 505055580 504182014 503440971 501511955 500277977 500123062 499929237
888.2D99929237J148644k54059j32065N03311K03476m67186o72989K64473l49578Q14399
$$ 499929237 501077881 500823822 500691757 501195068 501398544 500931358 500258369 500522842 500173264 500987663
897.9E00987663M80919l45421m13017m09203J61171p72667J11428J389618K504768
$$ 500987663 501468582 501123161 500710144 500300941 500462112 499689445 499800873 501190491 503695259
906.5E03695259K266884J961098K706070K009086R71375m00009R9792m47464r58443
$$ 503695259 505962143 507923241 510629311 512638397 513609772 513209763 513309555 512862091 511903648
915.2E11903648j824607k936249j513367j896858j878586j826973k518120l644180
$$ 511903648 510079041 507142792 505629425 503732567 501853981 500027008 497508888 493864708
922.9D93864708l506050l108368l618469k567520l009606k398186k789306l554116
$$ 493864708 490358658 487250290 483631821 481064301 478054695 475656509 472867203 469313087
930.7D69313087k703247k598648j466942k097549k113228j021614o69632j341781k071648
$$ 469313087 466609840 464011192 462544250 460446701 458333473 457311859 456642227 455300446 453228798
939.3D53228798q95729q42934j095466j707344j199189k54287q20351j053505r84230
$$ 453228798 452333069 451490135 450394669 448687325 447488136 447233849 446413498 445359993 444375763
948D44375763L2158n43442n25856L55110m9133m64211j820144j669388j402130k099266
$$ 444375763 444407921 443864479 443338623 443693733 443644600 443180389 441360245 439690857 438288727 436189461
957.7D36189461k259712k013474k255211k953682k230873j588859j575470j743927
$$ 436189461 433929749 431916275 429661064 426707382 424476509 422887650 421312180 419568253
965.4D19568253k046586k476501k583580k445221k480926j847039k103042l009148
$$ 419568253 417521667 415045166 412461586 410016365 407535439 405688400 403585358 400576210
973.1D00576210l237343l019180l139649l583068l704873m131736m561119m856797
$$ 400576210 397338867 394319687 391180038 387596970 383892097 379760361 375199242 370342445
980.8C70342445n328712n132446m486466n188408n197983m855728n154152m685249
$$ 370342445 365013733 359881287 355394821 350206413 345008430 340152702 334998550 330313301
988.5C30313301m206352l945809m418087l435077k643013l106556l205795l277970
$$ 330313301 326106949 322161140 317743053 314307976 311664963 308558407 305352612 302074642
996.2C02074642k775478l039627l380795l531265k483788j806411k765541l021756
$$ 302074642 299299164 296259537 292878742 289347477 286863689 285057278 282291737 279269981
1004B79269981k259216j384659k315178j936588j281605j757221k145233j855316j093426
$$ 279269981 277010765 275626106 273310928 271374340 270092735 268335514 266190281 264334965 263241539
1012.6B63241539j975212j339626j877976k862091k428474k255440j236134j669960
$$ 263241539 261266327 259926701 258048725 255186634 252758160 250502720 249266586 247596626
1020.3B47596626k364025k174892m62609j508770k935562j770763j847534r10359j247406
$$ 247596626 245232601 243057709 242595100 241086330 238150768 236380005 234532471 233622112 232374706
1029B32374706p65266q23136j393966r79519j062298M16031o0978O96831J081219J109943
$$ 232374706 231609440 230786304 229392338 228412819 227350521 227766552 227705574 228402405 229483624 230593567
1038.7B30593567J649990J264629K078877P37076L77998O41499N57861l01495q34217
$$ 230593567 232243557 233508186 235587063 236324139 236702137 237343636 237901497 237600002 236765785
1047.4B36765785J12610q36925j023026j428642n62859j04408r73492j031284o18839
$$ 236765785 236878395 236041470 235018444 233589802 233026943 232922535 231949043 230917759 230298920
1056B30298920m5948j457978L64762J001377O9294J147747J870823K270832J623859
$$ 230298920 230252972 228794994 229159756 230161133 230230427 231378174 233248997 235519829 237143688
1064.7B37143688K243996J387863J270161P56225J41106J770573J980934J521148l49197
$$ 237143688 239387684 240775547 242045708 242801933 242943039 244713612 246694546 248215694 247866497
1073.4B47866497N21507N83153J28746J276779K60792L81947J14326J082974J487178
$$ 247866497 248388004 248971157 249099903 250376682 250637474 251019421 251133747 252216721 253703899
1082.1B53703899J711216J606522K86293J092243J244316J776791P92236P82185J677856
$$ 253703899 255415115 257021637 257307930 258400173 259644489 261421280 262213516 262995701 264673557
1090.7B64673557J594887K462578J591473R64698R32617J382676J010151J737518K258491
$$ 264673557 266268444 268731022 270322495 271287193 272219810 273602486 274612637 276350155 278608646
1099.4B78608646Q38223J012211R63573J981983J666489J604462J687603N00641J377258
$$ 278608646 279446869 280459080 281422653 283404636 285071125 286675587 288363190 288863831 290241089
1108.1B90241089N70679M20818R41162Q02937P58323P45964J219216J115989J283989
$$ 290241089 290811768 291232586 292173748 292976685 293735008 294480972 295700188 296816177 298100166
1116.8B98100166m54693o72073L95413m1962J56727n9014J64509L8243Q43162J707783
$$ 298100166 297645473 296973400 297368813 297326851 297483578 297424564 297589073 297627316 298470478 300178261
1126.4C00178261J072616J115456J733170J780452J571656K374630J732521J487732
$$ 300178261 301250877 302366333 304099503 305879955 307451611 309826241 311558762 313046494
1134.1C13046494K581081K560177J976318K007218K388114J809197J225853P76710
$$ 313046494 315627575 318187752 320164070 322171288 324559402 326368599 327594452 328371162
1141.9C28371162J163407J017875P71485J127777K00844Q09936J427880O66084p6103
$$ 328371162 329534569 330552444 331323929 332451706 332652550 333462486 334890366 335556450 335480347
1150.5C35480347k26288p7210p00264k33535K37083K42577l44391n68505J8158r89265
$$ 335480347 335254059 335176849 334476585 334243050 334480133 334722710 334378319 333809814 333827972 332838707
1160.2C32838707j023674k49786L66630P48634Q77953J198349J654625K918510K646370
$$ 332838707 331815033 331565247 331931877 332680511 333558464 334756813 336411438 339329948 341976318
1168.9C41976318K636032L331643L127632K732887K382240K382813K618370L217926
$$ 341976318 344612350 347943993 351071625 353804512 356186752 358569565 361187935 364405861
1176.6C64405861L440208L165627K911491K717591K484169K747306K327958J676673
$$ 364405861 367846069 371011696 373923187 376640778 379124947 381872253 384200211 385876884
1184.3C85876884J620636O18058L26271Q26454Q82149O19392K99377M03328l2806r02290
$$ 385876884 387497520 388115578 388441849 389268303 390150452 390769844 391069221 391472549 391439743 390537453
1193.9C90537453q09746j162109j683999r30671p34597j331024j596756r21669j044464
$$ 390537453 389727707 388565598 386881599 385950928 385216331 383885307 382288551 381366882 380322418
1202.6C80322418j243553p20215j654587k011108j119347k02636n31464r22546l0785
$$ 380322418 379078865 378358650 376704063 374692955 373573608 373370972 372839508 371916962 371886177
1211.3C71886177l3455j93291n10559m37545q1902q36983o68106m11758k63558J99509
$$ 371886177 371852722 371659431 371148872 370711327 370629425 369792442 369124336 368712578 368449020 368648529
1220.9C68648529J59264l62549j116142p16134o14509r34563p60193j007576j002426
$$ 368648529 368807793 368445244 367329102 366612968 365998459 365063896 364303703 363296127 362293701
1229.6C62293701j014061j058349n57442k08893m57344p30743o62041o91948k15416
$$ 362293701 361279640 360221291 359663849 359454956 358997612 358266869 357604828 356912880 356697464
1238.3C56697464m0398m25033l80898l31421J5717j27678o85387p01408k19536j83182
$$ 356697464 356657066 356232033 355851135 355519714 355535431 355407753 354722366 354020958 353801422 353618240
1247.9C53618240q11233n56564k88048l9406n2109k76031Q5640k26899l09486n35469
$$ 353618240 352807007 352250443 351962395 351922989 351870880 351594849 351680489 351453590 351144104 350608635
1257.6C50608635o49147p0191L09830M88053K7046K3880L92036O20499M96712O39648
$$ 350608635 349959488 349889297 350199127 350687180 350714226 350738106 351130142 351750641 352247353 352887001
1267.2C52887001P51343K59590O70166R52644R22737Q77457R92546J146965R26361
$$ 352887001 353638344 353897934 354568100 355520744 356443481 357320938 358313484 359460449 360386810
1275.9C60386810J148644J310348J239701J008339J103782J256142J176720J710128
$$ 360386810 361535454 362845802 364085503 365093842 366197624 367453766 368630486 370340614
1283.6C70340614J994973J552810J596871J591224J408959J621399J113701J220397
$$ 370340614 372335587 373888397 375485268 377076492 378485451 380106850 381220551 382440948
1291.3C82440948J080170P28226J002273O91529J013450J116486R66835R19342O97517
$$ 382440948 383521118 384249344 385251617 385943146 386956596 388073082 389039917 389959259 390656776
1300C90656776L31002K10724L73191O714J37062R3117J60484q5067l37982j38093n74111
$$ 390656776 390987778 391198502 391571693 391578407 391715469 391808586 391969070 391884003 391546021 391407928 390833817
1310.6C90833817n80140q71391p38220m91524p2403O06537J12114J51672N01023R27047
$$ 390833817 390253677 389382286 388644066 388152542 388080139 388686676 388798790 388950462 389451485 390378532
1320.3C90378532R39675N89676O38427J012688J170654L62397M79774K29530k37121
$$ 390378532 391318207 391907883 392546310 393558998 394729652 395092049 395571823 395801353 395564232
1328.9C95564232m9095k96593o47011q67424n22041l38745m8371n3978m7187J03035
$$ 395564232 395515137 395218544 394571533 393704109 393182068 392843323 392794952 392740974 392693787 392796822
1338.6C92796822k52114J64070N52750R17816L53508K92778J051216R48563R69429
$$ 392796822 392544708 392708778 393261528 394179344 394532852 394825630 395876846 396825409 397794838
1347.3C97794838L86772L57742Q1368k16484l34206n08194m25377o32019Q9379L204
$$ 397794838 398181610 398539352 398620720 398404236 398070030 397561836 397136459 396504440 396593819 396597023
1356.9C96597023n7106n90439o16684m47616j199875n07012j135673K32315J11198
$$ 396597023 396539917 395949478 395332794 394885178 393685303 393178291 392042618 392274933 392386131
1365.6C92386131r13086p8773p68013n82314m53453p18155n31807n08918q19092m33846
$$ 392386131 391473045 391394272 390626259 390043945 389590492 388872337 388340530 387831612 387012520 386578674
1375.2C86578674Q19397N8632M9706k51160m97398n05791j310349j200141j476555
$$ 386578674 387398071 387456703 387506409 387255249 386757851 386252060 384941711 383741570 382265015
1383.9C82265015j203270j085434j314278k150307j079902l13263j776085k162514
$$ 382265015 381061745 379976311 378662033 376511726 375431824 375118561 373342476 371179962
1391.6C71179962j956558j167030k451020m034729k010231j596756o70929k468490
$$ 371179962 369223404 368056374 365605354 361570625 359560394 357963638 357292709 354824219
1399.3C54824219k632714j381225k031479j861000k294388k603111k009010j439591
$$ 354824219 352191505 350810280 348778801 346917801 344623413 342020302 340011292 338571701
1407.1C38571701j387215j574821j200829j895256j663589j148377j335296j278534
$$ 338571701 337184486 335609665 334408836 332513580 330849991 329701614 328366318 327087784
1414.8C27087784r43337m06112j133461j004105j846962P61337J478310J19057L60222
$$ 327087784 326144447 325738335 324604874 323600769 321753807 322515144 323993454 324112511 324472733
1423.4C24472733k46926J020355J002884L24326J091576K95066Q55179J206970K104149
$$ 324472733 324225807 325246162 326249046 326573372 327664948 327960014 328815193 330022163 332126312
1432.1C32126312J790161J775322K287369N48363J218872J774864K463150K071915
$$ 332126312 333916473 335691795 337979164 338527527 339746399 341521263 343984413 346056328
1439.8C46056328J945038K107849J444282K054901J229439K022858J443024J137008
$$ 346056328 348001366 350109215 351553497 353608398 354837837 356860695 358303719 359440727
1447.6C59440727J723023J370392J944618J077881K018356J298561J484985J419030
$$ 359440727 361163750 362534142 364478760 365556641 367574997 368873558 370358543 371777573
1455.3C71777573M46663J486701r48257L728828K579422K480355J829948J607285K722206
$$ 371777573 372224236 373710937 372762680 376491508 379070930 381551285 383381233 384988518 387710724
1464C87710724J279411K833786K198754K400741K165566K417984L249893K531700L573494
$$ 387710724 388990135 391823921 394022675 396423416 398588982 401006966 404256859 406788559 410362053
1472.6D10362053K257500M045410L290748K984581L622704K706337K387733J481400
$$ 410362053 412619553 416664963 419955711 422940292 426562996 429269333 431657066 433138466
1480.3D33138466J620178J936798K057839J900673J091613J441346Q70018K57492J217575
$$ 433138466 434758644 436695442 438753281 440653954 441745567 443186913 444056931 444314423 445531998
1489D45531998r12590n95780J092491J15891j019669o90651o52046m823990j70555
$$ 445531998 444619408 444023628 445116119 445232010 444212341 443521690 442869644 438045654 437875099
1497.7D37875099j210022k572517p0305j285362j862679j790924l77769j470452n328254
$$ 437875099 436665077 434092560 434022255 432736893 430874214 429083290 428705521 427235069 421906815
1506.4D21906815k782708K112198K497368p44667M92897o91185j645927o52390j075401
$$ 421906815 419124107 421236305 423733673 422989006 423481903 422790718 421144791 420492401 419417000
1515.1D19417000j62926j532135q38051O10390P76977j563262j718903Q61015O20461
$$ 419417000 419254074 417721939 416883888 417494278 418271255 416707993 414989090 415850105 416470566
1523.7D16470566J462974p20672L68919M66232O54107J474037P14569R41505K49100
$$ 416470566 417933540 417212868 417581787 418048019 418702126 420176163 420890732 421832237 422081337
1532.4D22081337o4735j231614J394577R04046k10457M37126l644180Q39653K415390
$$ 422081337 422016602 420784988 422179565 423083611 422873154 423310280 419666100 420505753 422921143
1541.1D22921143J188545m03328N47562Q09822m39148J705627K30789M90189o71158
$$ 422921143 424109688 423706360 424253922 425063744 424624596 426330223 426561012 427051201 426380043
1549.8D26380043j439476J269074N00106M97246l236847N82771J928673R67751k833519
$$ 426380043 424940567 426209641 426709747 427206993 423970146 424552917 426481590 427449341 424615822
1558.5D24615822q707771J975593k91252R89418j097221j583748k922287k695084j085701
$$ 424615822 415908051 417883644 417592392 418581810 417484589 415900841 412978554 410283470 409197769
1567.1D09197769k502670j427422q358116k060470j846276l657837k690620l016777
$$ 409197769 406695099 405267677 396909561 394849091 393002815 389344978 386654358 383637581
1574.9C83637581j885491j2136344j113472k695885m123001m025917n438195l591575
$$ 383637581 381752090 369615746 368502274 365806389 361683388 357657471 352219276 348627701
1582.6C48627701n890084l394355n093804m186859m134636n177994l163776o013508
$$ 348627701 342737617 339343262 334249458 330062599 325927963 320749969 317586193 311572685
1590.3C11572685k990932n118523l365192l836212m881421k977256n128937j831246
$$ 311572685 308581753 303463230 300098038 296261826 291380405 288403149 283274212 281442966
1598B81442966m380035k304478l561897l364544j858768m170037j304779l622780q37211
$$ 281442966 277062931 274758453 271196556 267832012 265973244 261803207 260498428 256875648 256038437
1606.7B56038437k791138j563530j471576l064232L45535k625332p6103k181130J53580
$$ 256038437 253247299 251683769 250212193 247147961 247493496 244868164 244792061 242610931 242764511
1615.4B42764511m89769n406341K581272j178761J009770j194535J335030n49126k323723
$$ 242764511 242274742 236868401 239449673 238270912 239280682 238086147 239421177 238872051 236548328
1624B36548328J940461l11966K162361j352959J724568M92801N85823J437855J84174
$$ 236548328 238488789 238176823 240339184 238986225 240710793 241203594 241789417 243227272 243411446
1632.7B43411446K438659j004181J241970j2569L303089J937218Q36067K508640P61547
$$ 243411446 245850105 244845924 246087894 246075325 249378414 251315632 252151699 254660339 255421886
1641.4B55421886L200360L75194K294770J858348m84504K413616j147118M865609J616668
$$ 255421886 258622246 258997440 261292210 263150558 262666054 265079670 263932552 268798161 270414829
1650.1B70414829L141480J713581l284626J747646J636982N187130J274319K604828
$$ 270414829 273556309 275269890 271985264 273732910 275369892 280557022 281831341 284436169
1657.8B84436169J232204K100620K693615J629391L549004J450996L897686K352238
$$ 284436169 285668373 287768993 290462608 292091999 295641003 297091999 300989685 303341923
1665.5C03341923L467617L168850K561569L997250J902236N151597K671928M807816
$$ 303341923 306809540 309978390 312539959 316537209 318439445 323591042 326262970 331070786
1673.2C31070786L993530L059692L710900L416519N122032L083725M507408L870239
$$ 331070786 335064316 338124008 341834908 345251427 350373459 353457184 357964592 361834831
1680.9C61834831N277443N778504K347450N746612K201806O072731M340019M466552
$$ 361834831 367112274 372890778 375238228 380984840 383186646 389259377 393599396 398065948
1688.6C98065948N104523M706841N907173N058441N508652M845352M618606K027207
$$ 398065948 403170471 407877312 413784485 418842926 424351578 429196930 433815536 435842743
1696.4D35842743O087723O507148N314179L619690J577072Q255997N948486N000038
$$ 435842743 441930466 448437614 453751793 457371483 458948555 467204552 473153038 478153076
1704.1D78153076L942375L007927K924500L556022M377976K603645K731705L497772
$$ 478153076 482095451 485103378 488027878 491583900 495961876 498565521 501297226 504794998
1711.8E04794998L199578K860565P94525J760559L990860K341270k784233L442955
$$ 504794998 507994576 510855141 511649666 513410225 517401085 519742355 516958122 520401077
1719.5E20401077L508492K306061K213554J576691J654930K149696J975594J321945
$$ 520401077 523909569 526215630 528429184 530005875 531660805 533810501 535786095 537108040
1727.2E37108040J448402J811257n9510Q83980L858185L857994j050606k245559M774894
$$ 537108040 538556442 540367699 540308189 541192169 545050354 548908348 547857742 545612183 550387077
1735.9E50387077L951645K130661K443123L69301J03378M420319L608780K801323K922096
$$ 550387077 554338722 556469383 558912506 559281807 559385185 563805504 567414284 570215607 573137703
1744.6E73137703L510437L635902L054505L016700K350274M700126K692299K764778
$$ 573137703 576648140 580284042 583338547 586355247 588705521 593405647 596097946 598862724
1752.3E98862724N533638L567696L609810L795852J700287K708702L522110K815247
$$ 598862724 604396362 607964058 611573868 615369720 617070007 619778709 623300819 626116066
1760F26116066K920265j411J328201M362450K621765K015571K266961K047042n75561
$$ 626116066 629036331 629034920 630363121 634725571 637347336 639362907 641629868 643676910 643101349
1768.7F43101349K264328L742065K05231j235199n17883M800415K975693J80130K732620
$$ 643101349 645365677 649107742 649312973 648077774 647559891 652360306 655335999 655516129 658248749
1777.4F58248749J249923J343155J54038m50592J548691K122650K000961R1629J077118
$$ 658248749 659498672 660841827 660995865 660545273 662093964 664216614 666217575 666309204 667386322
1786F67386322J870194J532516O62918J043472N05753q392q34198M15191L991547J393356
$$ 667386322 669256516 670789032 671451950 672495422 673001175 672992783 672158585 672573776 676565323 677958679
1795.7F77958679M90113J879577J404190K82288p41196K044754K04086Q20008J695785
$$ 677958679 678448792 680328369 681732559 682014847 681273651 683318405 683522491 684342499 686038284
1804.4F86038284Q70056J593094Q19245R93805Q73947N26352j164551O30951J494827
$$ 686038284 686908340 688501434 689320679 690314484 691188431 691714783 690550232 691181183 692676010
1813F92676010M36020J485062Q79059J318130L80325Q84171J210403k77252N16052
$$ 692676010 693112030 694597092 695476151 696794281 697174606 698058777 699269180 698991928 699507980
1821.7F99507980j83258J067734Q13751j279373J050797K118072J563873m21600k264709
$$ 699507980 699324722 700392456 701206207 699926834 700977631 703095703 704659576 704237976 701973267
1830.4G01973267Q23364K412567K16064n0125N08652P86743Q96530Q7128J677628L51715
$$ 701973267 702796631 705209198 705425262 705375137 705883789 706670532 707567062 707654190 709331818 709683533
1840.1G09683533K20566K38800Q65325M84620m561692K357788K165604M46320M30984
$$ 709683533 709904099 710142899 711008224 711492844 706931152 709288940 711454544 711900864 712331848
1848.7G12331848R70001J213456l03193M41437l21426J80588J45416j0376R69696M50058
$$ 712331848 713301849 714515305 714212112 714653549 714332123 714512711 714658127 714647751 715617447 716067505
1858.4G16067505O78100M3869Q57926O1188L0441K07825o51474J62124l31878J190567
$$ 716067505 716745605 716789474 717647400 717708588 717739029 717946854 717295380 717457504 717125626 718316193
1868G18316193n57557o33468J684112J092225N68542k85187M78592l01514K09809M80957
$$ 718316193 717758636 717125168 718809280 719901505 720470047 720184860 720663452 720361938 720571747 721052704
1877.7G21052704L7002M40140L58582J088485n1269J33362l76511l357L97110p32956
$$ 721052704 721089706 721529846 721888428 722976913 722925644 723059006 722682495 722679138 723076248 722343292
1887.3G22343292O89850l43246n50919Q96454J294174M39301p1259k1362r64966O37512
$$ 722343292 723033142 722689896 722138977 723035431 724329605 724768906 724697647 724676285 723711319 724348831
1896.9G24348831j02005K93274Q29849J25504K24838l70788O61773p5531K03858L20663
$$ 724348831 724246826 724540100 725369949 725495453 725720291 725349503 726011276 725935745 726139603 726460266
1906.6G26460266k38418q4458o33850J49765K46277J118851L83072K41928j7472o21719
$$ 726460266 726221848 726137390 725503540 725653305 725899582 727018433 727401505 727643433 727625961 727004242
1916.2G27004242M90723j827317R6436J206131K91061L78418o32934k2660M48456N45960
$$ 727004242 727494965 725667648 725764084 726970215 727261276 727639694 727006760 726984100 727432556 727978516
1925.9G27978516n1422J09100j43051l1891J62353n01251K78397K1744M89730p7285
$$ 727978516 727927094 728036194 727893143 727861252 728023605 727522354 727800751 727822495 728312225 728234940
1935.5G28234940m24729j38168k50092L72391l77197O25915o58188j397781J215591
$$ 728234940 727810211 727672043 727421951 727794342 727417145 728043060 727384872 725987091 727202682
1944.2G27202682N29175k48718M3869Q11691j87988k76108r155j907Q8272o23780K32926
$$ 727202682 727731857 727483139 727527008 728338699 728150711 727874603 727865448 727863541 727951813 727328033 727560959
1954.8G27560959k9373j49689j99356K4719J62354l74222K97088n0430J70059k85568
$$ 727560959 727531586 727381897 727182541 727207260 727369614 726995392 727292480 727242050 727412109 727126541
1964.5G27126541l67889k47574p96433k4109J27869P10144M76303O28434j1139o24619
$$ 727126541 726758652 726511078 725714645 725690536 725818405 726528549 727004852 727633286 727622147 726997528
1974.1G26997528p5226m99496p6599n03922J4496J68610j57395K06452j07651L69873
$$ 726997528 726922302 726422806 726346207 725842285 725856781 726025391 725867996 726074448 725966797 726336670
1983.7G26336670p7667N1956j99433o43310m82483r3613O90995q6213m68521j43814
$$ 726336670 726259003 726310959 726111526 725468216 724985733 724892120 725583115 725496902 725028381 724884567
1993.4G24884567N10178J5564k77939J56097l87649k58713m65317R9717j06049M3030
$$ 724884567 725394745 725410309 725132370 725288467 724900818 724642105 724176788 724276505 724170456 724213486
2003G24213486K80075n60837n0583k38495j56631n53971j17492L46069l04718j16272
$$ 724213486 724493561 723932724 723882141 723643646 723487015 722933044 722815552 723161621 722856903 722740631
2012.7G22740631l63998K01263J05972k21252o12183j33133K3194p97730J21994j26495
$$ 722740631 722376633 722577896 722683868 722462616 721850433 721717300 721740494 720942764 721064758 720938263
2022.3G20938263O4468j51748k42462J81579j26190J65253q22983n59006n21622j47781
$$ 720938263 721002731 720850983 720608521 720790100 720663910 720829163 720006180 719447174 718925552 718777771
2032G18777771J20316k87552N01938m7760J56326l47290k53906J20315k99988l06472
$$ 718777771 718898087 718610535 719112473 719064713 719221039 718873749 718619843 718740158 718440170 718133698
2041.6G18133698q90198J14288K7847J37864P4920k15912M0207m53720M7379n53742
$$ 718133698 717243500 717357788 717385635 717523499 717598419 717382507 717422714 716968994 717016373 716462631
2051.2G16462631q3923j8768k73972J57242j66550J52130l95126P7438j37176j76010
$$ 716462631 716378708 716359940 716085968 716243210 716076660 716228790 715833664 715911102 715773926 715597916
2060.9G15597916r1248l38516M93622l94669k05459o1570K213J1139P0266L58201o88859
$$ 715597916 715506668 715168152 715661774 715267105 715061646 715000076 715002289 715013428 715083694 715441895 714753036
2071.5G14753036j24740j36109j29623j35956j2817K84881j27944K99606n23071j66550
$$ 714753036 714628296 714492187 714362564 714226608 714213791 714498672 714370728 714670334 714147263 713980713
2081.1G13980713q9417m04129k33459l16467J80282l46832K39181p1106j34964P5989
$$ 713980713 713891296 713487167 713253708 712937241 713117523 712770691 713009872 712938766 712803802 712879791
2090.8G12879791l12118K7771o75431k288Q7967k17820l27987j62888m959n03693K88086
$$ 712879791 712567673 712595444 711920013 711917725 712005692 711787872 711459885 711296997 711292038 710788345 711076431
2101.4G11076431j19247R1400k97775n90592K73438j52359k3728l02658j81732n78232
$$ 711076431 710957184 711048584 710750809 710160217 710433655 710281296 710257568 709954910 709773178 709194946
2111G09194946l15323J8616k50397L81623r5597J01624m46777j92109L63923j30310
$$ 709194946 708879623 708898239 708647842 709029465 708933868 709035492 708588715 708396606 708760529 708630219
2120.7G08630219q1788m56390K07825j24588k76718q2932j1139K8229k94037L56369
$$ 708630219 708548431 708092041 708299866 708175278 707898560 707815628 707804489 707832718 707538681 707895050
2130.3G07895050p9193j61438q07114n02777O77109N76858L12882p77435J44653N64423
$$ 707895050 707815857 707654419 706847305 706344528 707021637 707598495 707911377 707133942 707278595 707843018
2140G07843018N8136l62092l99322M14047j92795p6j21460K9373R4223O943L66364
$$ 707843018 707901154 707539062 707139740 707553787 707360992 707360916 707239456 707268829 707363052 707369995 707736359
2150.6G07736359j05820k0523m51126J82724m4098l31268L99322K1057K32163q4381
$$ 707736359 707630539 707610016 707158890 707341614 707297516 706966248 707365570 707386627 707618790 707534409
2160.2G07534409J36261l3875n6076k17361n42069K70233k32391K4643K35138N80444
$$ 707534409 707670670 707636795 707580719 707363358 706821289 707091522 706859131 706883774 707118912 707699356
2169.9G07699356L96881l91617j6174L8834K65655k55432m8370r1400j53L32336j67389
$$ 707699356 708096237 707704620 707688446 707727280 707992935 707737503 707689133 707597733 707597580 707929916 707762527
2180.5G07762527K09656k18811L23944L00141j17874N2108j30157K84653j79444j09329
$$ 707762527 707972183 707753372 708077316 708377457 708259583 708311691 708181534 708466187 708286743 708177414
2190.1G08177414j55869L39356L65066p095M00543L8300k289p35474J17340L00904
$$ 708177414 708021545 708360901 708725967 708718872 709119415 709157715 709155426 708419952 708537292 708838196
2199.8G08838196k86026K33307P9269O20957k51465p3624L16772r8114N417l86505
$$ 708838196 708552170 708785477 708864746 709485703 709234238 709160614 709477386 709379272 709384689 708998184
2209.4G08998184J13297R0408K77939j31455r384J99890l25241M42505L13721J37558
$$ 708998184 709111481 709201889 709479828 709348373 709338989 709538879 709213638 709656143 709969864 710107422
2219G10107422j79367K060k14691m27552K40097J3581K99835J07345K57874k58484
$$ 710107422 709928055 709930115 709715424 709287872 709527969 709541550 709841385 709948730 710206604 709948120
2228.7G09948120l82233L15247j5640J21078j55105K9983m55017k58484r460o8436
$$ 709948120 709565887 709881134 709865494 709986572 709831467 709861450 709406433 709147949 709138489 709070053
2238.3G09070053P33719k9831L433m34494l48510L6239o5994K08511k48871L02353
$$ 709070053 709803772 709773941 709777374 709342880 708994370 709030609 708964615 709173126 708924255 709226608
2248G09226608p2632L72773L90319j31378M0360m44794Q0795o85348j26724J07269
$$ 709226608 709153976 709526749 709917068 709785690 709826050 709381256 709462051 708776703 708649979 708757248
2257.6G08757248k89764N61065J38779J72729j7852p7057n59845j36338j25427n86777
$$ 708757248 708467484 709028549 709167328 709340057 709322205 709245148 708685303 708548965 708423538 707836761
2267.3G07836761J81809m01154K78778L29667L99627N27649r6283k60467r19800M4632
$$ 707836761 708018570 707617416 707896194 708225861 708625488 709153137 709056854 708796387 707876587 707921219
2276.9G07921219r2392l662j10474l73459N82962K70691K82974j45187j20926q77762
$$ 707921219 707828827 707825165 707714691 707341232 707924194 708194885 708477859 708332672 708211746 707333984
2286.5G07333984p57599M7379n57632q8883m31366L37219L04184M0436m4784r81293
$$ 707333984 706576385 706623764 706066132 705977249 705545883 705883102 706187286 706227722 706182938 705201645
2296.2G05201645k64511l64075J66321m56848q11386l58353l67889K26440n34058l1509
$$ 705201645 704937134 704573059 704739380 704282532 703471146 703112793 702744904 702971344 702437286 702405777
2305.8G02405777n97382p30056l12271p23877l16010o48041j14135n88608J96686J72042
$$ 702405777 701808395 701078339 700766068 700042191 699726181 699078140 698964005 698375397 698572083 698744125
2315.5F98744125n49698k25296j142959q32672j601410j138840r47647l86734N8212
$$ 698744125 698194427 697969131 696826172 695993500 694392090 693253250 692305603 691918869 691977081
2324.2F91977081o05774N87693j98365O46363q66623j233597j75858j132812o867r16214
$$ 691977081 691371307 691959000 691760635 692406998 691540375 690306778 690130920 688998108 688991241 688075027
2333.8F88075027j71585r47418p87582N52292O56509K7924j693650J12000p84531P4234
$$ 688075027 687903442 686956024 686168442 686720734 687377243 687405167 685711517 685823517 685038986 685113220
2343.4F85113220J00556L98254J981812O95953K384262J284103j163711k311707j615219
$$ 685113220 685213776 685612030 687593842 688289795 690674057 691958160 690794449 688482742 686867523
2352.1F86867523j088257j903762j111451j948928j232758p9804J32294j030807k5788
$$ 686867523 685779266 683875504 682764053 680815125 679582367 679502563 679634857 678604050 678578262
2360.8F78578262P53785j836014O14547R97773Q03985L21427J08947J77384Q26034
$$ 678578262 679332047 677496033 678110580 679108353 679912338 680233765 680342712 680520096 681346130
2369.5F81346130K312546Q9417J341781J326676J88522O65588O51246R26742k0294
$$ 681346130 683658676 683748093 685089874 686416550 686605072 687270660 687921906 688848648 688828354
2378.2F88828354M99649N78766O36139J003570O12870L44085j20468p477m63638j96304
$$ 688828354 689328003 689906769 690542908 691546478 692159348 692503433 692382965 692375488 691911850 691715546
2387.8F91715546j63193n52139j22605m8065J59912l41492k72750J40915j69678o89240
$$ 691715546 691552353 691000214 690877609 690829544 690989456 690647964 690375214 690516129 690346451 689657211
2397.4F89657211k71835k2430q48084j88522j28174l53546k37046j15966r003m20303
$$ 689657211 689385376 689362946 688514862 688326340 688198166 687844620 687607574 687491608 687482605 687062302
2407.1F87062302j22986n21698m17023m76227n17959j7624j57547q7357o65512l59497
$$ 687062302 686939316 686417618 686000595 685524368 685006409 684988785 684831238 684743881 684078369 683718872
2416.7F83718872k81982k23465J3656m84924n01404q38699j88141K8152l16085l63999
$$ 683718872 683436890 683213425 683227081 682742157 682240753 681402054 681213913 681242065 680925980 680561981
2426.4F80561981k69775k77481o58570k80685n51682k93502m01001m17176J5259l41339
$$ 680561981 680292206 680014725 679356155 679075470 678523788 678230286 677829285 677412109 677427368 677086029
2436F77086029L1586l28141l52630p53327q39538l20130m49981k17819m22745K10342
$$ 677086029 677117615 676789474 676436844 675683517 674843979 674523849 674073868 673856049 673433304 673643646
2445.7F73643646j24740n19410n89294p75909k77634n83115J1139m04129n66253k90070
$$ 673643646 673518906 672999496 672410202 671634293 671356659 670773544 670784683 670380554 669814301 669524231
2455.3F69524231n64804j42212l06473l3569o87943q31680n07355l60489j75323o44836
$$ 669524231 668959427 668817215 668510742 668477173 667789230 666957550 666450195 666089706 665914383 665269547
2465F65269547j81351l91083j49765k73743l98712j87454p41806j75552m79966p88803
$$ 665269547 665088196 664697113 664547348 664273605 663874893 663687439 662945633 662770081 662290115 661501312
2474.6F61501312r12018o84051m10004n62820j83716l83224m9973l46451n63888r24302
$$ 661501312 660589294 659905243 659495239 658932419 658748703 658365479 658315506 657969055 657405167 656480865
2484.2F56480865r36737j25961n85937j50299j32142m37393q52813q97904l03039n52979
$$ 656480865 655544128 655418167 654832230 654681931 654549789 654112396 653259583 652361679 652058640 651505661
2493.9F51505661l00598o18744m32282m48913o34384l19824n31846k47268l94898m98047
$$ 651505661 651205063 650586319 650154037 649705124 649070740 648750916 648219070 647971802 647576904 647078857
2503.5F47078857p93457m05197l28521n89295k83661r87854n03158l10364l15170k54212
$$ 647078857 646285400 645880203 645551682 644962387 644678726 643690872 643187714 642877350 642562180 642307968
2513.2F42307968o13785n42907p43485j76697l06930m28658m94652m14810k46963q27294
$$ 642307968 641694183 641151276 640407791 640231094 639924164 639495506 639000854 638586044 638339081 637511787
2522.8F37511787n86700o40831k68898m71268n80826j86920o37893l09143m51661l14445
$$ 637511787 636925087 636284256 636015358 635544090 634963264 634776344 634138451 633829308 633377647 633063202
2532.5F33063202r1896m90799q20427l99666j07689o91108k42653m82560l90052p3204
$$ 633063202 632971306 632480507 631660080 631260414 631152725 630461617 630218964 629736404 629346352 629273148
2542.1F29273148n60341p00150p84874j21994j97677m84848o48232n87311k21252l60108
$$ 629273148 628712807 628012657 627227783 627105789 626908112 626423264 625775032 625187721 624966469 624606361
2551.7F24606361m26864l54309K6245q44765r02672l67965n66483k44522n04265j44501
$$ 624606361 624179497 623825188 623851433 623006668 622103996 621736031 621169548 620925026 620420761 620276260
2561.4F20276260l18298m17709p7782n69878o53152p39822m51966l29475l79830m49028
$$ 620276260 619957962 619540253 619462471 618892593 618239441 617499619 617047653 616718178 616338348 615889320
2571F15889320j45988J33667l47633p49207q65784k91748o03676n20210p6446m09012
$$ 615889320 615743332 615876999 615529366 614780159 613914375 613622627 613018951 612498741 612422295 612013283
2580.7F12013283n73502q71925j85623l1777l06244n73311n13076j95923p24030l89938
$$ 612013283 611439781 610567856 610382233 610350456 610044212 609470901 608957825 608761902 608037872 607647934
2590.3F07647934n37148n82962m55894m89998j85013m53720n20172r04846m22936l33595
$$ 607647934 607110786 606527824 606071930 605581932 605396919 604943199 604423027 603518181 603095245 602761650
2600F02761650q32481m84085m13247n16929q14018N0621K26516q07571j047287o67839
$$ 602761650 601929169 601445084 601031837 600514908 599700890 599751511 599978027 599170456 598123169 597455330
2609.6E97455330k40784n91659q15354p24487l50494n08080l59383j41944p97158m40750
$$ 597455330 597214546 596622887 595807533 595083046 594732552 594224472 593865089 593723145 592925987 592485237
2619.3E92485237m89387p86133r54132p35512j64108l08342m41017p15752l87764l98827
$$ 592485237 591995850 591209717 590255585 589520073 589355965 589047623 588606606 587890854 587503090 587104263
2628.9E87104263o21490n41344m41704m83741r65462o67534q71239n53474j07155l92380
$$ 587104263 586482773 585941429 585499725 585015984 584050522 583382988 582511749 581958275 581851120 581458740
2638.5E81458740l11699o70395o05850q21991q04405n07469m26941m16260o69479k85034
$$ 581458740 581147041 580476646 579870796 579048805 578244400 577736931 577309990 576893730 576224251 575939217
2648.2E75939217l38631l73802m57306l84026k82821o57998n93032p72515m39949l39508
$$ 575939217 575600586 575226784 574769478 574385452 574102631 573444633 572851601 572079086 571639137 571299629
2657.8E71299629p35359p85103l94363K2812j29242l68004p83425n57746p12700l71323
$$ 571299629 570564270 569779167 569384804 569407616 569278374 568910370 568126945 567569199 566856499 566485176
2667.5E66485176J27335o34308m28353k47306j94397l91121o13213m27017k61002j96228
$$ 566485176 566612511 565978203 565549850 565302544 565108147 564717026 564103813 563676796 563415794 563219566
2677.1E63219566o71463k23655m48456q58307o41213o42013j69945j37596j13678k95639
$$ 563219566 562548103 562324448 561875992 561017685 560376472 559734459 559564514 559426918 559313240 559017601
2686.8E59017601m24957n47524l88336l77350r05189m08364j23939m5242n63775m73899
$$ 559017601 558592644 558045120 557656784 557279434 556374245 555965881 555841942 555796700 555232925 554759026
2696.4E54759026L8871n66787m73137n16739o45561p31850j12495J17988n50918k60048
$$ 554759026 554797897 554231110 553757973 553241234 552595673 551863823 551751328 551869316 551318398 551058350
2706E51058350l55568l82614m69246m50707m61082l13073p2898m07792j43241n93377
$$ 551058350 550702782 550320168 549850922 549400215 548939133 548626060 548553162 548145370 548002129 547408752
2715.7E47408752k97622j02501m02069j7052o19888n53627l27759k87781l36265q4763
$$ 547408752 547111130 547008629 546606560 546589508 545969620 545415993 545088234 544800453 544464188 544379425
2725.3E44379425J4839o15654l58124m88624m63638m04625j58387L1472n24330k90833
$$ 544379425 544394264 543778610 543420486 542931862 542468224 542063599 541905212 541936684 541412354 541121521
2735E41121521j33972k45400l29628R7351l34854o93779n7335k18124k7847k99645
$$ 541121521 540987549 540742149 540412521 540509872 540175018 539481239 539423904 539205780 539177933 538878288
2744.6E38878288m48227l70941q7547K8839n06744P171l75519n30853j11618j68686
$$ 538878288 538430061 538059120 537971573 538000412 537493668 537500839 537125320 536594467 536482849 536314163
2754.3E36314163l60336n59921k63710l05901L0365l98750m12331j48773p22923k83852
$$ 536314163 535953827 535393906 535130196 534824295 534854660 534455910 534043579 533894806 533171883 532888031
2763.9E32888031k26402k75765m86717j83639Q0070m67949k55623l14522l35769l54653
$$ 532888031 532661629 532385864 531899147 531715508 531795578 531327629 531072006 530757484 530421715 530067062
2773.5E30067062m73709q13904o56814j18599m91600p23686l72887J87454n71556q39805
$$ 530067062 529593353 528779449 528122635 528004036 527512436 526788750 526415863 526603317 526031761 525191956
2783.2E25191956m50516o55327l54729k47764q8158o01425o20117o49605j040230m39644
$$ 525191956 524741440 524086113 523731384 523483620 523395462 522794037 522173920 521524315 520484085 520044441
2792.8E20044441n85060p14760o08329k24152m32968j040306j042824p29065j85471
$$ 520044441 519459381 518744621 518136292 517912140 517479172 516438866 515396042 514666977 514481506
2801.5E14481506q28972p85865n86891o46439m60396q12378o50291n84183l90701q16155
$$ 514481506 513652534 512866669 512279778 511633339 511172943 510360565 509710274 509126091 508735390 507919235
2811.2E07919235r02214r17625j130066m58756q31985q70285q49953p76749o45561
$$ 507919235 507017021 506099396 504969330 504510574 503678589 502808304 501958351 501181602 500536041
2819.8E00536041q80661q87756j152535o95419r71107j058617q21953q38852o65512
$$ 500536041 499655380 498767624 497615089 496919670 495948563 494889946 494067993 493229141 492563629
2828.5D92563629r98688p87963r74160r25369j285362j324654o22139j102943j086426
$$ 492563629 491564941 490776978 489802818 488877449 487592087 486267433 485645294 484542351 483455925
2837.2D83455925j505585j593017j127549j449432j951141k125206k114487k412796
$$ 483455925 481950340 480357323 479229774 477780342 475829201 473703995 471589508 469176712
2844.9D69176712j972275k199363k612229k501564j928711j347961j652146j031837
$$ 469176712 467204437 465005074 462392845 459891281 457962570 456614609 454962463 453930626
2852.6D53930626j144371r01032k76031l62663P24m43267l49236p1449J44501R2163
$$ 453930626 452786255 451885223 451609192 451246529 451247253 450803986 450454750 450383301 450527802 450619965
2862.3D50619965l65448p61605j015815k87171p78770j376114j222420j005020n93910
$$ 450619965 450254517 449492912 448477097 448189926 447411156 446035042 444812622 443807602 443213692
2870.9D43213692p14608m63218m99611p25250r07898j040383q18824n91736n48706
$$ 443213692 442499084 442035866 441536255 440811005 439903107 438862724 438043900 437452164 436903458
2879.6D36903458n65300o55976j370620j127854o84204p85332q52012j200104r78775
$$ 436903458 436338158 435682182 434311562 433183708 432499504 431714172 430862160 429662056 428683281
2888.3D28683281p91626j003723j349564j001625j152954j358948n12657q19206r05495
$$ 428683281 427891655 426887932 425538368 424536743 423383789 422024841 421512184 420692978 419787483
2897D19787483r18770j138115q11424l50532r8267q04100j137466r20830n15824q69216
$$ 419787483 418868713 417730598 416919174 416568642 416470375 415666275 414528809 413607979 413092155 412222939
2906.6D12222939q70133p30820j581382j227341j124306j150436j474152j652221j227189
$$ 412222939 411352806 410621986 409040604 407813263 406688957 405538521 404064369 402412148 401184959
2915.3D01184959j907119j738243j309166j011010j045837j246452j135102j122436
$$ 401184959 399277840 397539597 396230431 395219421 394173584 392927132 391792030 390669594
2923C90669594o93855p29752l9673K213l0976N59159k89002k78702M37012N42145J68457
$$ 390669594 389975739 389245987 389206314 389208527 389177551 389736710 389447708 389169006 389606018 390148163 390316620
2933.6C90316620K88734N55878O39877M84314J28975R40666J029587J059494Q54988
$$ 390316620 390605354 391161232 391801109 392285423 392414398 393355064 394384651 395444145 396299133
2942.3C96299133L86811J036300Q43544P75948N68275L08304L52936L68042J026001
$$ 396299133 396685944 397722244 398565788 399341736 399910011 400218315 400571251 400939293 401965294
2951D01965294J009254O83594K00806r3231K90031P50160N77660K23121Q09403Q47435
$$ 401965294 402974548 403658142 403858948 403765717 404055748 404805908 405383568 405606689 406416092 407263527
2960.6D07263527N28717O02570M31861L57895Q73185J291847R55620M96406N42793
$$ 407263527 407792244 408394814 408826675 409184570 410057755 411349602 412305222 412801628 413344421
2969.3D13344421P69692N81016Q74634O57807M77905J106567P68891R35058O61240
$$ 413344421 414114113 414695129 415569763 416227570 416705475 417812042 418580933 419515991 420177231
2978D20177231n799L61710M52538O66771O90574L56789j48964l14789M51737Q65593
$$ 420177231 420171432 420533142 420985680 421652451 422343025 422699814 422550850 422236061 422687798 423553391
2987.6D23553391M52423L51600K19460j85929j67198l29818j20469j55181l04566N760
$$ 423553391 424005814 424357414 424576874 424390945 424223747 423893929 423773460 423618279 423313713 423319473
2997.3D23319473k14729l56598n45578m20303p68929p45811j8997n80674o86187k92092
$$ 423319473 423104744 422748146 422202568 421782265 421013336 420267525 420248528 419667854 418981667 418689575
3006.9D18689575j26838o02379q55675n08270n75562m37317p32841n08499n22423r43337
$$ 418689575 418562737 417960358 417104683 416596413 416020851 415583534 414850693 414342194 413819771 412876434
3016.6D12876434q83789q06465k27203n14145p61261p64809p38601m69590p53631q49686
$$ 412876434 411992645 411186180 410958977 410444832 409683571 408918762 408180161 407710571 406956940 406107254
3026.2D06107254j156120j116715o83670k70500l60870p95670q29773j031952r72099
$$ 406107254 404951134 403834419 403150749 402880249 402519379 401723709 400893936 399861984 398889885
3034.9C98889885j265755j191139q62732q91952p05643q91342o95305q56095j208457
$$ 398889885 397624130 396432991 395570259 394678307 393972664 393081322 392386017 391529922 390321465
3043.6C90321465o84700k91405n70984q38471j016655j267395p81288o83822q94471
$$ 390321465 389636765 389345360 388774376 387935905 386919250 385651855 384870567 384186745 383292274
3052.2C83292274r68284q38852o49490j102257q45680o92902j046562j179314o93931
$$ 383292274 382323990 381485138 380835648 379733391 378887711 378194809 377148247 375968933 375275002
3060.9C75275002k82555p86133p57866q36716o67419l26309q52623j206055r12742
$$ 375275002 374992447 374206314 373448448 372611732 371944313 371618004 370765381 369559326 368646584
3069.6C68646584o75049r21517n94825n48821m51546m12445q37211n54505r44442r58825
$$ 368646584 367971535 367050018 366455193 365906372 365454826 365042381 364205170 363650665 362706223 361747398
3079.2C61747398p30972r71527o74553l68385l70789p42111n76134q16765r97505n21774
$$ 361747398 361016426 360044899 359370346 359001961 358631172 357889061 357312927 356496162 355498657 354976883
3088.9C54976883p43141q78449r89074r01528o06575n07965m74205m87099n47866p30439
$$ 354976883 354233742 353355293 352366219 351464691 350858116 350350151 349875946 349388847 348840981 348110542
3098.5C48110542o97555q71086r92813q12874p55120n41305j47019n92765j230545
$$ 348110542 347412987 346541901 345549088 344736214 343981094 343439789 343292770 342700005 341469460
3107.2C41469460p55616o88514q73795q87451q89092o70509p04880l98407m63867o65474
$$ 341469460 340713844 340025330 339151535 338264084 337374992 336704483 335999603 335601196 335137329 334471855
3116.9C34471855l59421p66792j487274j138115o02760p69043p50923o61622n09910
$$ 334471855 334112434 333345642 331858368 330720253 330117493 329348450 328597527 327935905 327425995
3125.5C27425995o18439o73218n59730q41980p03468r92508j238442q83789o60133
$$ 327425995 326807556 326134338 325574608 324732628 324029160 323036652 321798210 320914421 320254288
3134.2C20254288q44403j028118o03466n34076m77467q15735q00323l51353j072998
$$ 320254288 319409885 318381767 317778301 317244225 316766758 315951023 315150700 314799347 313726349
3142.9C13726349j229477q69331n33886m37374o87676q47988j100369r46407o52161
$$ 313726349 312496872 311627541 311093655 310656281 309968605 309120617 308020248 307073841 306421680
3151.6C06421680n85212p34024o19202r37843r16806m50878q39348o42910r21688j130352
$$ 306421680 305836468 305102444 304483242 303545399 302628593 302177715 301338367 300695457 299773769 298643417
3161.2B98643417n25493l91884p70512j258754p21245o24695o82125o37074q29296
$$ 298643417 298117924 297726040 296955528 295696774 294975529 294350834 293668709 293031635 292202339
3169.9B92202339q18424j220951n30071k51656q16994o38141n32971p91511j076775
$$ 292202339 291383915 290162964 289632893 289381237 288564243 287926102 287393131 286601620 285524845
3178.6B85524845o19106m52538n76763n67398j058388j184711o46191n61867q61225
$$ 285524845 284905739 284453201 283876438 283309040 282250652 281065941 280419750 279857883 278996658
3187.3B78996658q11176p59106m15229n85194q75816p01447q03776n31368r38835j196900
$$ 278996658 278185482 277426376 277011147 276425953 275550137 274848690 274044914 273513546 272574711 271377811
3196.9B71377811m41608P9784l72295j259937q30879l98827m39167m79145p32346p44915
$$ 271377811 270936203 271015987 270643692 269383755 268552876 268154049 267714882 267235737 266503391 265758476
3206.5B65758476n78727m16470q23975p94067l87745n06382o35395m98657l77255o56700
$$ 265758476 265179749 264763279 263939304 263145237 262757492 262251110 261615715 261117058 260739803 260083103
3216.2B60083103q54873p72458l12671k58293m75636n78537q88004o40354m12198o79931
$$ 260083103 259228230 258455772 258143101 257884808 257409172 256830635 255942631 255302277 254890079 254210148
3225.8B54210148j064224m52710k7484m19484j97296n91049p58514m94671n78804o52581
$$ 254210148 253145924 252693214 252665730 252246246 252048950 251457901 250699387 250204716 249625912 248973331
3235.5B48973331o41346p00454j039353n43251k82039j58863k38800q33588n85919
$$ 248973331 248331985 247631531 246592178 246048927 245766888 245608025 245369225 244535637 243949718
3244.2B43949718m80690j19686k11296o04667k64626k41127n33485r62506o00567l97701
$$ 243949718 243469028 243349342 243138046 242533379 242268753 242027626 241494141 240531635 239931068 239533367
3253.8B39533367p70473l67737n2815k37865j03397m07200j180802m79507p2022m69226
$$ 239533367 238762894 238395157 238342342 238104477 238001080 237593880 236413078 235933571 235861549 235392323
3263.4B35392323l67241m07505l91369n39570l33843r5482l43762m82387l79582n31521
$$ 235392323 235025082 234617577 234226208 233686638 233352795 233257313 232913551 232431164 232051582 231520061
3273.1B31520061p47470j99795k57778m06246l13321k59704P8048k33688m95777o12392
$$ 231520061 230772591 230572796 230315018 229908772 229595451 229335747 229413795 229180107 228684330 228071938
3282.7B28071938l67928l4046o8627j71184k92778j69468o24771o47583k20432k27108
$$ 228071938 227704010 227669964 227601337 227430153 227137375 226967907 226343136 225695553 225475121 225248013
3292.4B25248013l53203m88510n32399n04207J716j3237j8901j73474p20939n06363
$$ 225248013 224894810 224406300 223873901 223369694 223371410 223358173 223339272 223165798 222444859 221938496
3302B21938496m21639m3564j46999l51753n3673k03896m82998r34562m33445p7801
$$ 221938496 221516857 221473293 221326294 220974541 220920868 220716972 220233974 219299412 218865967 218788166
3311.7B18788166l45344m86813m53968k42710n02892R0752J93539m48819m19235p79991
$$ 218788166 218442822 217956009 217502041 217259331 216756439 216847191 217040730 216591911 216172676 215392685
3321.3B15392685p62215l09715j0700j71890q92601r81141k50263n5713l73555m43516
$$ 215392685 214630470 214320755 214310055 214138165 213245564 212264423 212014160 211958447 211584892 211141376
3330.9B11141376o91738p39421o20480n34496n89314n86777q2016j87816o08082n85918
$$ 211141376 210449638 209710217 209089737 208555241 207965927 207379150 207297134 207109318 206501236 205915318
3340.6B05915318k23389j31169l86867n20515o87695l41167o676j97907k74124l49750
$$ 205915318 205691929 205560760 205173893 204653378 203965683 203624516 203617840 203419933 203145809 202796059
3350.2B02796059m89502l58639k32773j23348j11694m10004j75781k17896l05157j18446
$$ 202796059 202306557 201947918 201715145 201591797 201480103 201070099 200894318 200676422 200371265 200252819
3359.9B00252819m47960j06525O9523m39263o07605j32732p1011k35386K06814m34379
$$ 200252819 199804859 199698334 199767857 199328594 198720989 198588257 198517246 198281860 198488674 198054295
3369.5A98054295o30169k35157j49670r9792m30794K44636K4453m35124L54691K50377
$$ 198054295 197424126 197188969 197039299 196939507 196508713 196753349 196777802 196342678 196697369 196947746
3379.2A96947746m62627n91545K37503M978o08425j34754P0495K77291O4354q5450
$$ 196947746 196485119 195893574 196131077 196136055 195527630 195392876 195463371 195740662 195805016 195719566
3388.8A95719566K37141J96018J17302l09067p52449J9341N56049k02656n72929j04637
$$ 195719566 195956707 196152725 196270027 195960960 195208511 195227852 195783901 195581245 195008316 194903679
3398.4A94903679K64053J18675k45189j92776J82133K13795j52932J49441M82044J01300
$$ 194903679 195167732 195286407 195041218 194848442 195030575 195244370 195091438 195240879 195722923 195824223
3408.1A95824223l9330K31590j23710n36595J5984N03387P33033n0679o45084j2131
$$ 195824223 195784893 196016483 195892773 195356178 195372162 195875549 196608582 196557903 195912819 195900688
3417.7A95900688K08912O79627M52594O2237K70214K8210J02138j5678K37293O24676
$$ 195900688 196109600 196789227 197241821 197304058 197574272 197602482 197704620 197688942 197926235 198550911
3427.4A98550911O16856L74965L0308J5125P7687O34250P21283K10056j37081J50090
$$ 198550911 199167767 199542732 199573040 199588165 199665852 200300102 201021385 201231441 201094360 201244450
3437B01244450M08496J39199M64000L82882L94878N42736N89504O55423K16655M50936
$$ 201244450 201652946 201792145 202256145 202639027 203033905 203576641 204166145 204821568 205038223 205489159
3446.7B05489159L85036K83146L38936P84321J136875J82476K77462O26888N73979
$$ 205489159 205874195 206157341 206496277 207280598 208417473 208599949 208877411 209504299 210078278
3455.3B10078278K42977M4327P08675Q04634P86858M47139L64914O08368N95322P16343
$$ 210078278 210321255 210365582 211074257 211878891 212665749 213112888 213477802 214086170 214681492 215397835
3465B15397835Q37974O08921j32255P97748J104317L31078R12017P65877K42939L52955
$$ 215397835 216235809 216844730 216712475 217510223 218614540 218945618 219857635 220623512 220866451 221219406
3474.6B21219406R91955J043453O25839P19433M49448M75597R57794R57890R37138
$$ 221219406 222211361 223254814 223880653 224600086 225049534 225525131 226482925 227440815 228377953
3483.3B28377953J392250N50403j60026P23762Q31108Q47931R94415J237507J004734
$$ 228377953 229770203 230320606 230160580 230884342 231715450 232563381 233557796 234795303 235800037
3492B35800037M63734M46014M50173J183891P51133L93315J230697J186066R50031
$$ 235800037 236263771 236709785 237159958 238343849 239094982 239488297 240718994 241905060 242855091
3500.7B42855091P69825P78980J069489J447754R10644L46985M97589Q33588J411457
$$ 242855091 243624916 244403896 245473385 246921139 247831783 248178768 248676357 249509945 250921402
3509.4B50921402R61323P96795R34868P37934J017608J553631J223908J60293Q45051
$$ 250921402 251882725 252679520 253614388 254352322 255369930 256923561 258147469 258307762 259152813
3518B59152813J301231J032067J382770J201153J011066Q83446J200333R96704J17302
$$ 259152813 260454044 261486111 262868881 264070034 265081100 265964546 267164879 268161583 268278885
3526.7B68278885M43249J691990J617584J251297J398315J060925J365165J547337
$$ 268278885 268722134 270414124 272031708 273283005 274681320 275742245 277107410 278654747
3534.4B78654747J622505Q40435M07620J481266J324329J836815J630898J167488J385860
$$ 278654747 280277252 281117687 281525307 283006573 284330902 286167717 287798615 288966103 290351963
3543.1B90351963J027222R10034R40151J649284P44458J532631K026729J428852K394848
$$ 290351963 291379185 292289219 293229370 294878654 295623112 297155743 299182472 300611324 303006172
3551.8C03006172J263199J146660J352405J643982J724949P59735J778698J953755
$$ 303006172 304269371 305416031 306768436 308412418 310137367 310897102 312675800 314629555
3559.5C14629555J998977J486607J846066J890640J355552K506028R43641K050858
$$ 314629555 316628532 318115139 319961205 321851845 323207397 325713425 326657066 328707924
3567.2C28707924J233292N51872L145714K324180J944695J625786J898498J673470
$$ 328707924 329941216 330493088 333638802 335962982 337907677 339533463 341431961 343105431
3574.9C43105431J906089K629395J467514K319870K052154J599885K102088K414856
$$ 343105431 345011520 347640915 349108429 351428299 353480453 355080338 357182426 359597282
3582.6C59597282K275734J575470L593064K032890q42094J327323J624299L310241
$$ 359597282 361873016 363448486 367041550 369074440 368232346 369559669 371183968 374494209
3590.4C74494209L027268L212089K329216J123925L199310J503372K535172L378067
$$ 374494209 377521477 380733566 383062782 384186707 387386017 388889389 391424561 394802628
3598.1C94802628J335525L099556J968651J408768L262939K779236K422562K615890
$$ 394802628 396138153 399237709 401206360 402615128 405878067 408657303 411079865 413695755
3605.8D13695755K986679J439972L569527J447181J51368O052894K286911O27747M414978
$$ 413695755 416682434 418122406 421691933 423139114 423290482 429343376 431630287 432258034 436673012
3614.5D36673012O90803L747216L753204J581345K571754J032600K484436L671952
$$ 436673012 437363815 441111031 444864235 446445580 449017334 450049934 452534370 456206322
3622.2D56206322L928909L299751L246079K663612K445069M943275J148148l295784
$$ 456206322 460135231 463434982 466681061 469344673 471789742 476733017 477881165 474585381
3629.9D74585381M055481N391387O296158L529091P0534K965469M452629L759652J977233
$$ 474585381 478640862 484032249 490328407 493857498 493928032 496893501 501346130 505105782 507083015
3638.6E07083015J722107K820015L278466K838630K358818L543015M560432N333748
$$ 507083015 508805122 511625137 514903603 517742233 520101051 523644066 528204498 533538246
3646.3E33538246P19071j511956O114350K797737j795883J259575O295166N532264
$$ 533538246 534257317 532745361 538859711 541657448 539861565 541121140 547416306 552948570
3654E52948570M123841N014610m686012K387313O345597K422790K368737J349487K517433
$$ 552948570 557072411 562087021 557401009 559788322 566133919 568556709 570925446 572274933 574792366
3662.7E74792366J873398K406006L156318J440583M564018J968460j021843J997490
$$ 574792366 576665764 579071770 582228088 583668671 588232689 590201149 589179306 591176796
3670.4E91176796l117294L335800P700729Q974571J720467j6751289K485656Q327027
$$ 591176796 588059502 591395302 599096031 608070602 609791069 593039780 595525436 603852463
3678.1F03852463M753494j419907J214066L572044K634125J515122J061172J817856
$$ 603852463 608605957 607186050 608400116 611972160 614606285 616121407 617182579 619000435
3685.8F19000435M453125N929184r483490l360710Q952522l630028k59094N478706
$$ 619000435 623453560 629382744 619899254 616538544 625491066 621861038 621601944 627080650
3693.5F27080650J218109J202279M31480N20401J905823J62658K280007L293800m144592
$$ 627080650 628298759 629501038 629932518 630452919 632358742 632521400 634801407 638095207 633950615
3702.2F33950615j478272M334374J771812M12178M94652K505074L010483o039391L979759
$$ 633950615 632472343 636806717 638578529 638990707 639485359 641990433 645000916 638961525 642941284
3710.9F42941284M161606j0968857M580078M481888O8970O07986K022934J539231k490845
$$ 642941284 647102890 636134033 640714111 645195999 645264969 645872955 647895889 649435120 646944275
3719.6F46944275Q09784M679947k743378l468552M526596J581421j024322k239533
$$ 646944275 647754059 652434006 649690628 646222076 650748672 652330093 651305771 649066238
3727.3F49066238J051255L508682M51813M733734j030655o529541O689834q52966o824722
$$ 649066238 650117493 653626175 654077988 658811722 657781067 651251526 657941360 657088394 650263672
3736F50263672K131500J353684N20248L212967L292313l060074K865829R508972j2038345
$$ 650263672 652395172 653748856 654269104 657482071 660774384 657714310 660580139 670089111 658050766
3744.7F58050766j1553421R203873M915619O279754k300873j0359726R037552m667205
$$ 658050766 646497345 655701218 660616837 666896591 664595718 654235992 663273544 658606339
3752.4F58606339n752564O290131M941940L320923n071488J775895N115127p574234
$$ 658606339 652853775 659143906 664085846 667406769 662335281 664111176 669226303 661652069
3760.1F61652069j373215M420472J838378P47300L146438k216491m635926K457428
$$ 661652069 660278854 664699326 666537704 667285004 670431442 668214951 663579025 666036453
3767.8F66036453L965607m99039o848221L367997L543319j07193O77796m96598L40958
$$ 666036453 670002060 669503021 662654800 666022797 669566116 669458923 670136719 669640121 669981079
3776.5F69981079M1275K652359j16119p282639K922287K897568J163711J143036k976989
$$ 669981079 670022354 672674713 672558594 665275955 668198242 671095810 672259521 673402557 670425568
3785.2F70425568j15662J253815P71408N71975m24575M55017L11279J21613l82920
$$ 670425568 670309906 671563721 672335129 672907104 672482529 672937546 673248825 673370438 672987518
3793.8F72987518R57337K454376l275909l293000J832733L407517M338989o514587
$$ 672987518 673944855 676399231 673123322 669830322 671663055 675070572 679409561 672894974
3801.5F72894974q391724M167709K929001M188614N073166q796615l985596N139618
$$ 672894974 664503250 668670959 671599960 675788574 680861740 672065125 668079529 673219147
3809.3F73219147K370147J69373Q1711j3046J290969M476166k419510j1775207M803009
$$ 673219147 675589294 675758667 675840378 675827332 677118301 681594467 679174957 667399750 672202759
3817.9F72202759M814606L105773L02811j5416260K524186O164932K674103K353820
$$ 672202759 677017365 680123138 680425949 665009689 667533875 673698807 676372910 678726730
3825.7F78726730n71365l449783R28573J680069K264481J382675p272797J993332O486817
$$ 678726730 678155365 674705582 675634155 677314224 679578705 680961380 673688583 675681915 682168732
3834.3F82168732n010529q77991O548386p995300m748459O822662k701034L72238N424881
$$ 682168732 677158203 676280212 682828598 674833298 670084839 676907501 674206467 674578705 680003586
3843F80003586l184052k626495L074570J047744j31683J359863n59845K034760M120712
$$ 680003586 676819534 674193039 677267609 678315353 678183670 679543533 678983688 681018448 685139160
3851.7F85139160o406479J094284j2187500R18122R108658j188431j496811J945495
$$ 685139160 678732681 679826965 667639465 668557587 677666245 676477814 674981003 676926498
3859.4F76926498K175827K557526m238968L39508N165787o048279m299164M325333
$$ 676926498 679102325 681659851 677420883 677760391 682926178 676877899 672578735 676904068
3867.1F76904068M960327N188522q199386q183136M062881N013962K823258p498780
$$ 676904068 681864395 687052917 678853531 670670395 674733276 679747238 682570496 675071716
3874.8F75071716R82666L308335j86386K171630K598801n591125n648499N436859J246262
$$ 675071716 676054382 679362717 679176331 681347961 683946762 678355637 672707138 678143997 679390259
3883.5F79390259J098938L992004j0441818K443619K976608p32346L226395j696701
$$ 679390259 680489197 684481201 674039383 676483002 679459610 678727264 681953659 680256958
3891.2F80256958o237335J793365L784027r05609L32947N67551J222534J261444q030624
$$ 680256958 674019623 675812988 679597015 678691406 679024353 679591904 680814438 682075882 674045258
3899.9F74045258M608306J263581m797516N470276k575150j705017Q41751R63211J561737
$$ 674045258 678653564 679917145 675119629 680589905 678014755 676309738 677151489 678114700 679676437
3908.6F79676437n08422P11135n8746P0038J39007o46438Q13522J294022l173523k836838
$$ 679676437 679168015 679879150 679820404 679890442 680029449 679383011 680196533 681490555 678317032 675480194
3918.2F75480194L941574M0589l290787K054367J430588j77689j802368j359787J152191
$$ 675480194 679421768 679462357 676171570 678225937 679656525 679478836 677676468 676316681 677468872
3926.9F77468872P32575R71756m92707p03201J464844j934357j144180J670990J40838
$$ 677468872 678201447 679173203 678680496 677977295 679442139 677507782 676363602 678034592 678175430
3935.6F78175430K52838k62832p87964j6937l510J359253P13196l047867n12543J526795
$$ 678175430 678428268 678165436 677377472 677360535 677357025 678716278 679429474 676381607 675869064 677395859
3945.2F77395859O77948L51715j848984N26581J221084j661453N88150K2354l80706
$$ 677395859 678073807 678425522 676576538 677103119 678324203 676662750 677250900 677273254 676892548
3953.9F76892548L81546K39715M45328j30005M49905p06024J7624L17307r96933Q20999
$$ 676892548 677274094 677513809 677959137 677829132 678279037 677573013 677590637 677907944 676911011 677732010
3963.6F77732010N28107J60522k06604r48868j14593K08282k28958J61972R44443j70365
$$ 677732010 678260117 678420639 678214035 677265167 677150574 677358856 677129898 677291870 678236313 678065948
3973.2F78065948l82461p7286p31430m84772N14985R06753L16849J77917l51562m36402
$$ 678065948 677683487 677606201 676874771 676389999 676904984 677811737 678128586 678306503 677954941 677518539
3982.8F77518539k68631k21481J84097J55640m2419n66483O02570N02472r92356j9302
$$ 677518539 677249908 677028427 677212524 677368164 677325745 676759262 677361832 677864304 676871948 676852646
3992.5F76852646O25992K64129l47213Q6364P47681K26517n92194o55441
$$ 676852646 677478638 677742767 677395554 677481918 678229599 678456116 677863922 677208481
4000.2F77208481
$$ 677208481
##END=$$ End of the data block
