##TITLE=$$ Begin of the data block
##JCAMP-DX=5.00 $$ ACD/SpecManager v 10.08
##SPECTROMETER/DATA SYSTEM=Varian
##DATE=14 Jan 2013 10:02:08
##DATA TYPE=INFRARED SPECTRUM
##DATA CLASS=XYDATA
##ORIGIN=
##OWNER=
##NPOINTS=3735
##FIRSTX=399.26403809
##LASTX=4000.35498047
##MAXX=4000.35498047
##MINX=399.26403809
##MAXY=70.69432068
##MINY=19.90925217
##XFACTOR=1.0000000000
##YFACTOR=0.000000100000000
##FIRSTY=43.16452026
##DELTAX=0.96440572
##XUNITS=1/CM
##YUNITS=TRANSMITTANCE
##XYDATA=(X++(Y..Y))
399.3D31645203j18943j6342888m855804O069069m24843r627800Q00476N848694J747170
407.9D14740334l720055k656021j171684j167374R93614M38042L542175N66826k2926
416.6D11542931J529159J102715r293480m781533J0643540N5275p434273J635742K920571
425.3D07920647m9630n120468K658654J897659j462822M1695j316262J998062N76630
434D07144165L215332L012581M00848k083473n206413J008758n92918k650146K36969
442.7D04485703j375313J235046J966972J100388J841812o4926m015274j326523K660179
451.3D06508064q38470j997605K164917J695862q44803m455719n591316M192085j68228
460D00664787j046180K90412o239128k311897J824532K467460K012711j534386k887344
$$ plain form
399.3 431645203 431526260 415183372 410327568 416396637 415971794 406343994 407144470 412993164 414740334
407.9 414740334 411020279 408364258 407192574 406025200 407018814 407456856 410999031 411565857 411542931
416.6 411542931 413072090 414174805 404881325 400099792 410743332 410798607 403364334 405000076 407920647
425.3 407920647 407871017 402750549 405409203 407306862 405844040 405885735 404569473 406567535 407144165
434 407144165 410359497 413372078 413772926 411689453 406483040 407491798 406898880 404248734 404485703
442.7 404485703 403110390 404345436 406312408 407412796 409254608 409189682 405174408 403847885 406508064
451.3 406508064 405669594 403671989 405836906 407532768 406687965 402232246 396640930 400833015 400664787
460 400664787 399618607 399909019 393669891 391357994 393182526 395649986 397662697 396128311 393240967
468.7C93240967r80644K921829K904358m160996n231132M795532M98505o458779Q51555
477.4C88381195J346779N83725R81789J595077J958885l574333m898415j235771L595124
486.1C88734055K779121j236572k379227l200188L52860K485046J243172j069260k669906
494.7C85039101k095566j802254O3706L441391L850097p13196m152450l200112n26695
503.4C79904022M1275P81174J35422k071343N77660J874733J55258n80902j048470
512.1C79768829k88162m64744j922226j057434M14123k71835j231194j521416k78778
520.8C73147163J550370Q44268k242088l222046J97869K867393P97463k54784j141472
529.5C72544136k372208p35321J816750K199135J78718k474441j449471j8310j76888
$$ plain form
468.7 393240967 392260323 395182152 398086510 393925514 388694382 393489914 393988419 387529640 388381195
477.4 388381195 389727974 390311699 391293488 392888565 394847450 391273117 386374702 385138931 388734055
486.1 388734055 391513176 390276604 387897377 384697189 385050049 387535095 388778267 387709007 385039101
494.7 385039101 382943535 381141281 381204987 384646378 388496475 387783279 383630829 380430717 379904022
503.4 379904022 379945297 380726471 380861893 378790550 379368210 381242943 381398201 380817299 379768829
512.1 379768829 379480667 379015923 377093697 376036263 376450386 376178551 374947357 373425941 373147163
520.8 373147163 374697533 375541801 373299713 370077667 370275536 373142929 373940392 373685608 372544136
529.5 372544136 370171928 369436607 371253357 373452492 373631210 371156769 369707298 369688988 369512100
538.1C69512100k52838p77893J65291j60141n15213k58560j310120j606369j965332
546.8C62830925j025047l71514l20244P43752N61981j2474n12924k127342j645203
555.5C58121910L43933j685180j250039J506462R64165P07360O62918P79304j60751
564.2C59990082r03549l72582j61285k41776l35998l929l15323J218147J673508M34570
573.8C60981865r37805j720772m89426j190719N4130M62456n58243O11763M86145P76711
583.5C58476105k28691Q48503J221466j223068j494942k43950J681519r6627O00662
592.1C59540977K670098J61896O7024O53267M48494M3220j200867k363433j485520
600.8C58535156N33867N44357K11335N96428Q86421q04367j472626q50258j315918
$$ plain form
538.1 369512100 369259262 368481369 368646660 368486519 367971306 367712746 366402626 364796257 362830925
546.8 362830925 361805878 361434364 361114120 361857872 362419853 362407379 361894455 359767113 358121910
555.5 358121910 358465843 356780663 355530624 357037086 358001251 358708611 359371529 360150833 359990082
564.2 359990082 359086533 358713951 358552666 358310890 357974892 357970963 357655640 358873787 360547295 360981865
573.8 360981865 360044060 358323288 357833862 356643143 356697273 357159729 356601486 357213249 357699394 358476105
583.5 358476105 358247414 359095917 360317383 359094315 357599373 357355423 359036942 358940315 359540977
592.1 359540977 362211075 362372971 362439995 363093262 363541756 363584976 362384109 360020676 358535156
600.8 358535156 359069023 359613380 359824715 360421143 361307564 360503197 359030571 358180313 356864395
609.5C56864395j198501j482850o53877J99738L63044Q41713L34244j88713j11694
618.2C54967499j03646o88629J24665P94983K31590M91180J144219J438522M67300
626.9C58867683Q67463J913375R70498M71763P21131J048355K105941J419564J12762
635.5C68498535J428757K336273J822395J161957J011086J029129N16548J41640N50575
644.2C78496895J743393K338562J999435R18503P63664J032219L53089K24380k518
652.9C87867622M79737L56636n05333M44298P40394j46484o91757l41530J76468m47464
662.5C87932587j422997o43120Q54149J67847j604881k263031L293266K199173P92389
671.2C89305382J414184J424027P15484L09525L4294J007576O62003K024765K999992
$$ plain form
609.5 356864395 355665894 354183044 353529167 353728905 354091949 354933662 355267906 355079193 354967499
618.2 354967499 354863853 354175224 354299889 355094872 355326462 355817642 356961861 358400383 358867683
626.9 358867683 359735146 361648521 362619019 363090782 363811913 364860268 366966209 368385773 368498535
635.5 368498535 369927292 372263565 374085960 375247917 376259003 377288132 377804680 377946320 378496895
644.2 378496895 380240288 382578850 384578285 385496788 386260452 387292671 387645760 387870140 387867622
652.9 387867622 388347359 388703995 388198662 388642960 389383354 389236870 388545113 388203583 388380051 387932587
662.5 387932587 386509590 385866470 386720619 386888466 385283585 383020554 386313820 388512993 389305382
671.2 389305382 390719566 392143593 392859077 393168602 393202896 394210472 394872475 396897240 399897232
679.9C99897232J369438P39861p1640N54580Q13065R53636J853066J350822J981545
688.6D09441605J423797k16217j24054Q23670J152725N76172N39093l4561L31688J251792
698.2D15165710J284752P56379j00556M44679L58277M32358O26907O01158R39827J03645
707.9D20613136P72248J248588J589432K133980J065292N37834l06053m85496n0202
716.6D27118759M44756J020279J272659J249161M40559J140175J194763k5482l6469
725.2D33819160Q35228J109887Q65364J122894Q83522J668167J736527R57832J154633
733.9D44153214N39588J29624k52533j88065J09749O95801J040535N88341P41615J074982
743.6D48632851J526107Q24585O1264m67758J93558Q82645K64053J828156J663436
$$ plain form
679.9 399897232 401266670 402006531 401934891 402489471 403302536 404256172 406109238 407460060 409441605
688.6 409441605 410865402 410649185 410525131 411348801 412501526 413077698 413616791 413582230 413913918 415165710
698.2 415165710 416450462 417206841 417106285 417550964 417909241 418341599 418968506 419569664 420509491 420613136
707.9 420613136 421385384 422633972 424223404 426357384 427422676 427960510 427654457 427168961 427118759
716.6 427118759 427563515 428583794 429856453 431105614 431546173 432686348 433881111 433855629 433819160
725.2 433819160 434654388 435764275 436629639 437752533 438636055 440304222 442040749 442998581 444153214
733.9 444153214 444692802 444822426 444569893 444381828 444491577 445187378 446227913 446816254 447557869 448632851
743.6 448632851 450158958 450983543 451044807 450577049 450770607 451653252 451917305 453745461 455408897
752.2D55408897L31955m9591P43752K319031J461715J021881Q66661J511765J344719
760.9D64960785M50935R31206O83556J795921J494446N55305M70543p51991n87616
769.6D70003090P34291P25975l86581j0071N96733M80232n67551m63447O04210m01192
779.2D71315689l01933L92341J032944R42650J60980J70784K40593J004219P41844
787.9D75700111j11045n16358L10822K07405K39601J363411p28684q46443K71874J2893
797.6D75903587n96237j684379j236878j135750q92868p28073q55827r28192q62427
806.2D66982956p27539j403961j932755k341499j956635j977157j444702n75448q78334
814.9D53744926o94046l70140q19282j808357n44777N42946J44042O18897J078758
$$ plain form
752.2 455408897 455740852 455691261 456435013 458754044 460215759 461237640 462104301 463616066 464960785
760.9 464960785 465411720 466342926 467026482 468822403 470316849 470872154 471342697 470590706 470003090
769.6 470003090 470737381 471463356 471076775 471066704 471663437 472143669 471576118 471112671 471716881 471315689
779.2 471315689 471013756 471406097 472439041 473381691 473542671 473713455 473954048 474958267 475700111
787.9 475700111 475589066 475072708 475383530 475590935 475830536 477193947 476465263 475618820 475890694 475903587
797.6 475903587 475307350 473622971 472386093 471250343 470357475 469629402 468773575 467845383 466982956
806.2 466982956 466255417 464851456 462918701 460577202 458620567 456643410 455198708 454623260 453744926
814.9 453744926 453050880 452680740 451861458 450053101 449508324 450051270 450195312 450814209 451892967
823.6D51892967J973534K156525K397499K904396L465385L363113J907311J915550
831.3D71976280K433434L512420K666283J809845K382011K380982L488235K555085
839D93204575K118034J705284R82590J154098J078949J092606J36070J163292J523857
847.7E04159355K476692J888047l90244J398697J906509J275139P33719J574402J410866
856.4E16433182J011390K595826J540908Q69484J027413J007538n40200o20956o0158
865.1E23264427l62778M15917j231537n71899r16672l153877l043175j560097q25577
873.8E12014732k978439k987556k008095m07372K94495l82K78206l99971N28984n48172
883.4E03786430j287117m24690p362J46446o08788o95991j174278M1389J84021k2850
$$ plain form
823.6 451892967 453866501 456023026 458420525 461324921 464790306 468153419 470060730 471976280
831.3 471976280 474409714 477922134 480588417 482398262 484780273 487161255 490649490 493204575
839 493204575 495322609 497027893 498010483 499164581 500243530 501336136 501472206 502635498 504159355
847.7 504159355 506636047 508524094 508133850 509532547 511439056 512714195 513447914 515022316 516433182
856.4 516433182 517444572 520040398 521581306 522450790 523478203 524485741 523945541 523324585 523264427
865.1 523264427 522901649 523317566 522086029 521514130 520597458 517443581 514400406 512840309 512014732
873.8 512014732 509036293 506048737 504040642 503633270 503927765 503927383 504205589 503805618 504334602 503786430
883.4 503786430 502499313 502074623 502067261 502213707 501604919 500908928 499734650 499776039 499960060 499937210
893D99937210Q41866K16446N7373k40059M22516M82025K81524j03073k72064K61307
902.7E01885071l6164J066933J063500K099609L189239K404480J976548J180496J612434
911.4E16442146N94826m04091m20608p67403j811333k117195j854286l029823k384568
920E04247665k642593k528763k423172l347511k979126l660240l782730l570443l419380
928.7D75893707l743438l223076k578507k463302j426430j314964o02951j177216j630898
937.4D57732925j519470k072372q35724o11343n49012q52890j036377n39589l71475
946.1D49344673l83034j195640m65431k05384M7951L02086j43471m10003j693841j170501
955.7D44027405j088600k085038k324447k011605j838226k075310k019348k820053
$$ plain form
893 499937210 500779076 500995522 501052895 500812836 501235352 501717377 501998901 501895828 501623764 501885071
902.7 501885071 501848907 502915840 503979340 506078949 509268188 511672668 513649216 514829712 516442146
911.4 516442146 517036972 516632881 516212273 515444870 513633537 511516342 509662056 506632233 504247665
920 504247665 501605072 499076309 496653137 493305626 490326500 486666260 482883530 479313087 475893707
928.7 475893707 472150269 468927193 466348686 463885384 462458954 461143990 460541039 459363823 457732925
937.4 457732925 456213455 454141083 453305359 452694016 452145004 451292114 450255737 449716148 449344673
946.1 449344673 448961639 447765999 447300568 447095184 447143135 447445221 447301750 446891747 445197906 444027405
955.7 444027405 442938805 440853767 438529320 436517715 434679489 432604179 430584831 427764778
963.4D27764778k003403j633529k330017j503334j477394k093735k183647j614609
971.2D12925110k465286l205262k542152k786636l421822l998833l962135m132385
978.9C86410599m186173m177131n263939n517121n059852m822808m395294m597931
986.6C48390350m635276m434891m333191m026795l912162l371735l524857l736724
994.3C16414719l508110l294163l066521k933292k791558l202877l135776l423157
1002B91059265k643146k118683k519341j681385j798401j774921k086086j669789k000408
1010.7B72767105k433300j585102k356453j550236j557312j971302k619877k949867
1018.4B55743656j855316k059498j580467k483063j974239j647167j485024q01258
$$ plain form
963.4 427764778 425761375 424127846 421797829 420294495 418817101 416723366 414539719 412925110
971.2 412925110 410459824 407254562 404712410 401925774 398503952 394505119 390542984 386410599
978.9 386410599 382224426 378047295 372783356 367266235 362206383 357383575 352988281 348390350
986.6 348390350 343755074 339320183 334986992 330960197 327048035 323676300 320151443 316414719
994.3 316414719 312906609 309612446 306545925 303612633 300821075 297618198 294482422 291059265
1002 291059265 288416119 286297436 283778095 282096710 280298309 278523388 276437302 274767513 272767105
1010.7 272767105 270333805 268748703 266392250 264842014 263284702 261313400 258693523 255743656
1018.4 255743656 253888340 251828842 250248375 247765312 245791073 244143906 242658882 241857624
1026.1B41857624k403450j154690p15923r86366r12476k91786j39561j046295p0343
1034.8B34136734J6766J118316R86252J357498K079811J525879J646710J406326J943588
1043.5B46217880p2212r4986K52438q42953m36955j366272j338119j343594k89325
1052.2B40685902o71959j211644j181697j602764l73898j488075k02923R03530J327553
1060.9B36184025J541538P30705J852341K298317L113728J178131Q05034R66416L21121
1069.5B48991356J542663P70550M14047O5594J157112K59915m75827J033516P23992
1078.2B54482918P52907p0496Q51288J020622J483688J155262J84613J993065J134281
1086.9B62988148R60312Q37173J959705K391262J064358J981793J286525J175805J244850
$$ plain form
1026.1 241857624 239454174 238299484 237583561 236597195 235684719 235392933 235253372 234207077 234136734
1034.8 234136734 234153500 235271816 236258068 237615566 239695377 241221256 242867966 244274292 246217880
1043.5 246217880 246145668 246050682 246303120 245460167 245023212 243656940 242318821 240975227 240685902
1052.2 240685902 240013943 238802299 237620602 236017838 235643940 234155865 233952942 234856472 236184025
1060.9 236184025 237725563 238456268 240308609 242606926 245720654 246898785 247703819 248670235 248991356
1069.5 248991356 250534019 251304569 251718616 251784210 252941322 253201237 252725410 253758926 254482918
1078.2 254482918 255235825 255165329 256016617 257037239 258520927 259676189 259860802 261853867 262988148
1086.9 262988148 263948460 264785633 266745338 269136600 270200958 272182751 273469276 274645081 275889931
1095.6B75889931J292267J140155J868344K456188J147289J700154J120948J254845
1103.3B87870121K329426J753540P90520J155891J570320K89402O53401J036586J050167
1112B98499374N37968P44305J817989J133118N87063L8662R07077N05028m47655J48564
1121.6C04471493l02792Q6689M39873Q93955R59149J018047J601467J849346J819191
1130.3C12836418J629067K377033K156925K439003K552147K124939K477951K599869
1138C31193352K564735K114868J920472J006011Q31376J317672J343880J052589N22309
1146.7C43867264O81839N91507J067428K39106m64707j63612n68352J49727m05121
1155.4C44995079n57556m30412o78673J1864r01146r86863p51686m47769N74265J173515
$$ plain form
1095.6 275889931 277182198 278322353 280190697 282646885 283794174 285494328 286615276 287870121
1103.3 287870121 290199547 291953087 292743607 293899498 295469818 295759220 296412621 297449207 298499374
1112 298499374 299037342 299781647 301599636 302732754 303319817 303358479 304265556 304770584 304322929 304471493
1121.6 304471493 304168701 304255390 304695263 305589218 306548367 307566414 309167881 311017227 312836418
1130.3 312836418 314465485 316842518 318999443 321438446 323990593 326115532 328593483 331193352
1138 331193352 333758087 335872955 337793427 338799438 339630814 340948486 342292366 343344955 343867264
1146.7 343867264 344549103 345140610 346208038 346447144 345982437 345818825 345250473 345400200 344995079
1155.4 344995079 344437523 344007111 343328438 343340302 342439156 341452293 340700607 340252838 340827103 342000618
1165C42000618J889801K124748K342453K192116K748032L527526L226433K802201L047599
1173.7C65901527K869149K914962L849640L533402K696037K569161K820816K206306
1181.4C89361000K101250K299042J698188J324158J322517J456871R75419J004791
1189.1D01543236N21927j19515k6970j78146l56293n17921n59731j155052j105919
1197.8C98045616q14209q95042j635971k145844j064415j051712j242027j014519n60837
1206.5C87621040l22952j007233m49676k67067n20325m74052n88684n06592p67937
1215.1C82716522o06613m71840k06032l77769n70107P9956k13394q95385j161919p29408
1224.8C77564011p63665r58366q18367j205483o27212k83508m59328m03671n50385
$$ plain form
1165 342000618 343890419 346015167 348357620 350549736 353297768 356825294 360051727 362853928 365901527
1173.7 365901527 368770676 371685638 375535278 379068680 381764717 384333878 387154694 389361000
1181.4 389361000 391462250 393761292 395459480 396783638 398106155 399563026 400538445 401543236
1189.1 401543236 402065163 401945648 401918678 401740532 401384239 400866318 400306587 399151535 398045616
1197.8 398045616 397231407 396336365 394700394 392554550 391490135 390438423 389196396 388181877 387621040
1206.5 387621040 387298088 386290855 385841179 385574112 385053787 384579735 383991051 383484459 382716522
1215.1 382716522 382109909 381638069 381432037 381054268 380484161 380564117 380350723 379455338 378293419 377564011
1224.8 377564011 376800346 375841980 375023613 373818130 373190918 372907410 372448082 372044411 371494026
1233.5C71494026p92541r92623n27878p05184n23568J12114m3297k02140j78490L52898
1243.1C67993317l22991q59642l42941n98946r94377q67348j15623j71928q6480L77655
1252.8C64010696K03743J58348l11927o51474n84793k16103l2043R5558K26516L6927
1262.4C62935448M59861O66237P49779O40640O34880P60918O25725Q71162Q07038L88107
1272C69539795L05824J044579J578483J607323J144028R36737J158867Q05359Q65783
1280.7C78986778N12924P24450J496963J821251J909294J432152J520538J650200J812744
1289.4C91867294J238671R59434Q24585o4430N03006J255913R69200L62701O00357
1298.1C98516731Q72689P36732M26674k9678k16332m04282J9837j72958j09826P0458
$$ plain form
1233.5 371494026 370701485 369708862 369180984 368475800 367952232 368064346 368021049 367818909 367640419 367993317
1243.1 367993317 367670326 366810684 366467743 365868797 364874420 364007072 363891449 363719521 363633041 364010696
1252.8 364010696 364214439 364372787 364060860 363409386 362824593 362608490 362576447 362672005 362898521 362935448
1262.4 362935448 363395309 364061546 364811325 365451965 366086845 366847763 367473488 368344650 369151688 369539795
1272 369539795 369845619 370890198 372468681 374076004 375220032 376156769 377315636 378120995 378986778
1280.7 378986778 379499702 380224152 381721115 383542366 385451660 386883812 388404350 390054550 391867294
1289.4 391867294 393105965 394065399 394889984 394825554 395328560 396584473 397553673 397916374 398516731
1298.1 398516731 399389420 400126152 400552826 400523148 400306816 399902534 399922371 399749413 399639587 399710045
1307.7C99710045n18608p80754o56205l08837r99222j096001o31523j55602N7259m22401
1317.4C94198151K40135P15675J251831R48258M03557P64770O91872O80504K44636
1326D00139389O01234M68445J56441o4354p87620l10326l81699l45268n33218o34880
1335.7C98308144j70746j61247J99966K6779M99115J012230R41277O99806P93915R61418
1345.3D03110657M16794N84678M69589O80733m3831k84233K82555m85115o39305q28286
1355D03264236o43768n01480J6403j93634p20825k25182n23948k66075q47397k50168
1364.6C99108162k38571q43086m17099p93915k37732o92215p92847n24292p48596r8839
1374.3C93720970J46370O06079j94893m58946p61490n08575k0714j000710j196556
$$ plain form
1307.7 399710045 399191437 398410683 397754478 397445641 396446419 395350418 394718895 394563293 394620552 394198151
1317.4 394198151 394438286 395153961 396405792 397354050 397757607 398522377 399214249 399894753 400139389
1326 400139389 400740623 401209068 401365509 401301155 400513535 400203209 399821510 399476242 398943024 398308144
1335.7 398308144 398137398 397976151 398176117 398202896 398702011 399714241 400655518 401355324 402149239 403110657
1345.3 403110657 403527451 404112129 404581718 405262451 405218620 404934387 405216942 404731827 404092522 403264236
1355 403264236 402620468 402118988 402135391 401941757 401220932 400995750 400471802 400205727 399358330 399108162
1364.6 399108162 398869591 398026505 397609406 396815491 396577759 395885544 395092697 394568405 393819809 393720970
1374.3 393720970 393867340 394473419 394278526 393819580 393058090 392549515 392528801 391528091 390331535
1382.9C90331535j732711j571694j243935q31069j464234k097206j358833j991883
1390.7C78039970j880111k139893j724129j957359l418541j732635j800194j960831
1398.4C61426277l091087k501526j489372k363205k172814k130317k502518k032356
1406.1C43143082j418686j636467j851120j294174j952553j495743j172905j516457
1413.8C30804977j192779j492348j143570j022758m38195j435203j77498J028900j35917
1422.5C24795609J73912O0043O52275N82581N21392J162148M64210J412926R01299
1431.2C30726395J614189J830826J580886J799088P54051K466774J805420K167168
1438.9C44744797J675834J706276K211380J482163K203903J901321K460633J503982
$$ plain form
1382.9 390331535 388598824 387027130 385783195 384952126 383487892 381390686 380031853 378039970
1390.7 378039970 376159859 374019966 372295837 370338478 366919937 365187302 363387108 361426277
1398.4 361426277 358335190 355833664 354344292 351981087 349808273 347677956 345175438 343143082
1406.1 343143082 341724396 340087929 338236809 336942635 334990082 333494339 332321434 330804977
1413.8 330804977 329612198 328119850 326976280 325953522 325515327 324080124 323902626 324931526 324795609
1422.5 324795609 324969521 325029564 325681839 326264420 326785812 327947960 328412170 329825096 330726395
1431.2 330726395 332340584 334171410 335752296 337551384 338305435 340772209 342577629 344744797
1438.9 344744797 346420631 348126907 350338287 351820450 354024353 355925674 358386307 359890289
1446.6C59890289J175042J199913J093864J790695Q26378J794395J147156J366959
1454.3C70284691J350746R89685K117958Q99239L983993J591072K137299J463127J360626
1463C86178436K354355J592636L175049J503792K836151K896805K586326K953721J362457
1471.7D07439728K684555L248215M086799K675934L315544L492546K468949K715492
1479.4D32127762J767349J910477J871452K164269J763687J147155J412049J173248
1487.1D45337448J563301O33812m26292J237831J507873O35949n24292o42815m24004
1495.8D48898811k925644m65240p81670k054138l21236p23114j148223r89876l87192
1504.5D39102478j404724m538574j122094J447068J195030L90739R07517m11148j053887
$$ plain form
1446.6 359890289 361065331 362265244 363359108 365149803 365976181 367770576 368917732 370284691
1454.3 370284691 371635437 372625122 374743080 375642319 379626312 381217384 383354683 384817810 386178436
1463 386178436 388532791 390125427 393300476 394804268 397640419 400537224 403123550 406077271 407439728
1471.7 407439728 410124283 413372498 417459297 420135231 423450775 426943321 429412270 432127762
1479.4 432127762 433895111 435805588 437677040 439841309 441604996 442752151 444164200 445337448
1487.1 445337448 446900749 447534561 447108269 448346100 449853973 450489922 449965630 449322815 448898811
1495.8 448898811 445973167 445507927 444726257 442672119 442350883 441627769 440479546 439489670 439102478
1504.5 439102478 437697754 433159180 432037086 433484154 434679184 435069923 435977440 435566292 434512405
1513.1D34512405j24664q91685j189919j783066R8267J249504P69882q32596o53648
1521.8D31154480J077270P73964N87693Q4343J169319O03142Q44688J255760Q26378
1530.5D38377037N01099R3002M74701l17459J268883O04057k80113l5553k959977J506501
1540.1D39232178J488418Q65631K79122Q28934R22660k82707R44100j55259o4964o75278
1549.8D43382835j90620Q66165J97029J002159j680221J1139N03311l65143k835922
1558.5D40890732m736405J566582j838684L70827j086121j491279k501526k679825
1566.2D28494301j683617l022651j706543o940613k109223k305870l589897l013840
1573.9D04122047l621788j748314j0642471j598625l244209m491425m429741n842438
$$ plain form
1513.1 434512405 434387741 433496056 432306137 430523071 430621338 431870842 432640724 431808128 431154480
1521.8 431154480 432231750 433005714 433593407 433677750 434847069 435450211 436294899 437550659 438377037
1530.5 438377037 438878136 438971138 439445839 439128380 440397263 441001320 440721207 440685654 437725677 439232178
1540.1 439232178 440720596 441586227 441865349 442694283 443616943 443334236 444278336 444123077 444058113 443382835
1549.8 443382835 443192215 444058380 444255409 445257568 443577347 443588486 444091797 443726654 440890732
1558.5 440890732 436154327 437720909 435882225 436253052 435166931 433675652 431174126 428494301
1566.2 428494301 426810684 423788033 422081490 415140877 413031654 410725784 407135887 404122047
1573.9 404122047 400500259 398751945 388109474 386510849 383266640 378775215 374345474 368503036
1581.6C68503036l702392o017113l665123m948997m134598l938904n303688l674774
1589.3C33117447n810623k960816n246639l902454m364415m503822k660141n134716
1597B98533821k232799m502068k361298l549747l170719k386017m312477r18560l539410
1605.7B71560726q51478k736741j515522j042423k884960k54135k767143J92108j919747
1614.4B57780685N5047o11268m268703K269325j220474J317883j247311P91588m17347
1623.1B54449425q81291J921997m17709K278957r07955J809578M85287N68352J183071
1631.7B60489712L23543K728920o48327J666089K250K996712K016544J396027K635021
1640.4B73606491J27716K389755P50313K744789J709404m34303L252239L79124M279861
$$ plain form
1581.6 368503036 364800644 358783531 355118408 350169411 346034813 342095909 336792221 333117447
1589.3 333117447 327306824 324346008 319099369 315196915 310832500 306328678 303668537 298533821
1597 298533821 296301022 291798954 289437656 285887909 282717190 280331173 276018696 275100136 271560726
1605.7 271560726 270709248 267972507 266456985 265414562 262529602 262275467 259508324 259700432 257780685
1614.4 257780685 257835732 257224464 252955761 255225086 254004612 255322495 254075184 254866772 254449425
1623.1 254449425 253568134 255490131 255072422 257351379 256443424 258253002 258738289 259306641 260489712
1631.7 260489712 260813255 263542175 262893848 264559937 264562187 267558899 269575443 270971470 273606491
1640.4 273606491 273734207 276123962 276874275 279619064 281328468 280894165 284146404 284525528 288805389
1649.1B88805389Q50277K722168J546707k235641L626633J655960M384994J198921
1656.8C02555408K783490J464290K343121K743835K092667L414860J253986M070740
1664.5C22722397K313766L267174K640686J925774L469047K006264N379753K995224
1672.3C46720085M450226L628197L618736M594498L034248M223747K928276N085526
1680C78283539L714485M054451M036980O06193Q674126M216499O118927M666672M664688
1688.6D19036560M462929L955841N220184M689751N101738M358101M872360M513702
1696.4D56211166N294876N103150M260788L910332L025894N985718M189758L714218
1704.1D91695900L601685L689270L686065L570633L877106K442016K053147K425499
$$ plain form
1649.1 288805389 289655666 292377834 293924541 291688900 295315533 296971493 301356487 302555408
1656.8 302555408 305338898 306803188 309146309 311890144 313982811 317397671 318651657 322722397
1664.5 322722397 325036163 328303337 330944023 332869797 336338844 338345108 343724861 346720085
1672.3 346720085 351170311 354798508 358417244 363011742 366045990 370269737 373198013 378283539
1680 378283539 381998024 386052475 390089455 390695648 399369774 403586273 409705200 414371872 419036560
1688.6 419036560 423499489 427455330 432675514 437365265 442467003 446825104 451697464 456211166
1696.4 456211166 461506042 466609192 470869980 474780312 477806206 483791924 487981682 491695900
1704.1 491695900 495297585 498986855 502672920 506243553 510120659 512562675 514615822 517041321
1711.8E17041321K682686K313003K83241J200409L271828J846352j392250L759002
1719.5E31005592L265190K096024J556435Q09173Q02994J522484J571884J162796J619453
1728.2E45412025J747399L43780Q20923K673912K396775q4534l50762L260498L304863
1736.9E59524879J534234K312927J759834K2926L588181K817574K289657L198662L405075
1745.5E80453949K766838J950951K830772K116013M401626L506775J801758M186325
1753.3F04015007L674431L466415K672425J091804K589607L103714K197876K916832
1761F25728111J094780P29180K864151J641655J949195J902962J610031q468J866607
1769.7F39378204L033066j53808k63062k01340L434372K243347k17361J915970R28039
$$ plain form
1711.8 517041321 519724007 522037010 522320251 523520660 526792488 528638840 527246590 531005592
1719.5 531005592 534270782 536366806 537923241 538732414 539535408 541057892 542629776 543792572 545412025
1728.2 545412025 547159424 547503204 548324127 550998039 553394814 553310280 552959518 556220016 559524879
1736.9 559524879 561059113 563372040 565131874 565154800 568742981 571560555 573850212 577048874 580453949
1745.5 580453949 583220787 585171738 588002510 590118523 594520149 598026924 599828682 604015007
1753.3 604015007 607689438 611155853 613828278 614920082 617509689 620613403 622811279 625728111
1761 625728111 626822891 627552071 630416222 632057877 634007072 635910034 637520065 637511597 639378204
1769.7 639378204 642411270 642257462 641994400 641793060 645227432 647470779 647253418 649169388 650097427
1778.3F50097427J609803P18612q8043J256180J532669J424942l52631M35410J073761
1787F57708130J096802P92083J104050Q29239O17676l25470l91236K684479O81381
1795.7F64797134J40686J678086J513519M91409o47812J889420M57230R48639J562728
1804.4F72831039N56107P88727K9983M56543Q12607J159134n38483K20490J591263
1813F77907410J038818J154861J53733Q03375l6545L19214R26972O1798P70721J63956
1822.7F83264313J217346R54742q18252O3553R79461J293183p8202j398773O51551
1831.4F86128922J986160O92596N45273M62418K24151O40869j60598N96389k35366
1840.1F90880814K57797N9585N31540J203537k629165J908264J592331J70898K43302
$$ plain form
1778.3 650097427 651707230 652425842 652337799 653593979 655126648 656551590 656198959 656634369 657708130
1787 657708130 658804932 659597015 660701065 661530304 662147980 661822510 661431274 664115753 664797134
1795.7 664797134 664937820 666615906 668129425 668620834 667973022 669862442 670319672 671268311 672831039
1804.4 672831039 673387146 674175873 674205856 674662399 675475006 676634140 676095657 676316147 677907410
1813 677907410 678946228 680101089 680254822 681058197 681021652 681340866 682267838 682329636 683100357 683264313
1822.7 683264313 684481659 685436401 684618149 684681702 685661163 686954346 686876144 685477371 686128922
1831.4 686128922 688115082 688807678 689352951 689815369 690039520 690680389 690519791 691116180 690880814
1840.1 690880814 691138611 691198196 691729736 692933273 690304108 692212372 693804703 693975601 694218903
1848.7F94218903N22079N05676o63528N41611O05392P00150j07422q4076P06939K7848
1858.4F96973572N44128j83868K60620J06277L44391M47693L3951O03256n69534K80304
1868F98840790q11310p31964R50317J053391R50775k0447N61142J48010N84946J93253
1877.7G01718903J08032K36969o57883M93775k56196J87684J94549J34888M61349j78375
1887.3G02443695R60236j69220p09763J96457N02014j9989l85208L5172k17362J015930
1896.9G03651962L09906J97754L94287L27225L12424r07593k45819j87531L39890L87497
1906.6G04580002N89142R10263O2332r7351m75846M20304l70560m73785l21732j9531
1916.2G04803238Q94165j120148K41547Q28094N64652M10080m83093l39890j36871
$$ plain form
1848.7 694218903 694740982 695246658 694583130 695124741 695730133 696430283 696322861 696238785 696945724 696973572
1858.4 696973572 697517700 697333832 697594452 697700729 698045120 698492813 698526764 699130020 698560486 698840790
1868 698840790 698029480 697297516 698247833 699301224 700251999 700231552 700792694 700940704 701525650 701718903
1877.7 701718903 701826935 702063904 701406021 701899796 701643600 701831284 702025833 702160721 702622070 702443695
1887.3 702443695 703403931 703234711 702524948 702721405 703223419 703203430 702818222 702853394 702636032 703651962
1896.9 703651962 703961868 704159622 704553909 704881134 705193558 704285965 704040146 703852615 704192505 704580002
1906.6 704580002 705169144 706079407 706141739 706044388 705568542 705988846 705618286 705144501 704822769 704803238
1916.2 704803238 705697403 704577255 704818802 705646896 706211548 706621628 706138535 705798645 705661774
1924.9G05661774L32489n83878L1433L51258N09338N78308k49557L12042l83988J05133
1934.6G06664352k67639k29263Q4457o43921J63117j49613P30591J53580n29099N15824
1944.2G06492386J30234P324m78668j50147n94253j82953L85055O14090O50788r4681
1953.8G06779175J50909n76401j53427m36706n39627j84326o64368M09851L47977N66635
1963.5G05699692J78070J34888J86386p38602l78418l39508K42615p7896j34659k7390
1973.1G04745178L79715O44760j85241J33438l89633J88980o943n89676l22952n86396
1982.8G04011230K27662Q7432L47901Q2016K47421J65634o89239P6065m93546o16836
1992.4G03445740l48435K89917N42603j4191p4234j72500L09448r3537K12174l00369
$$ plain form
1924.9 705661774 705994263 705410385 705441818 705793076 706302414 706880722 706631165 706943207 706559219 706664352
1934.6 706664352 706396713 706167450 706251907 705607986 705771103 705621490 706352081 706505661 705976562 706492386
1944.2 706492386 706622620 706629944 706151276 706001129 705406876 705223923 705608978 706223068 706873856 706779175
1953.8 706779175 706930084 706353683 706200256 705763550 705223923 705039597 704375229 704785080 705133057 705699692
1963.5 705699692 705877762 706012650 706199036 705460434 705082016 704742508 704985123 704907227 704772568 704745178
1973.1 704745178 705124893 705769653 705584412 705717850 705328217 705517197 705510254 704920578 704597626 704011230
1982.8 704011230 704238892 704326324 704674225 704756241 705003662 705169296 704480057 704556122 704062576 703445740
1992.4 703445740 703097305 703387222 703929825 703915634 703841400 703668900 703978348 703884811 704096985 703796616
2002.1G03796616n68695r2164o11190j60218j75399M79049K66419j10474r4070l66440
2011.7G02363434J87607j72272l6697l36686o34460o76651J91345M90494m83933L19138
2021.3G01211319R9030J49993k01644n43442k41013m73175J38168l92913M0512J20163
2031F99906998q6670l05863n16433K36816m43344O561j14670j87454k02331n01175
2040.6F97792435J44577j63193J55487l33023N6915J82114k00501J10932k55890m5471
2050.3F97444382o51779J86233m8752o04477O5155l24325J52206j22375K63824L8910
2059.9F96399002j30081K53220j02463j6938o17828j38397k69089J93787K06985o24542
2069.6F95153656O4163Q3313L34244l43933j61591O0807k80610L5248l81088m2267
$$ plain form
2002.1 703796616 703227921 703135757 702524567 702364349 702188950 702667999 702934418 702823944 702729874 702363434
2011.7 702363434 702551041 702378769 702342072 702005386 701370926 700694275 700885620 701376114 700892181 701211319
2021.3 701211319 701310349 701460342 701258698 700715256 700474243 700001068 700139236 699746323 699786835 699906998
2031 699906998 699820328 699514465 698998032 699234848 698791504 698798065 698683395 698495941 698293610 697792435
2040.6 697792435 697937012 697773819 697929306 697596283 697653198 697835312 697634811 697745743 697489853 697444382
2050.3 697444382 696792603 696978836 696930084 696325607 696390762 696066437 696218643 696096268 696360092 696399002
2059.9 696399002 696268921 696522141 696419678 696402740 695784912 695646515 695377426 695571213 695778198 695153656
2069.6 695153656 695217819 695301132 695635376 695291443 695129852 695190659 694910049 694945297 694564209 694521942
2079.2F94521942o4926K03934j46408o256N32531j30005m32434q65097M5700Q1024
2088.9F93740005k07061j01395N9738L15781k30484L40500l29895m92630j27564l08304
2098.5F92658691l94210o83976Q088j84174L76663M11911p629j09787k78244J57928
2108.1F91955261n94711l20358m52500l54309r7122r7275L27683k51160N25665J42517
2117.8F90783691j02462k65427r56726k90909j51214P6293j36566N09186K08588j47248
2127.4F89527206P1946l40500K67181n32760k02714R8267l47061j64795Q0185M66385
2137.1F88923340n798M93316k96783l21579J89132l18222k2506l03116J48773P7362
2146.7F88563919M42810N646l30811L44391k68478J37100l27225j22604J7929j59988
$$ plain form
2079.2 694521942 694457016 694660950 694514542 694508286 695040817 694910812 694478378 693613281 693658981 693740005
2088.9 693740005 693532944 693431549 693491287 693807068 693576584 693917084 693587189 693094559 692966995 692658691
2098.5 692658691 692264481 691580505 691588593 691404419 691781082 692192993 692185364 692075577 691797333 691955261
2108.1 691955261 691360550 691040192 690587692 690233383 690136261 690038986 690366669 690115509 690641174 690783691
2117.8 690783691 690681229 690415802 689459076 689168167 689016953 689093246 688956680 689465866 689674454 689527206
2127.4 689527206 689599152 689258652 689525833 688993073 688790359 688888626 688541565 688376770 688456955 688923340
2137.1 688923340 688917542 689410858 689114075 688792496 688981628 688663406 688640900 688337784 688486557 688563919
2146.7 688563919 689006729 689012375 688681564 689025955 688757477 688894577 688567352 688444748 688462677 688302689
2156.4F88302689K26364q2093M81492J25274J87988o2332j85775j42136l75137K80609
2166F88756943j45111M00467L38745M959R7122P0190J17188l90396N6534o02494k65274
2176.6F88438873L37601L15552N21316q39L96118Q0033M425k37198k0829O8970j83944
2187.2F89720078N38482k12250j3961o8436Q3847M41208J42212J99737o03714k69928
2196.9F89957275l17916K08511R1247k93273O52999K95868M48838M1198K12250O790
2206.5F91303787m85077k41775n69611K95792M21295M62341J75553J82571N0507o66046
2216.1F90929337k62681k01110J71127o62994q8501P59506K68249M29535k14843M32357
2225.8F91559982J56403j51901n2643m56543k35291l23639K82441r3613O6147K95639
$$ plain form
2156.4 688302689 688529053 688446960 688928452 689053726 689241714 689179382 688993607 688851471 688476334 688756943
2166 688756943 688611832 689012299 689351044 689356003 689453125 689523315 689640503 689250107 689306641 688704147 688438873
2176.6 688438873 688776474 689092026 689613342 689612503 690008621 690088654 690093079 689855881 689835052 689904022 689720078
2187.2 689720078 690258560 690046310 690032349 689963913 690047760 690488968 690631180 690830917 690227203 689957275
2196.9 689957275 689639359 689847870 689939117 689645844 690298843 690594711 691043549 691084747 691296997 691303787
2206.5 691303787 690818710 690576935 690007324 690303116 690724411 691186752 691362305 691544876 691595383 690929337
2216.1 690929337 690666656 690465546 690636673 689973679 689885178 690644684 690912933 691342468 691127625 691559982
2225.8 691559982 691716385 691564484 691511841 691055298 690820007 690496368 690778809 690685196 690751343 691046982
2235.4F91046982L26690M78821j81656k63519q55789k46964J44272K17896J78299k85111
2245.1F90559921K47727J60446J40152l53394J55716K17743k80838n5847o28281J02082
2254.7F90265427N3634m5547L60870M96445k136n39780M9057l93677J92337p3929j00097
2265.3F90262604M96673p4234K11869l11585j04675l11203k08435o6910l94211L48664
2275F89848557n7679J19171l7384K42768J05285m45633j70288n32684M00620K3117
2284.6F89495850m02298k52457N5847N67093j20087r3002m68140N1499j53m10232m31748
2295.2F87992172o36825M67682M40445N92727k89383p20978p3623k43302K2202q08792
2304.9F86742325m00315J5107K3956k23312l19214M81033J71433L64456n10330m37165
$$ plain form
2235.4 691046982 691373672 691852493 691670837 691407318 690551529 690304565 690448837 690666733 690845032 690559921
2245.1 690559921 690807648 690968094 691108246 690754852 690910568 691128311 690847473 690791626 690163345 690265427
2254.7 690265427 690319061 690273514 690634384 691130829 691128693 690588913 690637970 690244293 690436630 690362701 690262604
2265.3 690262604 690759277 690685043 690896912 690585327 690480652 690169449 689961014 689894104 689499893 689848557
2275 689848557 689790878 689910049 689872665 690115433 690220718 689775085 689604797 689072113 689472733 689495850
2284.6 689495850 689093552 688841095 688896942 689464035 689343948 689250946 688782806 688834305 688834152 688423920 687992172
2295.2 687992172 687355347 687823029 688263474 688856201 688566818 687845840 687772217 687528915 687551117 686742325
2304.9 686742325 686342010 686357117 686381073 686157761 685838547 686319580 686491013 686855469 686345139 685907974
2314.5F85907974l84216r57871o79092o29806Q90731L87040J99966j04065n75256n6839
2324.2F83998566l27149L00980n25742l45001o54602o51474P92770J381913R0179j520004
2333.8F82540436M93774o98623j013031k75269j595306j0148J372910J198959k5100
2342.5F81988602M52423o62308j101456j27716J8769N07812o51550q95157n26657M98504
2352.1F79501266K95868l44238M18472q93173O94428K32925p02591j626205j357193
2360.8F76219559J117630m44107J82418P19986J173325j29852o38428p35321j838379
2369.5F75626831K04315O43540N15899j89285L41568P99484P1793j16882q16040j03150
2379.1F76978073k05078m56009l09982k01340K87781J16577J57394J69754K07825p39670
$$ plain form
2314.5 685907974 685523758 684565887 683886795 683256989 684147720 684534760 684734726 684630661 684055405 683998566
2324.2 683998566 683671417 683972397 683446655 683101654 682447052 681795578 682588348 683970261 684060440 682540436
2333.8 682540436 683034210 682335587 681322556 681047287 679451981 679441833 680814743 682013702 681988602
2342.5 681988602 682441025 681778717 680677261 680549545 680568314 681076126 680424576 679529419 679002762 679501266
2352.1 679501266 679797134 679452896 679871368 678978195 679672623 679905548 679202957 677576752 676219559
2360.8 676219559 677337189 676893082 677075500 677795486 678968811 678838959 678200531 677465210 675626831
2369.5 675626831 675831146 676474686 676990585 676801300 677142868 677942352 678014145 677897263 677081223 676978073
2379.1 676978073 676772995 676316986 676007004 675805664 676093445 676210022 676367416 676537170 676744995 676005325
2388.8F76005325q38318k60086o86493l26690j18256L07923J96838J73569O9580p65229
2398.4F73758163p03811n61905k85492n43900k86865j49917j96152R7198j52206K98309
2408.1F71273422j56250m02832n47714q70972p39135p52717m653J78909L42560k6398
2417.7F68294220k3804J51139n39475o55975j168366p80258m72794m28543l20205r6970
2427.3F63958969P13959K67181r689m60587q17566o96945p67441p40890n17960l8528
2437F60890503k29645J66092J77994n6610p5913l36303o06842j369629q23594n82733
2446.6F57153320l36380L20206L44849K53448j52740m8523p35092r38035q28170r82361
2456.3F54050522p18460m32129K64282R842L18680L05862k72293m63486o28585p31583
$$ plain form
2388.8 676005325 675167007 674906921 674220428 673893738 673775482 674083405 674280243 674453812 674523392 673758163
2398.4 673758163 673054352 672492447 672206955 671663055 671376190 671226273 671030121 671127319 670975113 671273422
2408.1 671273422 671117172 670714340 670166626 669295654 668556519 667803802 667799149 667978058 668320618 668294220
2417.7 668294220 668270416 668421555 667882080 667226105 666057739 665277481 664804687 664376144 664055939 663958969
2427.3 663958969 664672928 664940109 664930420 664469833 663652267 662955322 662187881 661446991 660929031 660890503
2437 660890503 660660858 660826950 661004944 660948334 660872421 660536118 659929276 658559647 657736053 657153320
2446.6 657153320 656816940 657137146 657481995 657735443 657582703 657534180 656799088 655861053 655032883 654050522
2456.3 654050522 653332062 652899933 653164215 653174057 653492737 653798599 653526306 653062820 652434235 651702652
2465.9F51702652j450653n21088l04565o20270M7760K88315K92663n23529m83398n65491
2475.6F47862396o49261r66873j089707j74484m67606k80456m3488J4191j20926k30255
2485.2F43853531l32794r05381p19909r90067l67355k33612n90897j50985p3014K36168
2494.8F39725685n42869r70116r75113q13828n12847n59655m53071m57039K47307r2163
2504.5F34596291l42942l58772m83017m17557j196937q17986p68852n96314j02424
2513.2F29511490m997N9127l44543j6937l38898p92656r70383r16557p89604n79720
2522.8F24816322K2698n6153M71726K04811l26386k94456n95589r75723j344871q66318
2532.5F21056061q27904k71759P8888K04391L71895m92744k67830n27039r81598p76519
$$ plain form
2465.9 651702652 650251999 649730911 649426346 648806076 648853836 649142151 649434814 648911285 648427887 647862396
2475.6 647862396 647213135 646246262 645156555 644982071 644514465 644234009 644190521 644204712 644083786 643853531
2485.2 643853531 643520737 642615356 641895447 640905380 640538025 640304413 639713516 639562531 639489517 639725685
2494.8 639725685 639182816 638212700 637237587 636423759 635910912 635351257 634898186 634441147 634688454 634596291
2504.5 634596291 634253349 633894577 633411560 632994003 631797066 630979080 630210228 629613914 629511490
2513.2 629511490 629506493 629565620 629221077 629204140 628865242 628072586 627102203 626185646 625396042 624816322
2522.8 624816322 624839020 624782867 625254593 625459404 625133018 624838562 624242973 623267250 621922379 621056061
2532.5 621056061 620228157 619956398 620035286 620239677 620611572 620118828 619850998 619323959 618342361 617565842
2542.1F17565842n00985m90760n26467O1226N3826K0065k77901J6403k20298q52471
2551.7F14848480p69958j349602p04002k88697P2823M10271J9493k78817q50372m01268
2561.4F10708351n86052q76961o53266m53644n93949n86242M42085K75803Q6364m03404
2571F07359085p06215m67033o66275o11954j057739o62079k61421J2092p8125j69449
2580.7F02690887J66932l43514l64532q93822p72324p71026q06465L5209j94511p9117
2590.3E98667717l25813j74828k24647n88875o50902j007652n49965p68929n86891
2599E93789215k88544K2812q201m71268n9929n29327n85594r51882j031189o29539
2608.6E89256554o28968j95655n65491k95830k35710m07486l44505m02413m27475p76672
$$ plain form
2542.1 617565842 617064857 616574097 616047630 616108856 616162682 616182747 615904846 615921249 615700951 614848480
2551.7 614848480 614078522 612728920 612024918 611736221 611809044 612219315 612238808 611959991 611109619 610708351
2561.4 610708351 610122299 609245338 608592072 608138428 607544479 606958237 607400322 607676125 607762489 607359085
2571 607359085 606652870 606185837 605519562 604907608 603849869 603187790 602926369 602938461 602860336 602690887
2580.7 602690887 602857819 602514305 602149773 601255951 600483627 599712601 598906136 598941345 598746834 598667717
2590.3 598667717 598341904 598167076 597942429 597353554 596702652 595695000 595145035 594376106 593789215
2599 593789215 593500671 593523483 593515282 593044014 592984085 592454758 591869164 590917282 589886093 589256554
2608.6 589256554 588627586 588431931 587866440 587570610 587334900 586927414 586582909 586180496 585753021 584976349
2618.3E84976349n34783p64694p87544o37588k10572k10609n48935q164p10296r94988
2627.9E79568176p30476m61044o30951o69747J0185m97856n15442o40106j36070J16310
2637.6E75412979p93228r70116r37996l24516o37817o04401m29306l60832N72n60150
2647.2E69795189l34587n39971o00547p67098p61642l65982o60363j24588l98788n43747
2656.9E64697876n56526o06346p1030k31667o47201p52182j21498m53911n56603m40406
2666.5E60260506l94821J48239l41149m01382n28069k41127m12025r62944m56429l54614
2676.1E56316185Q9912j43966l40538m17557p18575n23147o34613l92990j57357N6801
2685.8E53134155l04908n02854l81317m12598j65825l41110n34248p36771j48697k26936
$$ plain form
2618.3 584976349 584441566 583676872 582889328 582251740 582041168 581830559 581281624 581273460 580563164 579568176
2627.9 579568176 578837700 578376656 577745705 577075958 577086143 576588287 576072845 575432739 575296669 575412979
2637.6 575412979 574619751 573649635 572711639 572387123 571749306 571144905 570715599 570354767 570355339 569795189
2647.2 569795189 569460602 568920631 568320084 567552986 566791344 566425362 565764999 565640411 565241623 564697876
2656.9 564697876 564141350 563535004 563463974 563232307 562585106 561832924 561711426 561257515 560700912 560260506
2666.5 560260506 559865685 560013924 559672775 559271393 558743324 558502197 558090172 557127228 556670799 556316185
2676.1 556316185 556406097 556262131 555921593 555504036 554785461 554262314 553627701 553234711 553077354 553134155
2685.8 553134155 552829247 552326393 551945076 551532478 551366653 551025543 550491295 549754524 549605827 549378891
2695.4E49378891n61218l15056m15192J09329k60925m73785o80313o53038q3237o20728
2705.1E45424728m70199q9989J17874l06625o30570l94210l34206k61879o48346l18184
2714.7E42088394m06456o13975n29747j25809L05862k91252J13831j57662o99501l69339
2724.4E39314346k99873n19676o17218J14k4071J4954k55547k30522k21023o27289
2734E36534195N8899k40555k93693l31879m50630l17879n75180J40266K31247M3640
2743.7E34798431n36079q01392j86538m9630j85165m41017n0430j83487K1248K27470
2753.3E32613411m80232o10962n81169k98310k40593j62468l52859m58641j26000J9494
2762.9E29321671k4758o03218l75061j84822j94817l77464p06329m88053n92880p7896
$$ plain form
2695.4 549378891 548817673 548502617 548087425 548196754 547935829 547462044 546781731 546128693 546045456 545424728
2705.1 545424728 544954529 544864540 544982414 544675789 544045219 543651009 543316803 543054924 542406578 542088394
2714.7 542088394 541681938 541067963 540538216 540412407 540718269 540427017 540540848 540383186 539683685 539314346
2724.4 539314346 539014473 538494797 537877579 537877693 537853622 537868576 537613029 537382507 537161484 536534195
2734 536534195 536593094 536352539 536058846 535726967 535276337 534958458 534383278 534523544 534754791 534798431
2743.7 534798431 534262352 533460960 533274422 533224792 533039627 532598610 532548180 532364693 532385941 532613411
2753.3 532613411 532133179 531522217 530941048 530642738 530402145 530239677 529886818 529428177 529302177 529321671
2762.9 529321671 529296913 528693695 528318634 528133812 527938995 527561531 526855202 526367149 525774269 525696373
2772.6E25696373O3896k29301n56870n99251J4115j66931o19393r56306n44586m23317
2782.2E21678429m75769j10741l37868m72488m69895j96838o21338o74248m29611p85484
2791.9E17104149m87900m83551l99437m58603l84140n11589j044845q58536o92101
2800.5E11783447j85394l54576q33588o26335o20460j025658r04884l68615o42891
2809.2E06221046o45942p04842p35931r63402r91631l86276o20880m24767o85844r83658
2818.9D99077873j019554j066704o40564j094513p95593p24716q42400m86564q20504
2827.6D91586761p93724r55467j169815j188583j024399q29392p65609q54607r06372
2836.2D83098793q18748j241112j309471j610680j812553j607399j504364j525460
$$ plain form
2772.6 525696373 525760269 525530968 524974098 524374847 524388962 524222031 523602638 522646332 522101746 521678429
2782.2 521678429 521202660 521091919 520754051 520281563 519811668 519614830 518993492 518319244 517889633 517104149
2791.9 517104149 516616249 516132698 515733261 515274658 514890518 514378929 513334084 512475548 511783447
2800.5 511783447 511598053 511243477 510409889 509783554 509163094 508137436 507232552 506863937 506221046
2809.2 506221046 505575104 504870262 504134331 503170929 502179298 501793022 501172142 500747375 500061531 499077873
2818.9 499077873 498058319 496991615 496351051 495256538 494460945 493736229 492893829 492407265 491586761
2827.6 491586761 490793037 489837570 488667755 487479172 486454773 485625381 484859772 484005165 483098793
2836.2 483098793 482280045 481038933 479729462 478118782 476306229 474698830 473194466 471669006
2843.9D71669006j974334j885682j789474j523018j756744k149048j961975j764565
2851.7D56864166j063461j283569r51729k95296l58848k78435l16315J13220j25999
2860.3D52303734n01251o95763o08902l24860n26161q85925j326332q30689p87201
2869D45816650p55386m72565p97119q35800o86722o54182j325875q89205n73044p57675
2878.7D38069077l53165n30014o19736j308632p95364j89324r48677j356811j304588
2887.3D30662766l73688p32651j211128j188011j210633p21740q66471p42416p79038
2896D22836990q52356j036224q76732n52025q60023o06499o58989n16701n70144n93262
2905.7D15714035o94542j435623p38258k80915r26017j228562p20558q39958j693688
$$ plain form
2843.9 471669006 469694672 467808990 466019516 464496498 462739754 460590706 458628731 456864166
2851.7 456864166 455800705 454517136 453565407 453270111 452911263 452632828 452316513 452429733 452303734
2860.3 452303734 451802483 451106720 450497818 450172958 449646797 448760872 447434540 446603851 445816650
2869 445816650 445061264 444588699 443791580 442955780 442269058 441614876 440289001 439399796 438826752 438069077
2878.7 438069077 437715912 437185898 436566162 435257530 434462166 434272842 433324165 431967354 430662766
2887.3 430662766 430289078 429556427 428345299 427157288 425946655 425224915 424358444 423616028 422836990
2896 422836990 421984634 420948410 420071678 419519653 418659630 418053131 417394142 416877441 416307297 415714035
2905.7 415714035 415019493 413583870 412845612 412564697 411638680 410410118 409689560 408849602 407155914
2914.3D07155914j619911j246910j271400j691399j160240o52848q44078p36389p36541
2923C97196198o42319q33245o24771k41966O027O8512j59950J03226J88026L50762
2932.7C95410500M06913J86653J11084J71776K33040P02858J092072J78794J04409
2941.3C98598099J095352J192131M96788O11496Q17757L25470Q31794P20368K37922
2950D04927177O21148J160659Q23212j0033N12543J046562J179314K08015j37176P01790
2959.7D11033211N66330N99479L52173J038285J259841K98501K62069O72112J191787
2968.3D17273788Q16460N67703L37258O78291J039620O05087P78351O70242J170425
2977D23937225Q19893K65312M70162R8724K9831l69568O8322L71665M53263P55806
$$ plain form
2914.3 407155914 405536003 404289093 403017693 401326294 400166054 399513206 398669128 397932739 397196198
2923 397196198 396553879 395720634 395095863 394853897 394859924 394928436 394768486 394871712 395059738 395410500
2932.7 395410500 395817413 396004066 396115150 396286926 396519966 397222824 398314896 398493690 398598099
2941.3 398598099 399693451 400885582 401382370 401993866 402811623 403137093 403968887 404689255 404927177
2950 404927177 405548325 406708984 407532196 407522163 408034706 409081268 410260582 410468597 410331421 411033211
2959.7 411033211 411599541 412199020 412551193 413589478 414849319 415147820 415409889 416082001 417273788
2968.3 417273788 418090248 418657951 418995209 419673500 420713120 421318207 422096558 422766800 423937225
2977 423937225 424757118 425022430 425492592 425591316 425621147 425251579 425319901 425691566 426144829 426900635
2986.7D26900635M06685L60565M8523L63159L69453j93328m29078m78592m5776q4381
2996.3D27217865j32675m98886q51670l98826n8899l35503m91485n45388n87577q4000
3006D23232956n65491n22537l9444n09300o26488q07915p83729j054955r54056m17900
3015.6D16951141l54232n19944q15963n65873o52656n15862o71043q79479l66020o87751
3025.2D10922318q85659j181144j156693n51224m45022o26450q64410q08907q85200
3033.9D03517609r89228j018982p58972o80542p89375o01044l78151k96249j000099
3042.6C97004967j205139j188927j074677p70988j020546q22983q37097m70619o20117
3051.3C88993874j388398q54988l73687m64287r21631j164055j183090r82552p45659
$$ plain form
2986.7 426900635 427307320 427667885 427716408 428079567 428449020 428255692 427826614 427348022 427302246 427217865
2996.3 427217865 427085190 426586304 425734634 425335808 425276909 424941406 424449921 423904533 423316956 423232956
3006 423232956 422667465 422144928 422105484 421596184 420969696 420161781 419378052 418323097 417369041 416951141
3015.6 416951141 416596909 416076965 415261002 414695129 414042473 413526611 412855568 411976089 411610069 410922318
3025.2 410922318 410036659 408855515 407698822 407147598 406702576 406076126 405211716 404402809 403517609
3033.9 403517609 402528381 401509399 400750427 400069885 399280510 398679466 398301315 398005066 397004967
3042.6 397004967 395799828 394610901 393536224 392765236 391744690 390921707 390084610 389613991 388993874
3051.3 388993874 387605476 386750488 386376801 385912514 384990883 383826828 382643738 381661186 380915527
3060C80915527p93838m03519l31917o25229p62710o06995q11691q96339n70260j058807
3069.6C74054222j390343q92944k10037n75142r50737p45010p22237n31197r40742
3078.3C67095833q92906n74837n67932o81114r75876p37763p76405m16946j20316o29425
3087.9C60722313j167564j176758q13561q33282m98429q12797j012497l21426l58735
3096.6C53727264o40297p47566n31807o77757j008453q34809n91392n38826p73354
3105.3C47383003p70263n79491o34346q81271p01523r35784j209144o03066m61807
3114C40606308o79131r03625o35796m27971p89718j158257p98988q6975j076088j304169
3123.6C32745590o16379j029777p77168m73671p54166p17201n81780r47876q18519
$$ plain form
3060 380915527 380121689 379718170 379386253 378761024 377998314 377391319 376579628 375683289 375113029 374054222
3069.6 374054222 372663879 371770935 371560898 370985756 370035019 369290009 368567772 368036575 367095833
3078.3 367095833 366202927 365628090 365060158 364379044 363403168 362665405 361889000 361472054 361351738 360722313
3087.9 360722313 359554749 358377991 357564430 356731148 356232719 355419922 354407425 354085999 353727264
3096.6 353727264 353086967 352339401 351807594 351129837 350121384 349286575 348695183 348156357 347383003
3105.3 347383003 346612740 346033249 345398903 344517632 343816109 342880325 341671181 341068115 340606308
3114 340606308 339927177 339023552 338387756 337959785 337170067 336011810 335212822 335125847 334049759 332745590
3123.6 332745590 332129211 331099434 330322266 329848595 329094429 328377228 327795448 326847572 326029053
3132.3C26029053o85463r13429o44684q27866p63359p45125p14912n47180p92962p55023
3141.9C18639050j023236j054725q94299p33318o14014n39455m19255r12399j045876
3150.6C11402473q83674m36516m97437j094036j094856j002579n24616q33416j234665
3159.3C03800678n50346l20168o41479o91853o27460q03242o73885q04615r42803o97689
3168.9B97047138o42319r75265j191463n62611k93388k77215q40778j287117q55694
3177.6B90121288q77742l14484k62356p89871r58557r26342p92332j313591q08182
3186.3B83077831j3561l59058p51496n64670o52905j054745o75659m72259k87323n25017
3195.9B77721138j076145r08852r20639p22828m80461m58317l53336m23222q68206
$$ plain form
3132.3 326029053 325343590 324430161 323785477 322957611 322194252 321449127 320734215 320187035 319394073 318639050
3141.9 318639050 317615814 316561089 315666790 314933472 314319458 313780003 313360748 312448349 311402473
3150.6 311402473 310518799 310082283 309584846 308490810 307395954 306393375 305868759 305035343 303800678
3159.3 303800678 303250332 302930164 302288685 301596832 300969372 300166130 299492245 298687630 297744827 297047138
3168.9 297047138 296404819 295429554 294238091 293675480 293382092 293104877 292264099 290976982 290121288
3177.6 290121288 289243546 288929062 288666706 287876835 286918278 285991936 285199604 283886013 283077831
3186.3 283077831 283064270 282705212 281953716 281389046 280736141 279681396 279005737 278533478 278246155 277721138
3195.9 277721138 276644993 275736141 274815502 274092674 273612213 273153896 272800560 272377338 271509132
3204.6B71509132q58554o66256j101036p35379k10266l39794p69672p29561j95465
3213.3B65903149n71385p01923k25563k96536r19437j129875q31814o82583m10690
3222B60133343m22097p33032q09269k58655n8842n92995q33721p65457n73196p38831
3231.6B54347248m99687j53885l57037p46269q85734l25528m79469n12199l17707m40693
3241.3B49629040m86870p89166l92494n07354o31962j32809l99799n50804m51375k58255
3250.9B45028152k02426l52383k45171l92589j082173p67975j79119q47950p04002
3259.6B40254364k02274j95923k53811o61297o91032m65699k94742k55776j30729k69814
3269.2B36833267n00736l55625k83127k84061n14317k64664k68326q97598p45735R3823
$$ plain form
3204.6 271509132 270650578 269984322 268883286 268147907 267937641 267597847 266828175 266098614 265903149
3213.3 265903149 265331764 264629841 264404278 264107742 263188305 262058430 261226616 260544033 260133343
3222 260133343 259711246 258978214 258168945 257910290 257851448 257258453 256424732 255659275 255086079 254347248
3231.6 254347248 253847561 253693676 253336639 252590370 251704636 251379108 250899639 250387440 250069733 249629040
3241.3 249629040 249142170 248353004 247960510 247453156 246821194 246688385 246288586 245737782 245286407 245028152
3250.9 245028152 244825726 244473343 244228172 243835583 242753410 241985435 241806316 240958366 240254364
3259.6 240254364 240052090 239856167 239602356 238941059 238250027 237784328 237489586 237233810 237103081 236833267
3269.2 236833267 236332531 235976906 235693779 235409718 234895401 234630737 234362411 233464813 232719078 232812901
3278.9B32812901K66971m90436l78514l24096m88911j46618k71816j54133j05229m08248
3288.5B30311871n43137l84769m01917m39434K1667M8047j34812m13074o60916n92117
3298.2B26811409m67148j31321k19078n27801q7777J13430l12919l04279q25406q72192
3307.8B23176918K37160J85604l34397m66175k36721j70936m45004l66630k05612l12462
3317.4B21061745p19223m14372l08266m05654k47975k37293j19896r00059p67002k50587
3327.1B16691418m35162l60756o46839l53794n14965q09498l81012j18694k52209o25744
3336.7B12192745m01573q00018q60939l20378k17209K1496l44906n49163m59557k08378
3346.4B08052120j23024n40619m11644j56879l25794o80027l55320j39141k94552J40552
$$ plain form
3278.9 232812901 233079872 232589436 232210922 231886826 231397915 231251297 230979481 230825348 230720119 230311871
3288.5 230311871 229768734 229383965 228982048 228542614 228564281 228612328 228477516 228064442 227403526 226811409
3298.2 226811409 226344261 226212940 225993862 225466061 225378284 225491714 225178795 224874516 224049110 223176918
3307.8 223176918 223414078 223599682 223265285 222799110 222562389 222391453 221946449 221579819 221374207 221061745
3317.4 221061745 220342522 219928150 219619884 219214230 218966255 218728962 218609066 217709007 216942005 216691418
3327.1 216691418 216256256 215895500 215248661 214894867 214379902 213570404 213189392 213070698 212818489 212192745
3336.7 212192745 211791172 210991154 210130215 209809837 209592628 209614124 209269218 208720055 208260498 208052120
3346.4 208052120 207929096 207388477 206976833 206819954 206494160 205814133 205458813 205319672 205025120 205165672
3356B05165672J93863k55279l75824J03702K46144l69111p46116l04051P1583n19790
3365.7B03210793p30381Q8539M41379p6122k05555l20740j85070P1335p89948l45802
3375.3B01158428L11089k84462R1514K28215k53945m34856k06967K48280J85242k01912
3384.9B00840626l75614j9837M65851L15895k71606r6360M62284j0795o52161l32641
3394.6B00325642J90200K85855k58942m28810m7760l59764m27055j86844K03914N71442
3404.2A99867878j41144j82266L54118O67286N98107p6447J9856L34205K90508P1297
3413.9B01803398L99284L72773m23813l41396j17646L45078J67503l08704L26195N49774
3423.5B02772446N36194N04837M45880K15970L2558K3575L30581M17500k54440K70652
$$ plain form
3356 205165672 205359535 205104256 204728432 204832134 205078278 204709167 203963051 203659000 203730583 203210793
3365.7 203210793 202480412 202568951 203010330 202934208 202728653 202407913 202222843 202294178 201504230 201158428
3375.3 201158428 201469517 201185055 201276569 201504784 201250839 200815983 200609016 200857296 201042538 200840626
3384.9 200840626 200465012 200445175 200911026 201226921 200955315 200858955 201321239 201310444 200658283 200325642
3394.6 200325642 200515842 200801697 200542755 200113945 200066185 199706421 199279366 199092522 199296436 199867878
3404.2 199867878 199726734 199544468 199898586 200565872 201163979 201087532 201107388 201441593 201732101 201803398
3413.9 201803398 202202682 202575455 202151642 201810246 201692600 202037678 202205181 201896477 202222672 202772446
3423.5 202772446 203308640 203813477 204259357 204475327 204507885 204531460 204862041 205279541 205025101 205295753
3433.2B05295753O07071M85382Q20599N30548O8016P6485P26013L81680L7708K20928
3442.8B09250183J98498N52750M67987M63352R9869P59239J307430K57206M31423O83193
3452.5B14471130L35179N13420P77454K48680J39771P39269J38550P34005J446037
3461.1B19543495O35643M98314N16033P83081Q36411Q8539O0215Q14724J100273P28493
3470.8B25605221L75805Q11214J158104R66320Q29201L53260M35924P56150P95841
3479.5B32087040O52924M24079N91393N89867J061840R19475O99673J163025Q94489
3488.1B39083805M25739M03347J119080Q99448P65896P72228N32475J571255J017093
3496.8B46590366N77317O62098P39479J367721R94988J119651O83690R81483J268234
$$ plain form
3433.2 205295753 205902824 206388206 207208805 207739353 207807369 207883854 208609867 208991547 209029255 209250183
3442.8 209250183 209448681 210001431 210469418 210932770 211032639 211791878 213099308 213356514 213787937 214471130
3452.5 214471130 214806309 215319729 216097183 216345863 216485634 217224903 217363453 218097458 219543495
3461.1 219543495 220179138 220677452 221193485 221976566 222812977 222901516 222961731 223776455 224876728 225605221
3470.8 225605221 225981026 226792240 227950344 228916664 229745865 230099125 230535049 231291199 232087040
3479.5 232087040 232739964 233164043 233755436 234345303 235407143 236326618 237026291 238189316 239083805
3488.1 239083805 239509544 239912891 241031971 241931419 242697315 243469543 244002018 245573273 246590366
3496.8 246590366 247167683 247829781 248569260 249936981 250931969 252051620 252735310 253716793 254985027
3505.5B54985027L24440M96826Q69771J147041J206856J542930J137486N67589R77325
3514.2B63255291J002388R12628M09317R20353J420727Q26149J083469J651898J250171
3522.9B72732391K07138R48697J642837J238613R77574J171741J085835J110725J605453
3531.5B82721004J498757J339435P02954J293697J449795K44446J431579K004204J682167
3540.2B94368038R49021R22222J071148J014175K077503J539288J786575J652565J281624
3548.9C06662159J279068J489544K194900O20079J492863J546097J346359K044125
3556.6C18675194R31873K081127K535210J577415R76448K041665J563263N79719L685913
3565.3C34647827K513733J118889J226845N55687L010559J837120J317405J788369
$$ plain form
3505.5 254985027 255309467 255806293 256676064 257823105 259029961 260572891 261710377 262277966 263255291
3514.2 263255291 264257679 265170307 265579624 266499977 267920704 268746853 269830322 271482220 272732391
3522.9 272732391 272939529 273888226 275531063 276769676 277747250 278918991 280004826 281115551 282721004
3531.5 282721004 284219761 285559196 286262150 287555847 289005642 289250088 290681667 292685871 294368038
3540.2 294368038 295317059 296239281 297310429 298324604 300402107 301941395 303727970 305380535 306662159
3548.9 306662159 307941227 309430771 311625671 312245750 313738613 315284710 316631069 318675194
3556.6 318675194 319607067 321688194 324223404 325800819 326777267 328818932 330382195 330961914 334647827
3565.3 334647827 337161560 338280449 339507294 340062981 343073540 344910660 346228065 348016434
3573C48016434J883926J665955K100525L008384J737900K333756J960563J178932K242318
3581.7C66128693K234687J986161J402969K584572K356377J412239J991233J023674
3589.4C81120605L056794L412056L112373J719208J148376L568840J427956K074776
3597.1D00640984K896461J120834L081856K576599J824303K496605J914749K149277
3604.8D18701668L458366L657456L73764L025894K133179N40809N974121K969361M99954
3613.5D41334572L886757N32722L384285M151154J094780L233070K913437J780357
3621.2D62311134L120308K667504K107048K895965K566033L404846O396293K443963
3628.9D87913094m939919L894310N180054N014190K414551R3765L305932L957061K803841
$$ plain form
3573 348016434 349900360 351566315 353666840 356675224 358413124 360746880 362707443 363886375 366128693
3581.7 366128693 368363380 370349541 371752510 374337082 376693459 378105698 380096931 381120605
3589.4 381120605 384177399 387589455 390701828 392421036 393569412 397138252 398566208 400640984
3597.1 400640984 403537445 404658279 407740135 410316734 412141037 414637642 416552391 418701668
3604.8 418701668 422160034 425817490 426191254 429217148 431350327 431891136 437865257 440834618 441334572
3613.5 441334572 445221329 445754051 449138336 453289490 454384270 457617340 460530777 462311134
3621.2 462311134 465431442 468098946 470205994 473101959 475667992 479072838 485469131 487913094
3628.9 487913094 482973175 486867485 492047539 497061729 499476280 499570045 502875977 506833038 509636879
3637.6E09636879K068634K502670L075028L041343K170983J867142L089675L590889
3645.3E31043243N263939J195793k232589N139503K548714p94907O83670N606156M835129
3654E53288651M242172O265602n364876Q83293N409966K032394K605591J692696K543525
3662.7E73599014J606140K049256K634010J223374M301490J997376N1956L291130m572029
3671.4E86181717R08012P060891Q505821K581215j3545075p8239O550903M797592j112823
3680F01850014N43709L049240K017974J170121R26819P74498L532333O312408o670951
3688.7F13506165m636422P420273k154884n31197N251465J452484R76715J16959o03447
3697.4F20798111J458473Q92525K357826L121605l571396j822281M296418J907920
$$ plain form
3637.6 509636879 511705513 514208183 517283211 520324554 522495537 524362679 527452354 531043243
3645.3 531043243 536307182 537502975 535270386 540409889 542958603 542163696 542847366 548453522 553288651
3654 553288651 557530823 563796425 558431549 559314842 564724808 566757202 569362793 571055489 573599014
3662.7 573599014 575205154 577254410 579888420 581111794 585413284 587410660 587462616 590753746 586181717
3671.4 586181717 587089729 594150620 602656441 605237656 591692581 591614342 598165245 602962837 601850014
3680 601850014 602393723 605442963 607460937 608631058 609557877 610332375 613864708 620177116 613506165
3688.7 613506165 608869743 616290016 614135132 613603935 618855400 620307884 621284599 621401558 620798111
3697.4 620798111 622256584 623149109 625506935 628628540 625057144 623234863 627531281 629439201
3705.1F29439201k64320J99623K603836M068794n861892K539901N583764j0694466
3712.8F27614441K308617L777580N01900N42526J885414K253799k432861m7646M877663
3721.5F41281433j962013m589424L829307J803551N58014j612549j253281K995759
3729.2F41050797Q83712M710541J18179p471847O062851J041107o810112O95763J709060
3737.9F41990051K44522J643143K694779l329773J791763J1202240l266754j7460976
3745.6F35508995P100411N087814N265350k525787j1340828J0291328O48117p244339
3753.3F42791061L827897L217315K888184m411011J475830N654602n481720j659088
3761F48303070L154144R74732j56021K518387j516724l663330K559585M260102J068268
$$ plain form
3705.1 629439201 629174881 629374504 631978340 636047134 630185242 632725143 638308907 627614441
3712.8 627614441 629923058 633700638 634202538 634745064 636630478 638884277 636451416 636403770 641281433
3721.5 641281433 639319420 634729996 638559303 640362854 640920868 639308319 638055038 641050797
3729.2 641050797 641934509 646645050 646763229 639291382 645354233 646395340 639585228 640280991 641990051
3737.9 641990051 642234573 643877716 646572495 643242722 645034485 656236725 652969971 635508995
3745.6 635508995 642609406 647697220 652962570 650436783 639095955 649387283 650035400 642791061
3753.3 642791061 646618958 649836273 652724457 648313446 649789276 655443878 649962158 648303070
3761 648303070 651457214 652431946 652275925 654794312 653277588 649614258 652173843 656433945 657502213
3769.7F57502213p121125J535340K914123m05350N71595j49002N60302N1346K718887
3778.4F58178329J305542o702194J013718J498260Q79517K129974k059326o42395J198197
3787.1F56799622K61306L53241J68076M6158k63825N70679O2866L30963K858887k326050
3796.7F58861923m090957J751556L151855N440979l858871j0708694L006057K704544
3804.4F56258392L715210M809952o154480l517685L419571J620865r5978j76391J7395
3813.1F59896851J057739M008484j338806j1076279L462067M454574L431549K685700
3820.8F66581879j2037583J07270M265899J651688J909637M96826k637786j58158Q89740
3829.5F61069412K106552J151657p101211K210236O350402n242004j516037O632767
$$ plain form
3769.7 657502213 650381088 651916428 654830551 654425201 654996796 654847794 655408096 655459442 658178329
3778.4 658178329 659483871 652781677 653795395 655293655 656173172 658303146 656243820 655601425 656799622
3787.1 656799622 657060928 657414169 657582245 657628403 657364578 657935257 657998123 658329086 661187973 658861923
3796.7 658861923 654770966 656522522 659674377 665115356 661256485 650547791 653553848 656258392
3804.4 656258392 659973602 664783554 658629074 655111389 658530960 660151825 660055847 659879456 659896851
3813.1 659896851 660954590 664963074 663624268 652547989 656010056 660464630 663896179 666581879
3820.8 666581879 654544296 654651566 658917465 660569153 662478790 662975616 660337830 660179672 661069412
3829.5 661069412 663175964 664327621 657226410 659436646 665787048 660545044 659029007 665661774
3837.2F65661774m233780m053955N549774l775635q19244N787048j120453k274475
3844.9F60721054J659470K06680n81512L63159j647187J033249M791565m003982L794632
3853.6F66337128p820969k962036P879715o72531k289124J252213J573562K101288
3861.3F65399246l824234R995N552597l144074n356521K338791L196029L980103m697113
3870F63454819p761307L051147M834824L544159p045975n29175L755188l36990J328430
3878.7F64295120L573761l255386n860825L346939Q83103R81293M798965r702301p73315
3887.4F58287354L396606O82983L305054M52042n472412J92489K291260j508560K19269
3896.1F61846085N00030J290436K190475o788711L593597K594223l818588M158096
$$ plain form
3837.2 665661774 661427994 657374039 662923813 659148178 658328934 664115982 662995529 660721054
3844.9 660721054 662380524 662587204 662005692 662368851 660721664 661754913 666546478 662542496 666337128
3853.6 666337128 658516159 655554123 663433838 662761307 660472183 661724396 663297958 665399246
3861.3 665399246 661575012 661585007 667137604 663993530 658637009 660975800 664171829 668151932 663454819
3870 663454819 655693512 658744659 663579483 667123642 660077667 659548492 663303680 662966690 664295120
3878.7 664295120 667868881 664613495 658752670 662099609 662982712 663964005 668762970 659060669 658287354
3887.4 658287354 661683960 662366943 665671997 666124039 660651627 660844116 663135376 661626816 661846085
3896.1 661846085 662346115 663636551 665827026 659038315 662631912 665226135 661407547 665565643
3903.8F65565643k080688k514267k47498N66407J782684k23847l5781j79291J49460
3912.5F62782822j29929o61545P71866J907501k030029l249512L125916P65076k618714
3921.1F60663452J443329R90372L98025j194687k354049J137161J244049J94321o75507
3929.8F61846466J49384K335662j541137k134400M35944l17307P56226M01535l76358
3938.5F61556015L35464L36457J639023O92825l452759r75952Q33359Q4686N82199
3947.2F61631317j357651P28989J313553k004318O41098L80706j78222Q82721K83203
3955.8F62321396j35040p60956L48663l83453l84064j05362j092300N23071L96347
3964.5F60728302k80533j08261L29132M08020l82233k39334M46625O21338N1575R7809
$$ plain form
3903.8 665565643 663484955 660970688 660723190 661289597 663072281 662848434 662812653 662633362 662782822
3912.5 662782822 662652893 661991348 662763214 664670715 662640686 659391174 662517090 663282166 660663452
3921.1 660663452 662106781 663097153 663495178 662300491 659946442 661083603 662327652 662521973 661846466
3929.8 661846466 661995850 664331512 662790375 660655975 661091919 660774612 661530838 661932373 661556015
3938.5 661556015 661891479 662227936 663866959 664559784 661107025 660131073 660964432 661049118 661631317
3947.2 661631317 660273666 661002655 662316208 660311890 660952988 661333694 661155472 662038193 662321396
3955.8 662321396 662186356 661425400 661774063 661390610 661006546 660901184 659808884 660331955 660728302
3964.5 660728302 660447769 660339508 660668640 661076660 660694427 660455093 660901718 661523056 661574631 661672440
3974.2F61672440k91062m18320P0343K39869K94571k19269q6518k70843J0147L09906
3983.8F61311264q9798J58463L1356j56707l34320l34092l45153L35769N06134j67236
3993.5F60915680K2049M7989M65469R2468l73077k899M6844
4000.2F61214523
$$ plain form
3974.2 661672440 661381378 660963058 661033401 661273270 661567841 661348572 661262054 660991211 661001358 661311264
3983.8 661311264 661221466 661379929 661411285 661254578 660920258 660586166 660241013 660576782 661082916 660915680
3993.5 660915680 660937729 660985718 661451187 661543655 661170578 661167679 661214523
4000.2 661214523
##END=$$ End of the data block
