##TITLE=$$ Begin of the data block
##JCAMP-DX=5.00 $$ ACD/SpecManager v 10.08
##SPECTROMETER/DATA SYSTEM=Varian
##DATE=14 Jan 2013 10:12:02
##DATA TYPE=INFRARED SPECTRUM
##DATA CLASS=XYDATA
##ORIGIN=
##OWNER=
##NPOINTS=3735
##FIRSTX=399.26403809
##LASTX=4000.35498047
##MAXX=4000.35498047
##MINX=399.26403809
##MAXY=73.92575836
##MINY=20.87791634
##XFACTOR=1.0000000000
##YFACTOR=0.000000100000000
##FIRSTY=43.88441849
##DELTAX=0.96440572
##XUNITS=1/CM
##YUNITS=TRANSMITTANCE
##XYDATA=(X++(Y..Y))
399.3 438844185 432666206 431800385 419049072 411972046 416865883 413423691 415413094 420870895
407 420870895 421178322 416427460 408969688 407115059 409804764 412147217 408482094 411755676 412633972
415.7 412633972 410841446 418234215 413908882 408036385 407982445 408570900 412058525 413962097 417056961
424.3 417056961 416632690 414187775 412161293 410618629 410311928 411835327 411790962 409126816 406591606
433 406591606 399920349 397792702 400340309 403710060 408214493 410152664 408459435 402459602 404815865
441.7 404815865 412025681 408857765 408420906 413730888 414110031 407559586 405801125 407406158 407999992
450.4 407999992 406835861 407172356 409119072 405309944 400055275 397338486 399850388 403670235 400079384
459.1 400079384 400022545 404546814 408192253 408820038 405126457 401339073 400423355 395972404 394340477
467.7 394340477 398429337 402733154 406525764 404352798 398517342 392896347 390060158 390154762 390396385
476.4 390396385 391281433 392423935 395244293 394738884 390696297 391730347 394314766 391795692 390810509
485.1 390810509 392659378 390513535 386363831 381885452 384417381 390152321 389845047 388273544 387805977
493.8 387805977 388986893 387263336 384642868 383713989 382500420 381720390 380293846 382722397 383536682
502.5 383536682 382226791 382224464 381500511 383901787 382350998 378300362 377946053 380619774 382301178
511.1 382301178 380286789 380460014 380320511 377996368 377286453 377374344 376720963 376684189 376277580 375851936
520.8 375851936 376121674 374384766 373616867 373836784 373971062 374421349 373641853 373394203 373039131 372318687
530.4 372318687 369595451 367023544 368182411 369906998 370764885 371320000 370382462 368514099 368880577
539.1 368880577 369573097 368172264 367249641 367543373 367299156 365429115 365389748 366544380 365415611
547.8 365415611 364919548 366090508 365668068 363930855 363194084 363048782 363311920 361452065 359700165
556.5 359700165 360858040 360110626 358833809 359161377 360052261 360859680 360220528 359314537 358484879
565.1 358484879 358185806 359065285 359348755 359515648 360391502 360516777 361303864 361698456 359270172 357236977
574.8 357236977 357196617 357225380 356288223 356315536 356755638 356778793 358466187 359287796 359256210 360130424
584.4 360130424 360026665 358826485 357695961 357341690 357944794 357693291 356927719 358096161 359310799
593.1 359310799 360552254 362107010 362561150 361558609 360157051 360979881 361063347 360429192 360746613
601.8 360746613 360877609 361673965 360706253 359523468 359900932 359952164 358676987 357174225 356900902
610.5 356900902 355831146 355919418 356581039 355929527 355706367 356050606 356529617 355967140 355737877 355530777
620.1 355530777 355366898 355566216 355876770 357269859 358314323 359291306 359833641 361342125 362703209
628.8 362703209 362413025 364013443 364778633 365457840 367602692 368316040 369489479 371465759 372846603
637.5 372846603 373680573 375243301 376655617 377132454 378330994 379613037 381137505 382480774 383403168
646.2 383403168 385247040 388091393 389278259 387836418 387815056 388197823 388433456 389775391 390258102
654.8 390258102 390572243 391230354 391112709 390463562 389992828 388785515 388613472 389482689 388785858 387836533
664.5 387836533 387463341 388952942 395571480 408026962 399580612 394405212 393552399 393183899 392915764
673.2 392915764 393818893 394892502 395682449 396842194 399410019 400997543 401226540 402098045 403872414
681.8 403872414 404822884 405153046 406347466 407096405 407826157 408578186 409371262 410119820 410335808 410286484
691.5 410286484 410104904 411430779 412931252 413748932 414330025 414332924 414508133 414836044 415379066 415835762
701.1 415835762 416403885 416441574 416607933 418219299 419226570 419400826 420272713 421510468 422522888
709.8 422522888 423400574 423178864 423341293 424127769 424356155 425050392 425279617 426055946 426482315 427373466
719.5 427373466 429466476 429261971 429562149 430700874 431603127 431497078 430986214 432680016 434463959
728.1 434463959 435300636 436140518 437907181 439109192 439320755 438950462 439302864 441144829 441198082
736.8 441198082 441327019 441724815 442718468 443776245 443346825 444639244 445598907 445929832 446202736
745.5 446202736 446983833 447246933 445924911 446920280 448393440 449681053 451158028 451988945 451760101
754.2 451760101 451462326 452904282 453475075 453823242 454790421 456707649 458377991 458820419 459916077
762.8 459916077 460852890 462663536 464474068 465315208 465599632 465635490 465466728 464875755 465405273 466073990
772.5 466073990 466487350 466093445 466320381 467594223 467434616 466819191 466716576 467134705 466697884 467079964
782.1 467079964 468428764 468823090 468913345 468938446 469709167 470055275 470530434 470937500 471101570 471204338
791.8 471204338 471040230 471978340 471725082 471080666 470505714 470005531 469929390 469339867 468867950 467639427
801.4 467639427 466808090 465315857 463335609 462275772 461342468 459724541 457456894 456754189 455537376
810.1 455537376 453984909 452855301 451418800 449946976 447799492 446603546 445279617 444624748 444435120
818.8 444435120 443612404 444516068 445509453 446252747 447906952 449660149 450067329 451364212 454849091
827.5 454849091 457878151 461297874 464681282 467512474 469980621 472501183 475858765 478890305
835.2 478890305 480801659 482583847 484886589 486542282 488780975 490406227 492103958 494595795
842.9 494595795 496089630 498175011 499569778 500570107 501181641 502514076 504617538 505749321 507675705
851.6 507675705 509370804 511006050 512317734 513858833 514858246 515660667 517839508 518999443 520561905
860.3 520561905 521590958 522543831 523494186 523520813 524286766 524589539 523834457 522113724 521867867 521183281
869.9 521183281 518785629 517020798 516030540 515333099 513919296 512594757 510919685 510236053 509507256
878.6 509507256 507908707 506834183 505856705 505699463 504053879 502911606 503154259 503239746 503011894
887.3 503011894 501335564 500557785 500587540 500948219 500814247 500776596 501486473 502446022 504325790 505007629
896.9 505007629 505257797 505673523 506587563 506734123 506049652 506296349 506169319 507460327 509359741
905.6 509359741 512156410 515090981 516681175 518657455 519633102 520285225 520278015 519983978 519650879
914.3 519650879 519030304 517546387 514968300 513139496 511082878 509352150 506859283 503803101 500419731
922.9 500419731 496901512 494727592 491375847 487639198 484206200 481356544 478878784 476357231
930.7 476357231 474270973 471512260 469161491 466906433 465043640 464140015 463641357 462800674 461535225
939.3 461535225 461044350 459932938 458824997 457663116 455916061 454492264 453942337 454311066 453427124
948 453427124 452711563 452705803 452736511 453100624 452623672 452078171 451478004 450435982 448727036 446553497
957.7 446553497 443974762 441732445 440674210 439287758 437500343 435458336 433242683 431343079
965.4 431343079 429434662 426963272 424473038 422586250 420363617 418390923 416823196 414399414
973.1 414399414 411377792 408363380 404635582 400279007 396416054 392627258 388513374 384362106
980.8 384362106 379848824 374538498 369576340 365222931 360683365 355837059 350645561 345915184
988.5 345915184 342131615 338617287 334611359 330469894 326818810 323716202 320327263 317021790
996.2 317021790 313652191 310113182 307163849 303743649 301042938 298104706 294663353 292085419
1004 292085419 289730453 288029423 286020756 284458923 282496109 280669689 279379082 277140694 275750694
1012.6 275750694 274433117 273080425 271051903 269335804 267858868 265149517 263341389 261135235
1020.3 261135235 258340244 255861187 254391975 252644672 250013695 248408031 247785454 246862831 244166985
1029 244166985 242906017 242120609 240940094 240368824 239618340 239719849 239362793 240197887 241469383
1037.7 241469383 242886429 244369717 245321617 246628876 247278652 248895741 249325695 249381485 249550247
1046.4 249550247 248769493 248518963 247717400 247385502 246374645 245733356 245203705 244452858 244593849
1055.1 244593849 244253330 244053974 243393784 243899136 243959045 244314861 246028080 247319641 249165745
1063.7 249165745 250392990 252450123 253900089 254607143 255208130 256266060 258376255 258828583 259131355
1072.4 259131355 259216366 260002594 260655422 260816288 261362686 261477871 262908916 263491497 264062271 264724197
1082.1 264724197 265385284 266962032 268275967 269876137 270986385 272750149 274046745 275353127
1089.8 275353127 277576752 279446373 281104374 282304535 284051533 285661964 287412701 288902340
1097.5 288902340 290219994 291568165 292497330 293884964 295559292 297767792 298429794 299073906 300561829
1106.2 300561829 302126293 304262276 304891357 305553074 306461372 307509823 308204823 308769760 310530510
1114.9 310530510 311351814 311426964 310979576 311282558 311850739 311491718 311381092 311258297 311476040 311640911
1124.5 311640911 312774372 314184265 314846172 315333614 316340351 318758812 320766640 322209053 323492851
1133.2 323492851 325310822 327501717 329633255 331892052 333993034 336181030 337116280 338311958
1140.9 338311958 340056953 341261253 342645912 343182793 343794823 344946823 345484886 345676727 345976868
1149.6 345976868 345911942 345953598 346833801 347150269 346761971 346676559 346903381 346586266 346106873 346048737
1159.2 346048737 345706215 345089417 343912811 343172455 343697128 344861183 346108398 347592812 349706192
1167.9 349706192 351541557 353763618 356442299 359086304 361754036 364311295 366635094 368808708
1175.6 368808708 371409645 373996811 376253433 378580627 381257286 383447838 385231552 386697540
1183.3 386697540 388059120 389617767 390447960 391581879 392464447 392577019 392924042 393008232 393051071
1192 393051071 393099442 392746201 391931114 390680122 389351959 388289528 387468376 386387520 385231285
1200.7 385231285 384458160 383378372 382396469 381706390 380306282 378839760 377714996 376463699 375610504
1209.4 375610504 375567207 375609474 375670815 375918999 375907135 375797234 375613976 375254478 375075684 375126343
1219 375126343 375059357 374721336 374619484 374274483 373647156 373541183 373180237 372770081 372291718 371257019
1228.6 371257019 370529022 369984398 369429893 368757973 367902832 367119942 366600761 366666145 366470413 365774155
1238.3 365774155 364740448 363979073 364367142 364674950 364442177 364116859 363818588 363043671 362131805
1247 362131805 361806526 361193771 360848961 360744743 360589447 360697021 360683060 360810738 360621109 360190964
1256.6 360190964 359774857 359476089 359251938 359107857 359448433 359479446 359645081 360188942 360794716 361647873
1266.3 361647873 362355843 362795448 363422546 364243889 364721260 365249557 366030197 367201195 368562546
1274.9 368562546 369567223 370679893 372317848 373693123 374225845 375025826 375746574 376378365 378034821
1283.6 378034821 379932785 381248360 382628365 384460716 385876427 387086945 388449936 389884377
1291.3 389884377 390819397 391143227 391366310 391660690 392400703 393344345 394448662 395135422 395830879
1300 395830879 396715469 396961479 397043686 396788445 396531487 396218796 395926170 395727730 395667572 396045570
1309.7 396045570 396051254 396133232 396363449 396127663 395388107 394739685 394123459 393567429 393971252 394562836
1319.3 394562836 395520134 396638985 397760582 399145241 399907227 400483818 401176262 401944313 401861076
1328 401861076 401275024 400932236 400772667 400844917 400374870 400242310 400364304 400151863 399857254 399420319
1337.6 399420319 399250336 399487381 399854088 399772453 400259857 401274643 402100601 402783966 403334427 403959541
1347.3 403959541 404314728 404592857 404296112 404185524 404027138 403343430 403236275 402905884 402545738 402210960
1356.9 402210960 401977844 401430702 400940704 401019135 400461617 400063820 399025955 398380203 398358727 398216133
1366.6 398216133 398185921 397365303 396143417 395316772 394792480 394201889 394092102 394403000 394472122 394552040
1376.2 394552040 394252853 394378242 393963470 393376312 392575531 391268883 390154991 388550339 387326965
1384.9 387326965 386442070 385965881 384374542 382684326 382133102 380685616 378749771 376757278 375326195
1393.6 375326195 372513161 368950233 367712898 366455803 365344658 362704010 360474663 359025764
1401.3 359025764 356825409 355149994 353706245 351312447 348512878 346862183 345642052 344373322
1409 344373322 343134880 341610107 340711060 339801865 338908234 338327866 337610741 336944885 335894699
1417.7 335894699 335769691 334188843 334229813 335350571 335598412 336987343 337099152 337349358 338255196
1426.3 338255196 338842392 340188446 340878983 341738358 342342911 343939476 345701447 347201881 349330826
1435 349330826 351127434 353500671 354005585 355864449 357334976 358780746 360631638 361444969 363177834
1443.7 363177834 364479752 366063309 367381897 368915024 370385246 370798454 372202568 372933540 374190865
1452.4 374190865 375324211 376804237 378225822 379001884 381430168 381975975 384443932 384953651 386209755
1461.1 386209755 387593117 389103050 391349030 391946335 394767952 397035255 399301643 401500015
1468.8 401500015 404256020 407860603 410593071 414513855 416912041 419429398 422213631 425381432
1476.5 425381432 428100128 430264549 432824707 435271301 437522392 438972778 440530205 442333603
1484.2 442333603 444186096 446188164 447322388 447941513 449583855 450946426 450410271 449522095 448951950
1492.9 448951950 447952347 447052956 446642647 442934418 442658119 441873360 438941078 438130035 436849518
1501.6 436849518 435284653 433454933 433064232 432653885 430128365 428554573 427962036 428622284 427728081
1510.2 427728081 428176918 427683487 426244659 425908470 424925613 424485817 423849869 421957245 421756935
1518.9 421756935 422787132 421481209 419620247 421712379 422501411 424001122 423909378 423558540 423833351
1527.6 423833351 424448853 425065231 425149651 425823936 427035027 428789673 428120766 429067726 430058098
1536.3 430058098 430625572 431790428 429001503 429394035 431042137 431975060 431532974 432352219 434194908
1545 434194908 433750076 434603996 434778900 435513496 435536957 434927216 435717773 435792656 437427864 436310959
1554.6 436310959 435174179 436142998 438223305 439020767 433131447 432714157 430355492 430201416 428512154
1563.3 428512154 427414894 425145226 422006798 421178017 419590187 419495735 412171516 409016838 406978226
1572 406978226 403269119 400273972 397508812 397385635 385898857 382724609 379445839 375412254 371501389
1580.6 371501389 366056213 362846756 357107620 353295517 348388443 344266968 340157661 334744606
1588.4 334744606 331377716 326053429 323344193 318380222 315061188 311048927 306104374 303477859
1596.1 303477859 298794994 296687965 292082615 289831696 286770782 283787270 281868248 277872086
1603.8 277872086 276655693 272996998 272068958 269519367 268165627 266951046 264060612 264296989 261803608
1612.5 261803608 262106094 260482063 260634613 261298485 256831036 257703381 256199379 257131805 255950394
1621.1 255950394 257382946 257890339 256861820 258027534 257409401 259810219 258908520 260328312 260878124
1629.8 260878124 261887989 263477268 263716946 266408882 266820831 269841423 268580513 271437721 273204327
1638.5 273204327 273732414 275744629 275986252 278670635 279329147 281753960 283867092 284143772 286464977
1647.2 286464977 285086269 288092422 288183994 290570412 293275661 294442081 293074760 291892471 294858913
1655.9 294858913 295198917 297240772 297831268 299130974 301105614 302401562 305308170 305325184 308547478
1664.5 308547478 310351582 312896576 315644817 318124237 321879272 322645493 327111588 329199944
1672.3 329199944 332772179 336230736 339806824 343407516 346133919 350884476 353970032 358868561
1680 358868561 362333908 366501541 372041588 375414925 382529907 383640671 388751297 392879410 397825317
1688.6 397825317 403288612 407853050 413211823 417607880 422694893 427384224 433099556 438559303
1696.4 438559303 443804436 449664536 455664597 463185043 461667633 467730827 473112640 477933197
1704.1 477933197 482269440 485962029 489277153 492481689 496685600 499672775 502162819 505118027
1711.8 505118027 508469086 511968727 513654137 515711327 519706841 522778549 519407539 521409531
1719.5 521409531 524645462 526847496 528851776 530251656 531258240 532868385 534769554 536148682
1727.2 536148682 537634239 540056648 541158867 541486740 544302444 548181000 550501747 547558250
1734.9 547558250 549380264 552654266 554972267 558135567 560033684 559683304 563215179 566268463
1742.7 566268463 568045311 570341263 574046555 577881584 580667572 584435081 587755356 592525063
1750.4 592525063 595716095 596651649 600535431 603979454 607776833 611487274 613026810 615357933
1758.1 615357933 618555641 621712418 625835419 626710548 626801643 629982452 631973572 633694878 635649757
1766.8 635649757 638129387 638045006 639967041 644278107 645566559 645738373 644789200 647668839 649863358
1775.4 649863358 649653091 651687698 652664566 654068527 655065308 655366287 656601334 658439713 660463257
1784.1 660463257 660597763 661165314 662647018 664183426 665121918 666535034 667567139 668810272 668845139
1792.8 668845139 667627945 670463257 671920700 672157898 673164291 675129089 676817093 675750504
1800.5 675750504 677409058 677940903 678250122 679213791 679860992 681307983 681878815 682481537 683332596
1809.2 683332596 685141678 685062943 685230560 686399918 686475067 687294617 687414703 688515549 688995743
1817.9 688995743 689449234 690500031 690588760 691665726 691879501 693144836 694714661 693125839 692696152
1826.5 692696152 694373093 696552200 697605972 695526657 695299606 697301559 697699051 698073883 698521881
1835.2 698521881 699009171 699827881 699462051 700532837 700678787 700995102 701365662 702504578 704129410
1843.9 704129410 700204544 701853943 703784409 704138794 704062881 704208069 705271683 705345535 705911713
1852.6 705911713 705833588 706229324 706308670 706261215 707124252 707229996 708029251 708226776 708712616 708651276
1862.2 708651276 708565598 708762207 708628769 709356537 709231491 710520554 710216522 709175034 710142746
1870.9 710142746 710835419 711775208 711835937 712106552 711815872 711953201 712004089 711772614 712053909 711615753
1880.6 711615753 712373352 712795715 713322678 713743286 713945923 714387283 713972244 714545288 714256210 713057785
1890.2 713057785 713245773 714068298 714379501 714964981 715529327 714747467 715502396 715870056 715992584 716006470
1899.8 716006470 715714188 715842667 715610657 715986099 715920181 716567917 717004089 717207718 717686462 717685852
1909.5 717685852 717811584 717164993 717681732 717050323 716543655 717021255 717136688 718595047 717777252
1918.2 717777252 717191391 717619095 717958298 718765411 718000793 717151489 717167053 717703781 717721863 718049011
1927.8 718049011 718237457 718399277 718872223 718730469 718992310 718456421 718349533 718205414 717952271 718224258
1937.5 718224258 718160400 718405762 718246307 719283371 719541397 718042068 718056870 718592377 718880539 718037262
1947.1 718037262 717587509 717587433 717714844 717587204 717822266 718525009 718645020 718478088 717393494 717307129
1956.7 717307129 717353745 717086868 717172470 717120438 717482376 717311096 717468491 717288818 717488785 717845840
1966.4 717845840 717221222 716870117 716648712 717166595 717092819 717304306 717446899 717369919 717820206 717369919
1976 717369919 717263947 716681213 716500473 716539841 716382370 716657715 716520920 716852798 716687927 716872406
1985.7 716872406 717081451 716821747 716238937 715518875 715928802 715737534 715127563 714838104 715303116 715680542
1995.3 715680542 715641861 715836182 715694199 715957031 715381699 714817276 714473953 714113159 713975906 713767929
2005 713767929 714523163 714779358 714801331 714305496 713911667 714089203 713730850 713404160 712695694 712666550
2014.6 712666550 712594528 712526016 712834473 713050156 713297119 712963028 713109589 712790070 712206039 711617813
2024.2 711617813 711319733 711116333 710585709 710973282 710770416 710686340 710771103 710804443 710761108 710543518
2033.9 710543518 710819931 710219116 709879074 709495544 709428329 709560318 709368515 709528656 709256973 709560242
2043.5 709560242 709062347 708618546 708540802 708463745 708867798 708336334 708444977 708322830 707923126 707655411
2053.2 707655411 707434845 707658920 707542572 707526550 707107697 707181168 707216797 707295914 707492676 707290497
2062.8 707290497 707572327 707288589 707285004 707063904 706411057 705859756 705901718 706380920 706092987 706162643
2072.5 706162643 706086884 706478271 706646500 706403656 706543808 706198044 705855942 705049057 705020370 705191422
2082.1 705191422 705546799 706038284 705992661 706326141 705757828 705476837 705043869 704537506 704127884 703494797
2091.7 703494797 703717117 703679657 704017639 704004669 704119873 703979492 703245621 703324356 703015442 702886963
2101.4 702886963 702477112 702244797 702042847 701894913 702434769 702636871 702863312 702312088 701923904 701718063
2111 701718063 701457367 701144791 700659180 700760727 700534821 700693207 700624161 700560684 700554962 700441437 700533829
2121.6 700533829 700076599 700030670 699623871 699804077 699828186 699554749 699962769 699568329 699815216 699835892
2131.3 699835892 699645309 699654007 699568481 699466782 699023895 699287338 699477768 699766769 699703674 699895096
2140.9 699895096 700220108 699700546 699538498 699303055 699389038 699344330 699528580 699558411 699318466 699618912
2150.6 699618912 699494781 699671631 699278183 698675385 698551712 699077835 699596786 699200745 699413147 699542236
2160.2 699542236 699633179 699545898 699793396 700082474 699563980 699325256 698895340 699068222 699295120 699546356
2169.9 699546356 699623947 699616852 700070496 699785538 699988480 699938049 699773178 699670258 699496841 699767761
2179.5 699767761 699712219 700200424 700565643 700762711 700544128 700454636 700460129 700012741 700043564 699360352
2189.1 699360352 699328308 699758835 699995651 700308990 700545959 700959167 700734100 701078110 700908127 700354080
2198.8 700354080 700023499 699748154 700241165 700310059 700348969 700372162 700949707 701449814 701494141 701397781
2208.4 701397781 700869141 700793533 700308838 700290070 700279846 700285187 700657425 700910645 701813583 701834946 701543808
2219 701543808 701118011 700968704 701122589 700940170 700863419 700422287 700749435 701075211 701528244 701844940
2228.7 701844940 701952972 702201767 701458359 701098022 700534744 700546646 700983276 700962448 701077042 700935669
2238.3 700935669 701197357 701085358 701102219 700871124 700719757 700859451 700402756 700350266 700261307 700789642
2248 700789642 701097107 701228867 701308975 701181107 701746979 701462402 701212463 701087189 700855789 700568008
2257.6 700568008 700610886 701011963 700939102 701644440 701780243 701840897 702048721 701552429 701096191 700723648
2267.3 700723648 700693665 700348511 700727158 701215286 701527939 701650696 701301117 701121826 700437546 700726547
2276.9 700726547 700461655 699859009 699897003 699526443 699666519 699723663 700069122 700057297 700520706 700733109
2286.5 700733109 699819489 699902802 699550095 699565277 699916840 700577240 701650238 701756668 702200470 702350845
2296.2 702350845 702160568 702095490 702335358 702615814 702608185 702932739 703271332 704057083 704722366 705582886
2305.8 705582886 706468658 706949997 708023605 708245773 708306274 709206696 709656525 709314346 708860016 709871140
2315.5 709871140 711538773 712402725 713462296 714710541 715870285 717094498 718089371 718848572 718830948
2324.2 718830948 718759460 719564743 721559525 723139954 723838196 724755249 725016022 724710159 723428955
2332.8 723428955 723572617 724000473 723787842 725041428 724676819 724837875 725961304 726720505 727385101
2341.5 727385101 727541656 726984406 725443878 724077148 720880737 716068878 710294266 709906387 715985031
2350.2 715985031 719680252 722161331 724740677 726695175 729581757 730953751 734386215 735211258
2357.9 735211258 736456146 737531128 738422546 739257584 736910324 735354538 732853928 731846619 729004211
2366.6 729004211 725955887 723155518 720144577 718764648 715351334 712592010 709219360 706314392
2374.3 706314392 704251556 701453323 699100647 696226044 694145432 692380753 690915909 689347534
2382 689347534 687683029 686698456 685353775 684606705 683825989 682652664 681559219 680889969 680780640
2390.7 680780640 680477295 680338440 680408707 680973129 681128235 680774765 680192566 679305267 678728638 678320618
2400.3 678320618 677993240 677211227 677134247 677234955 677174072 677457123 677034225 676867828 676716614 676334305
2410 676334305 675304947 674245148 673904266 673795853 673934250 673352966 673617096 674288788 674169693 673738174
2419.6 673738174 673117676 672497482 671244888 670758362 670508423 670001602 669610443 669299850 669537582
2428.3 669537582 669510880 669503708 668992538 668421249 667846680 667168961 666703949 665775757 665548477 665662689
2438 665662689 666087646 666315842 665866623 665232620 664328918 663841476 663046951 662342987 661952057 661701431
2447.6 661701431 661594467 661620483 661643906 661189270 661261673 660898437 660166855 659258423 658265839 657678833
2457.2 657678833 657064056 657265091 656904144 656456833 656478729 656458817 656309204 655361786 654751053 654061966
2466.9 654061966 653796768 653358002 652503586 652449036 652398529 652463455 651825256 651035461 650495605 649783630
2476.5 649783630 648967743 648188629 647918167 647357483 647011490 646678848 646452942 646167297 645596390 645620880
2486.2 645620880 645206070 644583130 643797760 642890396 642311172 641990967 641598587 641077499 641213531 641133881
2495.8 641133881 640680161 639759903 638929863 638602448 637909698 637034454 636172218 636022339 635693398 635297279
2505.5 635297279 635262527 634790154 634227829 633472023 633136978 632701263 631644058 630681496 630451393 630660210
2515.1 630660210 630416489 630063858 629624939 629289436 628727989 628247643 627801132 626950226 626357079 625683937
2524.7 625683937 625466423 625393486 624982948 624504013 624143791 623840523 623368187 623060303 622314720 621788673
2534.4 621788673 621213264 620557022 620410728 620222397 620048943 619416351 619189644 618700714 617964058 617343750
2544 617343750 616275864 616006241 615626335 615445137 615291748 614839363 614733505 614335670 613995247 613254929
2553.7 613254929 612615700 612250214 611992302 611809425 611423874 611184959 610689354 610162888 609227943 608673782
2563.3 608673782 608794022 608320084 607513809 606952896 606470222 605767746 605585785 605228271 604929962 604757500
2573 604757500 604279518 604220352 603491974 602848930 602390137 601809921 601566162 601329918 601062355 600338020
2582.6 600338020 600134087 600010834 599612007 599086571 598391037 597929459 597223053 596983261 596611328 595840416
2592.2 595840416 595179138 594794159 594689980 594363976 594133568 593553009 592764549 591703186 591007843
2600.9 591007843 590751610 590187645 590120697 589849968 589269409 588573036 588105469 587868271 587367172 586487846
2610.6 586487846 585141869 584580154 584237938 583914185 583658676 583434067 583301239 582247963 581371880
2619.3 581371880 580972672 580873680 580197716 578983536 578552094 578239517 577950668 577308884 576580429 575944901
2628.9 575944901 575568924 575343819 574453087 573731117 573240509 572887306 572458458 572188950 571935501 571169052
2638.5 571169052 570335884 569537888 569436684 569062843 568078995 567243690 566598053 566241112 565701637 565340462
2648.2 565340462 565133209 565072021 564969978 564441910 563790550 563319931 562928047 562199783 561464157 560492134
2657.8 560492134 559989243 560121460 559979362 559702721 559203110 558615112 557955017 557532272 556939240 556409531
2667.5 556409531 556276054 556002007 555762215 555125198 554720268 554269028 553873444 553735886 553132820 552900162
2677.1 552900162 552404671 551957359 551991806 551704445 551087074 550707054 550497856 549912415 549593658 549092712
2686.8 549092712 548732948 548234558 547506943 547468643 546963997 546424217 546173325 546179619 546176186 545834732
2696.4 545834732 545209694 544366760 544402504 544340553 543834686 542942924 542067986 541923676 541683426 541503220
2706 541503220 541120110 540965385 541035690 540800247 540116844 539296341 539201775 538887596 538437004 538041954
2715.7 538041954 537687683 537564163 537594337 537444000 536707497 536508636 536241112 535757256 535396652 535041962
2725.3 535041962 534947586 534685783 534656487 534226379 533763847 533540154 533267174 533253441 532729340 532102013
2735 532102013 531632767 531494255 531271515 531148720 531445465 531020088 530737381 530784492 530591583 530174103
2744.6 530174103 529620361 529415169 529398155 529136353 528786392 528733368 528413162 527889633 527579918 527537384
2754.3 527537384 527392578 527004013 526856537 526634102 526335335 525536919 524875183 524860229 524715347 524754601
2763.9 524754601 524539337 524043541 523482285 523127937 522963982 522361603 521933823 521754265 521526222 521278915
2773.5 521278915 521035538 520547676 519844742 519229927 518945885 518791771 518093758 517673607 517492332 516953430
2783.2 516953430 516288338 515675735 515488853 515348282 515014381 514485397 513987541 513437691 512605476 511773949
2792.8 511773949 511367798 511236572 510518761 509764366 509295044 508836594 507999802 507070503 506674156 506166611
2802.5 506166611 505683823 504959488 504312363 503726654 502865753 502316666 501771469 501300278 500174370
2811.2 500174370 499213829 498574867 497262383 496424904 495972099 495708694 494962120 493926086 493164062
2819.8 493164062 492203293 491428986 490866394 490393829 489367256 488395500 487628746 486662369 486078377
2828.5 486078377 485278587 484312820 483416367 482651482 481635780 480398407 479292793 478014565 476982193
2837.2 476982193 475953712 474764175 473403587 471924858 470310287 468852119 467442207 465119667
2844.9 465119667 463004951 461096420 458714409 456437645 454699554 453294640 451591759 450323448
2852.6 450323448 449720459 449524918 449191093 448802795 448579941 447997246 447853394 447605057 446916161 446347466
2862.3 446347466 445765114 445408669 445315895 445090561 444274559 443234253 442129822 441180649 440326920
2870.9 440326920 439475632 439071884 438366776 437285995 436583252 436165810 435576248 434917793 434099541
2879.6 434099541 433243637 432301178 431072655 430419273 429679947 428820076 428123512 427297096 426682167
2888.3 426682167 425774002 424969711 424017487 423117638 422629356 421691933 420589905 419606857 418825073
2897 418825073 417907829 417124977 416362381 415826645 415647583 414609528 413706818 413164711 412464523 411642265
2906.6 411642265 410781059 410133400 409196815 408153076 406882896 405577316 404311562 403165398 402090950
2915.3 402090950 400517044 398712883 396712952 395465355 394721527 393469429 392160797 391668472 391503258
2924 391503258 390353661 389936867 390335121 390362473 390373993 390258369 390160522 390043144 390119629 390188828 390536461
2934.6 390536461 391069565 391372795 391832161 392273712 392936134 393607445 394526749 395563736 396307678
2943.3 396307678 397057877 397242432 397347527 398031273 398904114 399398880 399807472 400563927 401442261 402031860
2952.9 402031860 402127037 402710915 403639488 404129448 404091682 404194984 404889870 405591431 406665192 407563667
2962.6 407563667 407912102 408357849 408803825 409492073 410529327 411280327 411502380 411759644 412598801
2971.2 412598801 414058647 414954643 415409927 416025696 416237144 416636925 417286835 418202553 418923225
2979.9 418923225 419208450 419360657 419038696 419091682 419415588 419906921 420472717 420788841 421269760 421548233
2989.6 421548233 421767006 421846657 421607056 421335220 421162567 420759888 420528030 420899887 420822983 420464134
2999.2 420464134 419971771 419385643 418980827 418551369 418125038 417435799 416997375 416696129 416022568 415398026
3008.8 415398026 414957695 414445190 414135246 413825264 413054161 412536201 411828346 410874138 410016975 409344902
3018.5 409344902 409086571 408567200 407971077 407106209 406496735 406227989 405287361 404021797 402872429
3027.2 402872429 402460060 402206383 401586533 400618744 399563065 398799057 398111992 397751541 396773148
3035.9 396773148 395564003 394952850 394311409 393477249 392675056 391938667 390865326 389986763 389006920
3044.5 389006920 388160477 387591629 386524429 385783730 385141029 384321136 383322144 382542801 382031250
3053.2 382031250 381198387 380553780 379527054 378173141 377288857 377024078 376599236 375751114 375121002
3061.9 375121002 374284592 373452148 372620277 371991615 371456375 370736160 370104713 369284630 368521042 367681808
3071.5 367681808 367128487 366332474 365376930 365066948 364392891 363929901 363424454 362609177 362393913 361977043
3081.2 361977043 360674591 359472847 359041443 358133736 357347374 357278290 356688919 355952110 355490265
3089.9 355490265 354642677 353640175 353151360 352643776 351960335 351172600 350709534 350524635 349550591
3098.5 349550591 348517456 347924156 347711449 347430420 346476021 345699120 345132828 344071083 343040009
3107.2 343040009 342673187 342037086 341264648 340767097 340165329 339928932 339362755 338280411 337475281
3115.9 337475281 336627083 335390472 334671516 334506226 333809052 332964592 331904945 331079712 331047974
3124.6 331047974 330745087 329770851 328658676 328072701 327537918 326467361 325297585 324746323 324522705
3133.3 324522705 323805466 322836800 321888580 321410789 321073456 320342522 319540806 318586063 317685776 317019291
3142.9 317019291 316255302 315412407 314904366 314400005 313691959 313134098 312462387 311586018 310888214 310353279
3152.5 310353279 309500389 308538952 307611828 306898193 306535282 305912361 305105572 304309196 303539238 302550030
3162.2 302550030 301823025 301383972 300625095 299944191 299158516 298789597 298037090 296834412 296217365
3170.9 296217365 295049419 294281788 293985348 293441544 292835102 292016697 291372356 290693455 290432930
3179.5 290432930 289781208 288736401 288303719 287584400 286659966 285686798 284826412 284411240 284203243
3188.2 284203243 283792477 283170471 282426281 281431255 280891476 280363369 279412670 278749409 278489380 278199673
3197.9 278199673 277464466 276619396 275940762 275501308 275141830 274635162 273962383 273437138 273031406 272374973
3207.5 272374973 271841068 271035957 270251045 270023003 269582024 268929768 268235607 267719040 267405376 267060223
3217.2 267060223 266813602 266627617 265968437 265135536 264795513 264323273 263608341 262614708 261551304
3225.8 261551304 261152496 261048813 260802479 260447121 260223694 259701271 259070740 258724403 257883644 256995411
3235.5 256995411 256707497 256583958 256159363 255536079 254868717 254466629 254427910 253990307 253670330 253656940
3245.1 253656940 253034267 252373180 251901035 251221294 250732937 250528011 250187740 249814320 249551792 249097157
3254.8 249097157 248655357 248301888 247599850 247304687 247245331 246452599 245794792 245474224 245431881 245586147
3264.4 245586147 245239792 244636097 244033928 243440056 242663918 242196026 242062874 241807041 241702614 241157951
3274 241157951 240730724 240762787 240372524 239912109 239495201 239010468 238755016 238526077 238244534 238447132
3283.7 238447132 238499546 238045902 237839794 237487278 236920090 236542072 236428318 236385593 235673199 234670753
3293.3 234670753 234699173 235147991 234894199 234487228 234100990 233964386 233724136 233119164 233097324 233109322
3303 233109322 232806530 232096901 231485100 231622009 231224327 230664749 230971775 231158142 230570869 230126438
3312.6 230126438 229792500 228933182 228658104 228815060 228448620 227953262 227890739 227916145 227270164 226470718
3322.3 226470718 226254673 226151314 225380135 224537678 224343014 224084244 223383904 222796783 222846889 222671871
3331.9 222671871 221837444 221536274 221374340 220566254 219997005 219867058 219522343 219178486 218992558 218363914
3341.6 218363914 217740421 217554436 216969566 216379986 216278076 216235580 215960197 215402527 215446682 215638142
3351.2 215638142 215407600 215237560 214820061 214567051 214258270 213791504 213610630 213338509 213118095 212790356
3360.8 212790356 212679291 212743969 212401485 212220268 212158165 212019672 211993294 211802578 211505680 211395817
3370.5 211395817 211099911 210806236 210941067 211043377 210867329 210607662 210515499 210290871 210158577 210183716
3380.1 210183716 210095253 210235157 209755287 209085712 209220715 209748363 210159607 209788361 209450397 209622879
3389.8 209622879 209781914 209673195 209364891 209295654 209026718 208863144 209056072 209000473 208779163 208808155
3399.4 208808155 209256020 209308872 208991547 209095707 209164982 209128857 209299908 209407654 209370251 209308491
3409.1 209308491 209501553 209653931 209388218 209527454 210155983 210596466 210648117 210540981 210504036 210538330
3418.7 210538330 210981274 211126881 211118755 211722584 212087116 211967754 211682644 212286434 213099518 212844868
3428.3 212844868 212876873 213257008 213484783 213596630 213770771 214409542 214864597 215124950 215356197 215462551
3438 215462551 215858059 216348190 216762009 217187481 217260532 217250881 217714310 218667889 219527340 219517670 219835892
3448.6 219835892 220706100 220836468 220926933 221656208 221967068 221842003 222362137 223228550 223915386 224660015
3458.2 224660015 225598907 226593170 227099438 227195301 227467136 227990646 228455658 229303246 230232716 230323868
3467.9 230323868 230716362 231612988 232628670 233509808 233969154 234732800 235246048 235744190 236803417
3476.6 236803417 237376385 237533569 238081207 238958435 239456120 239817390 240700531 241854897 242897835
3485.2 242897835 243668060 244457111 245325260 245820484 246480923 247560310 248484478 249603825 250493088
3493.9 250493088 251270638 252156963 252319546 252822838 253633232 254379311 255115242 255829716 257085571
3502.6 257085571 258215160 259168682 260225468 261343002 262146244 262896233 263497257 263637905 265033531
3511.3 265033531 266794891 267908936 268507900 269159794 270417919 271341133 272280254 273464508 274494991
3520 274494991 275150375 276011734 277280407 278480358 279617672 280653515 282364025 283138371 283471069
3528.6 283471069 284624176 285668583 286952152 287955112 289407120 290781918 292172203 293096123
3536.4 293096123 293084869 294595814 296101227 297091389 297934666 299647083 301725254 302934685 304512520
3545 304512520 305440941 306802387 307735157 308818588 310617123 312535839 314689350 314840431 316067810
3553.7 316067810 317726326 319473820 321626015 322871132 325069504 326821861 328577919 329614830
3561.4 329614830 330812531 332536507 334042816 338309135 339958992 339575272 340709152 340832176 343141861
3570.1 343141861 345157318 346897697 348975258 351106262 352223167 354261208 357326927 358412552
3577.8 358412552 360014648 361804428 363656769 365667534 367961998 370033493 371276054 375190926
3585.5 375190926 378081284 378627625 380266953 380720711 383578873 386485977 389057732 390873375 392920189
3594.2 392920189 396705551 396991158 398730545 402396545 404263763 407312813 409146919 410198402
3601.9 410198402 412233734 414005013 417066422 421085358 424149475 424372711 427174377 428017998 427933197
3610.6 427933197 434336205 436936378 437004662 441725082 442403908 445928917 450301933 452010460 454731178
3619.3 454731178 455661049 458052597 461909180 464781189 466751404 470059090 473768120 476787262
3627 476787262 483171616 487388763 481504898 483664017 487680511 492632370 495562019 495675049 498578453
3635.7 498578453 502421036 505607986 507821579 509669647 512485542 516358871 519073448 520486946
3643.4 520486946 523190994 526992035 532417259 534300156 534845695 541975174 543485336 540649185
3651.1 540649185 540161858 545550117 551493530 556252480 562220573 557574539 558001099 562980690 565331535
3659.8 565331535 567815361 569136620 572331619 574858017 576550903 578626671 580031929 584586258
3667.5 584586258 587206078 588527222 591395111 586091614 587527695 595064621 605252037 610716133
3675.2 610716133 595938148 594737206 601044502 605873795 605108261 605554390 607670593 609575615
3682.9 609575615 611580200 612765961 613573303 617576599 624848328 618469429 614355011 622489548
3690.6 622489548 619538727 617909889 622156563 623789177 625827560 626797829 626649475 627590637 628199730
3699.3 628199730 630655556 633665924 629680061 627405052 631841164 634354401 634364166 633871384 636539459
3708 636539459 641995087 636448708 638806915 645085831 633107948 634589005 638358231 638587685 639579887
3716.7 639579887 642389679 644737015 642157745 642498550 648428192 647593231 642581482 646093216 647947540
3725.4 647947540 648496552 646680756 645425186 648342438 649300385 654197464 653429489 646820374 654525146
3734 654525146 656398392 649367447 648283005 648789520 648438950 650371475 654217453 651192398 653498077
3742.7 653498077 665390472 659538651 640990524 648025055 653449326 660411224 659948959 649237900
3750.4 649237900 659087906 656710052 647652588 652080154 655985794 659175491 654489288 655842133
3758.2 655842133 662035294 655863037 652674103 656308441 658056717 658224106 661711807 660190582
3765.9 660190582 655678940 658058167 662519302 663974533 655089035 655772324 659457626 660206451 661085510
3774.5 661085510 660387421 661422653 662153549 664682007 665486679 657960434 659231186 661240997 662144165
3783.2 662144165 664504547 662542801 660885391 661384735 662322006 663295746 663301086 662929230 662393951
3791.9 662393951 663248062 663803024 664448318 667328796 664808960 660630646 662975769 667328873 673652954
3800.6 673652954 670358963 658657532 660016785 662027130 666443939 673119354 666227798 660562973
3808.3 660562973 664318314 666266708 666523666 666688385 666036682 667121353 672598801 671941299 658602600
3817 658602600 661900864 667462311 672447052 676878738 663109894 661315079 665448837 667256622
3824.7 667256622 669216843 669314041 665412598 665356598 667222061 669542465 671497498 664548492 665941696
3833.4 665941696 673012772 668984299 668127747 675101776 668709717 664231415 671848984 667892456
3841.1 667892456 665143814 671580353 670613937 666073761 667560577 668738022 668876648 670062637 669703751
3849.8 669703751 671783829 677601089 674420776 677052460 664711990 660401611 668237381 667561111
3857.5 667561111 666005325 667707748 669647751 672992172 668870697 668403015 675758057 673281937
3865.2 673281937 666272202 667983932 671961975 677948837 673551483 663122025 665025101 670910339
3872.9 670910339 675441818 666317749 665258942 669100342 669206390 671223755 675138397 671000977
3880.6 671000977 663710327 667854843 669385071 670805588 676277084 666315536 665777740 668436050
3888.3 668436050 668912048 673154831 673670959 667625732 667400742 669781342 668374023 669188156 670276871
3897 670276871 671416779 673645782 665512161 668426437 670292358 666114426 671505356 669733810 666946335
3905.7 666946335 666951981 667848282 669379120 668586273 668455276 668347931 668488693 668651047 668824615 670121918
3915.3 670121918 672425690 669732819 665842896 670231781 670923004 666638184 667896652 669784698
3923.1 669784698 670937347 669393463 666063156 666565247 668753815 670089417 669191132 669009933 670794983
3931.7 670794983 668305435 665990677 667791367 668289413 668179626 668655701 668604584 667903900 666748276
3940.4 666748276 667705078 669641113 667306824 665946732 667361984 668331604 669467621 668114624 667845612
3949.1 667845612 668871689 667234879 667889938 668062897 667210464 667390671 667684784 668017654 667463074
3957.8 667463074 667721100 666872711 666735535 667881393 666700745 666435394 666501465 665881042 666185837
3966.5 666185837 667069321 667395096 667080688 666743698 666797409 667128677 666770477 667257843 668332062 668374329
3976.1 668374329 667445602 666803436 667204895 667258835 666849899 666210632 666293335 666763535 666882858 666834488
3985.7 666834488 666869049 667470551 667411499 667659836 667381516 666574554 666634140 666631546 667166290 666645737
3995.4 666645737 666375809 667223969 667392731 667343903 667150650
4000.2 667150650
##END=$$ End of the data block
