##TITLE=$$ Begin of the data block
##JCAMP-DX=5.00 $$ ACD/SpecManager v 10.08
##SPECTROMETER/DATA SYSTEM=Varian
##DATE=14 Jan 2013 10:11:56
##DATA TYPE=INFRARED SPECTRUM
##DATA CLASS=XYDATA
##ORIGIN=
##OWNER=
##NPOINTS=3735
##FIRSTX=399.26403809
##LASTX=4000.35498047
##MAXX=4000.35498047
##MINX=399.26403809
##MAXY=73.90653229
##MINY=20.89087105
##XFACTOR=1.0000000000
##YFACTOR=0.000000100000000
##FIRSTY=43.62386703
##DELTAX=0.96440572
##XUNITS=1/CM
##YUNITS=TRANSMITTANCE
##XYDATA=(X++(Y..Y))
$$ plain form
399.3 436238670 419397202 417566872 410490570 406254883 417287025 416557388 408402367 398932076
407 398932076 396688232 402285843 402206039 405026627 408968239 412960815 412789612 408476524 408012276
415.7 408012276 408174896 407409325 399985199 407807350 419699402 416364555 405333405 398497162
423.4 398497162 400947800 399719925 399409561 399675217 404778557 410243683 409380608 406469421 404953232
432.1 404953232 406595154 404018402 401054764 398828011 399395485 403254509 402567253 401406708 398566055
440.7 398566055 399604874 405040665 408130112 408987846 406402435 406506500 405288467 406268272 407831116
449.4 407831116 406547623 407980347 404670563 398333931 398255539 403251648 405628395 403432274 402780304
458.1 402780304 400954018 401053696 403196793 403751030 402191467 399510803 395753517 394287872 396052513
$$ packed form
399.3D36238670j6841468j830330p076302m235687J1032142p29637q155021r470291
407C98932076k243844N597611p9804K820588L941612L992576j71203m313088m64248
415.7D08012276J62620p65571p424126P822151J1892052l334847j1031150o836243
423.4C98497162K450638j227875l10364K65656N103340N465126q63075k911187j516189
432.1D04953232J641922k576752k963638k226753N67474L859024o87256j160545k840653
440.7C98566055J038819N435791L089447Q57734k585411J04065j218033R79805J562844
449.4D07831116j283493J432724l309784o336632p8392M996109K376747k196121o51970
458.1D02780304j826286R9678K143097N54237j559563k680664l757286j465645J764641
$$ plain form
466.8 396052513 394538231 391718140 393204384 398584366 401048508 395004425 392713394 392571297 388200760
475.5 388200760 387051735 390919342 389364319 385369720 387412262 388748322 388668900 389618797 388235474
484.1 388235474 390766182 392844276 389941063 389175529 389287720 390141869 391123390 388595123 385207176
492.8 385207176 383656311 384185143 383533745 383990898 385953674 385444031 385403709 385495987 382721863 378798180
502.5 378798180 379630814 379930115 379767342 382506371 381733131 379325867 377962799 376990204 377696877
511.1 377696877 378957062 380180817 378837204 377342682 377196732 377113991 377862434 376656799 375266876
519.8 375266876 375485420 374340019 372061119 370358620 369604797 370580025 372181320 372984352 373652115
528.5 373652115 373548546 371391869 367130241 365929451 368646469 369879570 369947472 370794754 371567154
$$ packed form
466.8C96052513j514282k820091J486244N379982K464142o044083k291031j42097m370537
475.5C88200760j149025L867607j555023l994599K042542J336060p9422R49897j383323
484.1C88235474K530708K078094k903213p65534J12191Q54149R81521k528267l387947
492.8C85207176j550865N28832o51398M57153J962776n09643m0322R2278k774124l923683
502.5C78798180Q32634K99301j62773K739029p73240k407264j363068r72595P06673
511.1C77696877J260185J223755j343613j494522j45950q2741P48443j205635j389923
519.8C75266876K18544j145401k278900j702499p53823R75228J601295Q03032O67763
528.5C73652115j03569k156677m261628j200790K717018J233101O7902Q47282P72400
$$ plain form
537.2 371567154 371074905 368879128 367602806 367437248 366691322 366127090 365339813 365130157 365232162
545.9 365232162 364292564 365419617 366550674 365328560 364773941 364527397 363214455 361316299 359616852
554.5 359616852 359191360 360121422 360401573 359061737 358066940 359512634 360556145 360011253 361267815
563.2 361267815 361227798 359534988 360091820 361039124 359881172 358128853 358790207 359775238 359606018
571.9 359606018 359398575 358914070 358660927 357904510 356945915 357175484 357842941 358182411 358780632 358667259
581.5 358667259 357630463 357306099 357653770 359329758 360081902 358412476 356880531 356795387 357515526
590.2 357515526 358878250 361473465 362202873 361460457 360733757 360095139 360348587 360604439 361215973
598.9 361215973 361251869 360493431 359356651 358242111 359226875 359930611 359123116 359066124 360036278 358575897
$$ packed form
537.2C71567154m92249k195777j276322j65558p45926n64232p87277k09656J02005
545.9C65232162r39598J127053J131057j222114n54619k46544j312942j898156j699447
554.5C59616852m25492R30062K80151j339836r94797J445694J043511n44892J256562
563.2C61267815m0017j692810N56832R47304j157952j752319O61354R85031j69220
571.9C59606018k07443m84505k53143p56417r58595K29569O67457L39470N98221j13373
581.5C58667259j036796l24364L47671J675988P52144j669426j531945q5144P20139
590.2C57515526J362724K595215P29408p42416p26700o38618K53448K55852O11534
598.9C61215973L5896p58438j136780j114540R84764P03736q07495n6992R70154j460381
$$ plain form
608.5 358575897 355420570 355462761 356717644 356841507 356693420 357220421 356917419 354879608 354242363
617.2 354242363 355020027 355511742 355583267 355498886 355450630 356260834 357354202 358116112 359351616 359882050
626.9 359882050 360568733 362060699 363012695 363750381 365028877 366495438 367934685 369402580 370074730
635.5 370074730 371097450 372795067 374039459 375001717 375602989 376517715 377604256 379119797 381572037
644.2 381572037 383206253 383996658 385100670 386555290 387884636 388981285 389803886 389650040 389718857
652.9 389718857 390137787 390074081 390269203 390851402 391067314 390425720 389960022 389669762 389629936 389171944
662.5 389171944 388366623 388577271 388673553 390154152 395956497 405117226 399108124 394876060 393162842
671.2 393162842 392944107 393635521 394450912 394867096 395691643 396570816 398464279 400679550 401576309
$$ packed form
608.5C58575897l155327M2191J254883J23863j48087N27001l03002k037811o37245
617.2C54242363P77664M91715P1525q4381m8256Q10204J093368P61910J235504N30434
626.9C59882050O86683J491966R51996P37686J278496J466561J439247J467895O72150
635.5C70074730J022720J697617J244392R62258O01272R14726J086541J515541K452240
644.2C81572037J634216P90405J104012J454620J329346J096649Q22601j53846O8817
652.9C89718857M18930o3706J95122N82199K15912o41594m65698k90260l9826m57992
662.5C89171944q05321K10648R6282J480599N802345R160729o009102m232064j713218
671.2C93162842k18735O91414Q15391M16184Q24547Q79173J893463K215271Q96759
$$ plain form
679.9 401576309 401658630 402683678 404558258 405488396 406267853 407000313 408661995 410376091 410026627
688.6 410026627 410218010 411007195 411385536 411799011 412232399 412876282 413049164 414099808 415977745
697.3 415977745 415932198 415177498 415337296 415993195 416536064 416794930 417610207 418189201 418761864 419768257
706.9 419768257 421126823 422421608 422138634 422417641 423096466 423239670 423599014 424181023 425942497
715.6 425942497 426634941 427006874 428265533 429721451 431277618 430632286 430417404 431302338 431281090
724.3 431281090 431208992 431601677 432936020 434746742 435938034 437272148 439013176 439588242 440069809
733 440069809 440136528 440198936 441209869 440817451 441172791 442350311 442607841 442461128 442690392 443746414
742.6 443746414 444844704 446109581 446027718 446070251 446839867 447228165 448173714 449045181 450189438 451068954
$$ packed form
679.9D01576309Q2321J025048J874580R30138P79457P32460J661682J714096l49464
688.6D10026627J91383P89185L78341M13475M33388O43883J72882J050644J877937
697.3D15977745m5547p54700J59798O55899N42869K58866Q15277N78994N72663J006393
706.9D19768257J358566J294785k82974K79007O78825J43204L59344N82009J761474
715.6D25942497O92444L71933J258659J455918J556167o45332k14882Q84934k1248
724.3D31281090p2098L92685J334343J810722J191292J334114J741028N75066M81567
733D40069809O6719O2408J010933l92418L55340J177520K57530j46713K29264J056022
742.6D43746414J098290J264877q1863M2533P69616L88298R45549Q71467J144257Q79516
$$ plain form
752.2 451068954 451802216 451865005 452017784 453518982 454734650 455077515 454934959 456407928 457664032
760.9 457664032 458594513 460375137 462074280 463707275 464004440 465465393 466360550 465779495 465540543
769.6 465540543 465411186 466178818 465850906 465710754 466009750 466795349 467647095 467573280 467080421 465530624
779.2 465530624 466381264 467559395 467347183 467314377 467403145 468839531 470231590 471093407 470550270 470456123
788.9 470456123 471581841 471933022 471791496 471614265 471826210 471627655 472134514 472059364 471196251 470169868
798.5 470169868 468593178 468312263 468237419 467856712 466082993 464035721 462920074 461733971 460405884
807.2 460405884 458879623 458511009 457218437 454928932 452713661 450723953 449907913 448506966 446825409
815.9 446825409 446351624 446577225 445291023 443872032 444866905 446576843 447366753 448074684 449922142
$$ packed form
752.2D51068954P33262O2789J52779J501198J215668L42865j42556J472969J256104
760.9D57664032R30481J780624J699143J632995K97165J460953Q95157n81055k38952
769.6D65540543j29357P67632l27912j40152K98996P85599Q51746p3815m92859j549797
779.2D65530624Q50640J178131k12212l2806Q8768J436386J392059Q61817n43137r4147
788.9D70456123J125718L51181j41526j77231K11945j98555N06859p5150q63113j026383
798.5D70169868j576690k80915p4844l80707j773719k047272j115647j186103j328087
807.2D60405884j526261l68614j292572k289505k215271j989708q16040j400947j681557
815.9D46825409m73785K25601j286202j418991R94873J709938P89910P07931J847458
$$ plain form
824.6 449922142 451418724 452695923 454260712 456817055 460212860 463634911 467951279 470640030
832.3 470640030 473302956 475830460 477823792 480816841 482297325 484105835 486291351 489168701
840 489168701 491733818 493181458 494933243 496287498 497947540 498866310 500175476 501098404 503102531
848.7 503102531 506297226 507286186 507948303 508474731 509911957 510993576 512661781 514838448 515789528
857.4 515789528 517432251 518734322 520853844 522151299 522281380 522249031 523081589 524635468 524154434
866 524154434 523305206 521857681 521651611 520721970 518405113 517697868 516273003 514819107 513114777
874.7 513114777 511711998 510877876 510041237 509549942 508343620 506549644 505492096 505326385 504062881
883.4 504062881 503640442 503531265 502586632 501906433 501084862 501250610 501779785 502567291 501943092 501304054
$$ packed form
824.6D49922142J496582J277199J564789K556343L395805L422051M316368K688751
832.3D70640030K662926K527504J993332K993049J480484J808510K185516K877350
840D89168701K565117J447640J751785J354255J660042R18770J309166R22928K004127
848.7E03102531L194695R88960O62117N26428J437226J081619J668205K176667R51080
857.4E15789528J642723J302071K119522J297455J30081l2349Q32558J553879m81034
866E24154434q49228j447525k06070r29641k316857p07245j424865j453896j704330
874.7E13114777j402779q34122q36639m91295j206322j793976j057548j65711j263504
883.4E04062881m22439j09177r44633o80199q21571J65748N29175P87506o24199o39038
$$ plain form
893 501304054 502192497 502678146 503723602 504383240 505169640 505458946 505652733 506850128 507150917 506905632
902.7 506905632 506870270 507650337 508915672 511803322 514827576 516971436 518835716 519308624 519961319
911.4 519961319 520304832 520497246 519724045 518515205 517350540 515639153 514317665 511637383 508997345
920 508997345 506055870 502971725 499941216 496603355 493935013 490483704 487549744 484493752 481697273
928.7 481697273 479188728 475893974 473172150 470786476 469198074 467431107 465708427 464570007
936.4 464570007 463832932 462832260 461148567 460809898 460085983 458421211 457225227 456571159 455692711
945.1 455692711 454411240 453499451 452482338 452710838 453493233 453658295 453270073 452390862 451706314
953.8 451706314 450176849 448349838 447402611 446712952 444264641 441729622 440496254 439123840 437596245
$$ packed form
893E01304054Q88443M85649J045456O59638P86400K89306J93787J197395L00789k45285
902.7E06905632l5362P80067J265335K887650L024254K143860J864280M72908O52695
911.4E19961319L43513J92414p73201j208840j164665j711387j321488k680282k640038
920E08997345k941475l084145l030509l337861k668342l451309k933960l055992k796479
928.7D81697273k508545l294754k721824k385674j588402j766967j722680j138420
936.4D64570007p37075j000672j683693l38669p23915j664772j195984o54068q78448
945.1D55692711j281471r11789j017113K28500P82395J65062l88222q79211o84548
953.8D51706314j529465j827011r47227o89659k448311k535019j233368j372414j527595
$$ plain form
962.5 437596245 434874458 432699165 431433105 429961853 427793655 424822311 423078957 420780258
970.2 420780258 418242569 416567383 413987770 410927773 407908554 404476738 400309906 396430931
977.9 396430931 392853546 389196396 385046349 380095901 375437889 370243073 364779510 360205498
985.6 360205498 355356255 350513229 346185150 342004814 337444420 333093376 329881096 326584969
993.3 326584969 323602791 320026779 316107388 313022861 309363480 306088867 302792358 299659519
1001.1 299659519 297281818 294858665 292396297 290456276 288998775 286916256 285048485 282997894
1008.8 282997894 281380138 280091743 278419991 276625195 274326992 272873020 270968399 268999996
1016.5 268999996 266811695 264352055 262198200 259645767 258029289 255646019 253862953 252160416
$$ packed form
962.5D37596245k721787k175293j266060j471252k168198k971344j743354k298699
970.2D20780258k537689j675186k579613l059997l019219l431816m166832l878975
977.9C96430931l577385l657150m150047m950448m658012n194816n463563m574012
985.6C60205498m849243m843026m328079m180336m560394m351044l212280l296127
993.3C26584969k982178l576012l919391l084527l659381l274613l296509l132839
1001.1B99659519k377701k423153k462368j940021j457501k082519j867771k050591
1008.8B82997894j617756j288395j671752j794796k298203j453972j904621j968403
1016.5B68999996k188301k459640k153855k552433j616478k383270j783066j702537
$$ plain form
1024.2 252160416 250021667 248385715 246116962 245036583 243873253 243189373 242144413 241216507 241012897
1032.9 241012897 240242100 240083199 239533215 240460873 241057796 241741486 243146191 244174633 246069736
1041.6 246069736 246969376 248397217 249163914 249300175 249189777 248982162 249219360 247850628 246588669
1050.2 246588669 245317402 245113010 244585457 243768978 243903503 243705711 243896751 243071251 243606205
1058.9 243606205 244341888 244856834 245802441 247310696 249901905 250861893 252452068 253443909 254620037
1067.6 254620037 256015663 256865845 258080807 258098125 258826466 258695068 259636440 260448380 259686089
1076.3 259686089 260227413 261198940 263080330 263752594 264477806 265240974 266393986 267822323 267756290
1085 267756290 269091263 271170158 273654537 275336590 276962891 278110180 278795986 281202965 282849731
$$ packed form
1024.2B52160416k138749j635952k268753j080379j163330o83880j044960r27906k03610
1032.9B41012897p70797j58901n49984R27658N96923O83690J404705J028442J895103
1041.6B46069736Q99640J427841P66697J36261j10398k07615K37198j368732j261959
1050.2B46588669j271267k04392n27553q16479J34525j97792J91040q25500N34954
1058.9B43606205P35683N14946R45607J508255K591209R59988J590175R91841J176128
1067.6B54620037J395626Q50182J214962J7318P28341j31398R41372Q11940p62291
1076.3B59686089N41324R71527J881390O72264P25212P63168J153012J428337o6033
1085B67756290J334973K078895K484379J682053J626301J147289O85806K406979J646766
$$ plain form
1093.6 282849731 283724041 284373341 286287766 287759418 289052448 291176529 291996117 294102993 296125736
1102.3 296125736 297383785 298209324 299329090 301102295 302154388 303541470 304346447 305673389 306707268
1111 306707268 307156506 307871189 308155117 309474735 310755444 311527653 311564083 311453457 311411591 311163578
1120.6 311163578 311639271 311617031 311396980 311959114 313152523 313567753 314371090 315979977 317276478
1129.3 317276478 318777676 319630108 321512375 323961258 325931625 327612953 329043884 331534500
1137 331534500 333840370 335482330 336948318 338908424 340721970 341613312 342453766 343258209 344196434
1145.7 344196434 344831657 345447540 345969925 346078529 346312752 346268005 346403313 346747475 346778030 346384697
1155.4 346384697 346299324 346596031 345861397 344798241 344484138 344190025 343412857 343169861 343654594 344337082
$$ packed form
1093.6B82849731Q74310O49300J914425J471652J293030K124081Q19588K106876K022743
1102.3B96125736J258049Q25539J119766J773205J052093J387082Q04977J326942J033879
1111C06707268M49238P14683K83928J319618J280709P72209L6430j10626m1866k48013
1120.6C11163578M75693k2240k20051N62134J193409M15230Q03337J608887J296501
1129.3C17276478J501198Q52432J882267K448883J970367J681328J430931K490616
1137C31534500K305870J641960J465988J960106J813546Q91342Q40454Q04443R38225
1145.7C44196434O35223O15883N22385J08604K34223m4747J35308L44162L0555l93333
1155.4C46384697q5373K96707p34634j063156l14103k94113p77168k42996M84733O82488
$$ plain form
1165 344337082 345638657 347737274 350067902 352368431 354806175 356701202 358789711 361161232 363640556
1173.7 363640556 366397209 369171295 372269135 374667778 376809044 379367447 381861801 384043770
1181.4 384043770 385519257 386724777 388127899 389182053 390152931 391197891 391850014 392554245 392928505
1190.1 392928505 393108253 393101692 392893906 392538300 391490974 390678024 389773026 388242035 386974831
1198.8 386974831 386457329 385579453 383948669 382780457 381835442 381063881 380338249 379120140 377729797
1207.4 377729797 376567078 375988503 375593224 375467148 375534782 375620880 376283875 376400719 375854912 375538177
1217.1 375538177 375205231 374898987 374692764 374337349 373914986 373576126 373538666 374035225 373950920 373086472
1226.7 373086472 372284927 371528778 370895462 370164299 369442863 368371124 367389412 367114716 366470184
$$ packed form
1165C44337082J301575K098617K330628K300529K437744J895027K088509K371521K479324
1173.7C63640556K756653K774086L097840K398643K141266K558403K494354K181969
1181.4C84043770J475487J205520J403122J054154R70878J044960O52123P04231L74260
1190.1C92928505J79748o561k07786l55606j047326q12950r04998j530991j267204
1198.8C86974831n17502q77876j630784j168212r45015p71561p25632j218109j390343
1207.4C77729797j162719n78575l95279j26076O7634Q6098O62995J16844n45807l16735
1217.1C75538177l32946l06244k06223l55415m22363l38860l7460M96559q4305q64448
1226.7C73086472q01545p56149o33316p31163p21436j071739r81712k74696o44532
$$ plain form
1235.4 366470184 366282463 366489754 366377373 366116257 365407791 364944305 364684639 364575577 364148941 363405762
1245 363405762 362976189 362384300 361836624 361291313 360852394 360333138 360206528 360527420 360163269 360004730
1254.7 360004730 360205383 360265770 360002861 359565277 359239960 359290924 359704857 359637909 359844437 360451927
1264.3 360451927 361196861 361938133 362440491 363051605 363574905 364064903 364545975 365396538 366185188 367078972
1274 367078972 368581429 369839630 371001511 372213745 373343353 374117851 374900551 376125031 377203941
1282.7 377203941 378135719 379328918 380952606 382641068 384249191 385993996 387382126 388327370 389548340
1291.3 389548340 390482101 391024513 391721687 392479210 393028793 393593292 394547081 395269775 396206741 396725655
1301 396725655 396755562 397069969 396919403 396758842 396365471 396143913 395875664 395547943 396053734 396458397
$$ packed form
1235.4C66470184j87721K07291j12381k61116p08466m63486k59666j09062m26636p43179
1245C63405762m29573n91889n47676n45311m38919n19256j26610L20892l64151j58539
1254.7C60004730K00653O0387k62909m37584l25317N0964M13933o6948K06528O07490
1264.3C60451927P44934P41272N02358O11114N23300M89998M81072Q50563P88650Q93784
1274C67078972J502457J258201J161881J212234J129608P74498P82700J224480J078910
1282.7C77203941R31778J193199J623688J688462J608123J744805J388130R45244J220970
1291.3C89548340R33761N42412O97174P57523N49583N64499R53789P22694R36966N18914
1301C96725655K9907L14407j50566j60561l93371k21558k68249l27721N05791M04663
$$ plain form
1310.6 396458397 396539536 396094971 395639267 395167580 394712524 394358139 393814278 394315338 395213394 396072769
1320.3 396072769 396928864 397698135 398974648 400165291 400563202 400601158 401156235 401454201 401582756
1328.9 401582756 401336098 400760918 400607376 400419235 400393257 400047226 399977570 400156097 399779739 399426918
1338.6 399426918 399497910 399803734 399718666 400468941 401334000 401934090 402623138 403063354 403866234 404303055
1348.2 404303055 404706345 404514122 404040375 403538132 402726707 402896423 402933731 402427177 402191544 402507896
1357.9 402507896 402124672 401397285 400822983 399675140 399413490 399001427 398798752 398495216 398110466
1366.6 398110466 398264275 397653008 396737175 395742722 395063133 394573135 394710350 395124283 394727821 394784431
1376.2 394784431 394358444 394240189 393945503 393537178 392966614 391675377 390160561 388470001 387697411
$$ packed form
1310.6C96458397Q1139m44565m55704m71687m55056l54385n43861N01060Q98056Q59375
1320.3C96072769Q56095P69271J276513J190643L97911L7956N55077K97966J28555
1328.9D01582756k46658n75180j53542j88141k5978l46031o9656J78527l76358l52821
1338.6C99426918P0992L05824q5068P50275Q65059O00090O89048M40216Q02880M36821
1348.2D04303055M03290j92223m73747n02243q11425J69716L7308n06554k35633L16352
1357.9D02507896l83224p27387n74302j147843k61650m12063k02675l03536l84750
1366.6C98110466J53809o11267r15833r94453o79589m89998J37215M13933l96462N6610
1376.2C94784431m25987j18255k94686m08325n70564j291237j514816j690560p72590
$$ plain form
1384.9 387697411 386664085 386008911 384809532 382893372 382095451 380488358 378639259 376591377 375144310
1393.6 375144310 373166389 369748955 368082924 366573792 365478897 362918854 360083199 358497429
1401.3 358497429 356653252 354996758 353197746 350634766 348283195 347031860 345749931 344406433
1409 344406433 343312683 341667519 340654182 339823799 338933029 338100204 337151642 336939278 336678314
1417.7 336678314 336968842 334921684 334362297 335844116 336387024 337010536 336859055 337848167 338826218
1426.3 338826218 339053764 339998207 340743561 342027779 342427940 343865852 345614281 346901588 348908691
1435 348908691 350456505 352631912 353776054 355959053 357712669 359023781 360668755 361804695 363414688
1443.7 363414688 364216003 365516281 367158318 368993454 369931221 370591888 372125320 372744408 374142838
$$ packed form
1384.9C87697411j033326o55174j199379j916160p97921j607093j849099k047882j447067
1393.6C75144310j977921l417434j666031j509132j094895k560043k835655j585770
1401.3C58497429j844177j656494j799012k562980k351571j251335j281929j343498
1409C44406433j093750j645164j013337q30383q90770q32825r48562k12364k60964
1417.7C36678314K90528k047158n59387J481819N42908O23512j51481R89112R78051
1426.3C38826218K27546R44443P45354J284218M00161J437912J748429J287307K007103
1435C48908691J547814K175407J144142K182999J753616J311112J644974J135940J609993
1443.7C63414688Q01315J300278J642037J835136R37767O60667J533432O19088J398430
$$ plain form
1452.4 374142838 375297966 376937675 378464203 379321022 381613083 381938438 384458923 385363731 387013855
1461.1 387013855 388243713 389356461 391651382 393080025 395172272 396682358 399291840 401691322
1468.8 401691322 404129219 407116127 409481621 413749390 416544533 419740181 422493668 425383759
1476.5 425383759 428352623 430826645 433213234 435274467 437440758 438853035 440662460 442590790
1484.2 442590790 444359131 446345596 447627831 448520775 449902687 450647621 450044670 449670830 449363327
1492.9 449363327 448644409 448043900 447441177 443213615 442674103 442019005 439170227 438130455 436885490
1501.6 436885490 435352898 433691750 433696671 433570557 428643723 425630798 427247467 428944359 428421898
1510.2 428421898 428735466 428249817 426882133 426252747 425041504 424768829 423834763 421224327 421302528
$$ packed form
1452.4C74142838J155128J639709J526528Q56819K292061L25355K520485R04808J650124
1461.1C87013855J229858J112748K294921J428643K092247J510086K609482K399482
1468.8D01691322K437897K986908K365494M267769K795143L195648K753487K890091
1476.5D25383759K968864K474022K386589K061233K166291J412277J809425J928330
1484.2D42590790J768341J986465J282235Q92944J381912P44934o02951l73840l07503
1492.9D49363327p18918o00509o02723m227562n39512o55098k848778j039772j244965
1501.6D36885490j532592j661148M921j26114m926834l012925J616669J696892n22461
1510.2D28421898L13568m85649j367684o29386j211243k72675r34066k610436P8201
$$ plain form
1518.9 421302528 422710228 422409439 420987206 422153053 422554131 423911324 423859520 423988037 424943390
1527.6 424943390 425092010 425137520 425780945 426643257 427298508 428961868 428701210 429611282 430240479 430605202
1537.2 430605202 432743835 432909470 430259247 429742584 430467377 431241264 432888947 434600601 433879738
1545.9 433879738 435086670 435394211 436018600 436025963 434742851 435579491 435981064 436889496 435383186
1554.6 435383186 435771561 437431450 439236412 438146477 427988815 429412842 430012894 430879402 429516373
1563.3 429516373 428073845 425458374 422597122 421599350 419887657 420063057 413173218 409777832 407410889
1572 407410889 403538094 400414658 397414017 396632004 385693436 383492546 380252609 376058083 372413445
1580.6 372413445 367090378 363575172 357787437 353829613 348612328 344336357 340179214 334990959
$$ packed form
1518.9D21302528J407700l00789j422233J165847M01078J357193n1804J28517R55353
1527.6D24943390J48620M5510O43425Q62312O55251J663360k60658R10072O29197L64723
1537.2D30605202K138633J65635k650223n16663P24793P73887J647683J711654p20863
1545.9D33879738J206932L07541O24389P363j283112Q36640M01573R08432j506310
1554.6D35383186L88375J659889J804962j089935j0157662J424027O00052Q66508j363029
1563.3D29516373j442528k615471k861252r97772j711693J75400o889839l395386k366943
1572D07410889l872795l123436l000641p82013j0938568k200890l239937m194526l644638
1580.6C72413445n323067l515206n787735l957824n217285m275971m157143n188255
$$ plain form
1588.4 334990959 331695976 326194801 323610802 318566303 314796143 310788269 306285896 304030991
1596.1 304030991 299273491 296940441 292657585 290469036 286988678 283722954 281665974 277618237
1603.8 277618237 276486893 272970505 271977520 269359951 268085518 267041740 264043579 263950443 261651020
1612.5 261651020 262038002 260061474 260097618 260764427 256642246 257800846 256521873 257630348 256331539
1621.1 256331539 257380466 257397346 256146946 257989178 257713223 259876556 259004192 260277576 260907536
1629.8 260907536 262098923 263470440 263765202 266539478 266656857 268766270 268351650 271279945 272845173
1638.5 272845173 273958721 276436081 276946831 279349442 279433384 281710358 283717670 284534798 287417927
1647.2 287417927 285965252 288662052 288865318 291307240 292542381 289626293 291684341 291424294 295119667
$$ packed form
1588.4C34990959l294983n501175k583999n044499l770160m007874m502373k254905
1596.1C04030991m757500k333050m282856k188549l480358l265724k056980m047737
1603.8B77618237j131344l516388r92985k617569j274433j043778k998161r3136k299423
1612.5B61651020L86982j976528L6144O66809m122181J158600j278973J108475j298809
1621.1B56331539J048927J6880j250400J842232k75955K163333q72364J273384O29960
1629.8B60907536J191387J371517K94762K774276J17379K109413m14620K928295J565228
1638.5B72845173J113548K477360N10750K402611Q3942K276974K007312Q17128K883129
1647.2B87417927j452675K696800K03266K441922J235141k916088K058048k60047L695373
$$ plain form
1655.9 295119667 295608597 297026901 297680855 299643917 301593723 302948093 306365013 306436653 309392929
1664.5 309392929 310846672 313117657 315780640 318406029 321894188 322947464 327878380 329676361
1672.3 329676361 333408089 336822968 339597321 343730698 346753654 351217918 353903694 358696861
1680 358696861 362555580 366849403 372318420 374647255 379696121 383172264 389465790 393780022 398462677
1688.6 398462677 403921852 408394051 413592377 418214569 423374748 427941704 433333473 437526627
1696.4 437526627 442979851 448915558 454226456 461855698 463725853 469056664 473734474 478276825
1704.1 478276825 482558708 486806488 490460281 492956848 497029915 500608902 503300095 505770988
1711.8 505770988 508768692 512403679 514438705 516007271 519105377 522020645 520190010 522409019
$$ packed form
1655.9B95119667M88930J418304O53954J963062J949806J354370L416920P1640K956276
1664.5C09392929J453743K270985K662983K625389L488159J053276M930916J797981
1672.3C29676361L731728L414879K774353M133377L022956M464264K685776M793167
1680C58696861L858719M293823N469017K328835N048866L476143O293526M314232M682655
1688.6C98462677N459175M472199N198326M622192N160179M566956N391769M193154
1696.4D37526627N453224N935707N310898P629242J870155N330811M677810M542351
1704.1D78276825M281883M247780L653793K496567M073067L578987K691193K470893
1711.8E05770988K997704L634987K035026J568566L098106K915268j830635K219009
$$ plain form
1719.5 522409019 525476532 527522240 529608002 531261406 532300262 533788300 535362816 536572800
1727.2 536572800 538210449 540578346 541481133 541797485 544762344 548656349 550734558 548378258 550157509
1735.9 550157509 553361626 555517387 558447418 560728493 560587616 563997917 567333069 569145393
1743.6 569145393 570981827 574476433 578223038 581536789 585311966 587580490 592419281 596138191
1751.3 596138191 597673531 601600456 604639168 608267059 611925468 613560448 615720367 618772011
1759 618772011 621900330 625964775 627686424 628048820 630876274 632524719 634106712 636161766 638526993
1767.7 638526993 638479347 640429687 644812012 646426163 646778870 645727081 648427277 650645981 650421143
1776.4 650421143 652340927 653431396 655203171 656210327 656274872 657402267 658792114 660758591 661233521
$$ packed form
1719.5E22409019L067513K045708K085762J653404J038856J488038J574516J209984
1727.2E36572800J637649K367897R02787L16352K964859L894005K078209k356300J779251
1735.9E50157509L204117K155761K930031K281075j40877L410301L335152J812324
1743.6E69145393J836434L494606L746605L313751L775177K268524M838791L718910
1751.3E96138191J535340L926925L038712L627891L658409J634980K159919L051644
1759F18772011L128319M064445J721649L62396K827454J648445J581993K055054K365227
1767.7F38526993m7646J950340M382325J614151L52707j051789K700196K218704k24838
1776.4F50421143J919784J090469J771775J007156O4545J127395J389847J966477M74930
$$ plain form
1785.1 661233521 661901398 663350449 664780121 665787430 667127609 668113708 669660263 670130768 668571167
1793.8 668571167 670931244 672458572 672675018 673667297 675584412 676725464 675780487 677914886 678318558
1802.4 678318558 678539505 680133667 680963898 681942902 682567749 683509903 684449921 685804214 685548706
1811.1 685548706 686062164 687192612 687263412 688065262 688271408 689312820 689556046 690104218 691175003
1819.8 691175003 691478348 692769012 692939911 694141541 695469437 693931732 693600006 695122757 697284698
1828.5 697284698 698330231 696331787 696243744 698099823 698309784 698711624 698983231 699336929 700571899
1837.2 700571899 700398865 701266937 701414948 701739731 702118454 703418808 705214767 701446762 702953568
1845.8 702953568 704789810 705096283 704682541 704760056 706012421 706142349 706706390 706456528 706689377
$$ packed form
1785.1F61233521O67877J449051J429672J007309J340179R86099J546555M70505j559601
1793.8F68571167K360077J527328K16446R92279J917115J141052r44977K134399M03672
1802.4F78318558K20947J594162Q30231R79004O24847R42154R40018J354293k55508
1811.1F85548706N13458J130448P0800Q01850K06146J041412K43226N48172J070785
1819.8F91175003L03345J290664J70899J201630J327896j537705l31726J522751K161941
1828.5F97284698J045533j998444q8043J856079K09961M01840K71607L53698J234970
1837.2G00571899j73034Q68072J48011L24783L78723J300354J795959l768005J506806
1845.8G02953568J836242L06473m13742P7515J252365J29928N64041k49862K32849
$$ plain form
1854.5 706689377 706977539 707307892 708058853 707839890 708681641 708803787 709239197 709458847 709711990 710027008
1864.2 710027008 709736404 710525436 710178909 710718079 710648880 710463104 711456985 711894150 712568665 712436371
1873.8 712436371 712925720 712970886 712911758 712839966 712749634 712793503 712318420 713353653 713767242 714311676
1883.4 714311676 714762344 714876862 715386963 714939270 715390167 715149078 713860703 713823624 714589081 714942322
1893.1 714942322 715623932 716581726 716326141 717052841 716879807 716690979 716800690 716644592 716756821 716322327
1902.7 716322327 716708832 716769104 717367401 717891693 718179092 718560867 718511200 718610001 717693024 717830811
1912.4 717830811 717408981 717485809 717993469 717837067 719251404 718413544 717799072 718361511 718816071 719761429
1922 719761429 719123077 718039322 717987518 718798599 718930817 718918076 718816376 719051895 719419632 719322586
$$ packed form
1854.5G06689377K88162L30353P50961k18963Q41751J22146M35410K19650K53143L15018
1864.2G10027008k90604P89032l46527N39170o9199j85776R93881M37165O74515j32294
1873.8G12436371M89349M5166n9128p1792r0332M3869m75083J035233M13589N44434
1883.4G14311676M50668J14518N10101m47693M50897k41089j288375l7079P65457L53241
1893.1G14942322O81610R57794k55585P26700j73034j88828J09711j56098J12229m34494
1902.7G16322327L86505O0272N98297N24292K87399L81775m9667R8801r16977J37787
1912.4G17830811m21830P6828N07660j56402J414337q37860o14472N62439M54560R45358
1922G19761429o38352j083755n1804Q11081J32218j2741j01700K35519L67737r7046
$$ plain form
1931.7 719322586 719899750 719254150 718945923 718813782 718616562 718928375 719054031 719519119 719166107 719902573
1941.3 719902573 720140533 719145966 719440231 719550171 719455032 718909378 718911362 718806076 718758011 718838882
1951 718838882 718937759 719231110 718962479 718740845 718102341 718161240 718141479 717958679 718231659 718276215 718421326
1961.6 718421326 718253403 718618317 718429565 718625107 718942108 718156128 717723312 717283401 717598495 717743073
1971.2 717743073 718179321 718493500 718461075 718539505 718131638 718393173 717703476 717307053 717258453 717077713
1980.8 717077713 717472610 717456436 717771683 717773743 718203888 718103485 717618561 717332458 716486893 716632690
1990.5 716632690 716692810 716379623 716192703 716666412 716884918 716695633 716693954 716310272 716386414 715892487
2000.1 715892487 715662842 715370026 715026474 715016327 714651337 715235748 715331650 715425568 715438766 715370712
$$ packed form
1931.7G19322586N77164o45600l08227j32141j97220L11813J25656M65088l53012P36466
1941.3G19902573K37960r94567K94265J09940r5139n45654J984j05286m8065Q0871
1951G18838882R8877K93351k68631k21634o38504N8899j9761j82800K72980M4556J45111
1961.6G18421326j67923L64914j88752J95542L17001p85980m32816m39911L15094J44578
1971.2G17743073M36248L14179l2425P8430m07867K61535o89697l96423m8600j80740
1980.8G17077713L94897j6174L15247K060M30145j00403m84924k86103q45565J45797
1990.5G16632690O0120l13187j86920M73709K18506j89285j679l83682P6142m93927
2000.1G15892487k29645k92816l43552j0147l64990N84411R5902R3918J3198o8054
$$ plain form
2009.8 715370712 715547791 714864883 714258652 713623657 713531570 713598557 713681259 713721390 713928070 714116974
2019.4 714116974 713684769 713898621 713438568 712895889 712519913 712074661 711646423 711195068 711732941 711946945
2029.1 711946945 712403564 712354202 712080612 711985321 711401291 711072845 710373993 710672684 710985184 710870285
2038.7 710870285 710455780 710212479 710609665 710101776 710042267 709689178 709576874 709384537 709025497 709235687
2048.4 709235687 708931656 709283676 709139175 709279251 709345474 708918686 708883591 708461685 708425903 708129578
2058 708129578 708407745 708400574 708253250 708473053 708366470 708770142 708475494 708228226 707664261 707301636
2067.6 707301636 707270279 707052841 707315521 707383118 707865829 707629471 707719421 707652740 706958084 707050247
2077.3 707050247 706809769 706792450 706374283 706099167 705810623 705827560 706468964 706637650 706907806 706386337
$$ packed form
2009.8G15370712J77079o82908o06231o34995r2087O6987Q2702M0131K06680J88904
2019.4G14116974m32205K13852m60053n42679l75976m45252m28238m51355N37873K14004
2029.1G11946945M56619m9362k73590r5291n84030l28446o98852K98691L12500j14899
2038.7G10870285m14505k43301L97186n07889n9509l53089j12304j92337l59040K10190
2048.4G09235687l04031L52020j44501J40076O6223m26788l5095m21906l5782k96325
2058G08129578K78167p171j47324K19803j06583M03672k94648k47268n63965l62625
2067.6G07301636l1357k17438K62680O7597M82711k36358Q9950o6681o94656R2163
2077.3G07050247k40478j7319m18167k75116k88544J6937O41404J68686K70156n21469
$$ plain form
2086.9 706386337 706062012 705659256 705294952 705049515 704616089 704834137 704783783 705335922 705404739 705329971
2096.6 705329971 705262451 704736252 704630127 703994904 703689194 703273544 703399734 703564148 703152161 703362427
2106.2 703362427 703550110 703789749 703503876 703206329 702635574 702215805 701993942 701787567 702209625 701817017
2115.9 701817017 701730423 701716385 701843567 701986923 701544952 701305237 700947876 701010666 700715942 700940552
2125.5 700940552 700906601 700561676 701078262 701039963 701243744 700931625 700629578 700538101 700439987 700437775 699851913
2136.1 699851913 700145645 700603027 700804520 700519485 700387650 700727692 700610046 700320511 700066147 700416718
2145.8 700416718 700453262 700589752 700557022 700567093 701038589 700849838 700714493 700283051 700197220 700146408
2155.4 700146408 700264435 700190506 699753494 700491028 700881577 701063919 700732651 700822830 701105804 700542755
$$ packed form
2086.9G06386337l24325m02756l64304k45437m33426K18048n0354N52139O8817p4768
2096.6G05329971o7520n26199j06125o35223l05710m15650J26190J64414m11987K10266
2106.2G03362427J87683K39639k85873k97547n70755m19769k21863k06375M22058l92608
2115.9G01817017q6594j4038J27182J43356m41971k39715l57361O2790k94724K24610
2125.5G00940552l3951l44925N16586l8299K03781l12119l02047r1477r8114k212n85862
2136.1F99851913K93732M57382K01493k85035j31835L40042j17646k89535k54364L50571
2145.8G00416718L6544J36490l2730J0071M71496j88751j35345m31442q5831n0812
2155.4G00146408J18027p3929m37012P37534L90549J82342l31268R0179K82974n63049
$$ plain form
2165 700542755 700546036 700266342 700268936 700061874 700028381 700323181 700770569 701167831 700576859 700656662 700223846
2175.6 700223846 700170746 700424347 700260849 700480804 700276871 700718079 700873337 701293564 701595459 701618652
2185.3 701618652 701701508 700947800 700808716 700428009 700409164 700622406 700912323 701388397 701626053 702202225
2194.9 702202225 702110291 702226639 701676636 701394501 701595078 700907211 700874557 700912552 701040955 701258240
2204.6 701258240 702008133 702311935 702259140 702485199 701893997 701793518 701341476 701036987 700944138 700968628
2214.2 700968628 701706467 702301407 702967072 702714844 702607422 702535553 702212677 701900940 701453171 701573868
2223.9 701573868 701349792 701608353 702123947 702726822 703023148 702990646 702982864 702167282 701951218 701665573
2233.5 701665573 701402206 701287079 701430206 702011795 702096252 702466354 702502670 702599640 702352524 702068481
$$ packed form
2165G00542755L281k79694K594k07062l3493K94800M47388L97262n90972P9803m32816
2175.6G00223846n3100K53601j63498K19955k03933M41208J55258M20227L01895K3193
2185.3G01618652Q2856p53708j39084l80707j8845K13242K89917M76074K37656N76172
2194.9G02202225r1934J16348n50003k82135K00577o87867l2654L7995J28403K17285
2204.6G01258240P49893L03802n2795K26059n91202j00479m52042l04489r2849K4490
2214.2G00968628P37839N94940O65665k52228j07422p1869l22876l11737m47769J20697
2223.9G01573868k24076K58561N15594O02875K96326l2502p782q15582k16064k85645
2233.5G01665573k63367j15127J43127N81589Q4457L70102L6316R6970k47116k84043
$$ plain form
2243.2 702068481 701868057 701341324 701437988 701048355 701395493 702059174 702384186 702516022 702317581 702618332
2252.8 702618332 702400208 702279510 702098389 701927338 701708984 701724701 702016678 701879272 702757721 703113327
2262.4 703113327 702917862 702721558 702519760 702445831 701979828 701938477 701688538 702019196 702265930 702403870
2272.1 702403870 702572632 702128372 702077332 701681137 701483765 700836945 700754166 701000214 700348282 700528488
2281.7 700528488 700712662 701104126 701198425 701345978 701296539 700698166 700754547 700400848 700765152 701044769
2291.4 701044769 701130219 701485214 701751404 702788925 703273087 703557663 703340683 703090591 703298264 703308563
2301 703308563 703703308 703951111 704563446 705366669 706576157 707538910 707789688 708923187 709698334 709756393
2310.7 709756393 709952621 710651932 710808868 709920959 710485306 712279510 714110718 715816727 716586914
$$ packed form
2243.2G02068481k00424n26733R6664l89633L47138O63681L25012J31836j98441L00751
2252.8G02618332k18124j20698j81121j71051k18354J5717K91977j37406Q78449L55606
2262.4G03113327j95465j96304k01798p3929m66003m1351k49939L30658K46734J37940
2272.1G02403870J68762m44260n1040l96195j97372o46820q2779K46048o51932J80206
2281.7G00528488J84174L91464R4299J47553m9439n98373N6381l53699L64304K79617
2291.4G01044769Q5450L54995K66190J037521M84162K84576k16980k50092K07673J0299
2301G03308563L94745K47803O12335Q03223J209488R62753K50778J133499P75147N8059
2310.7G09756393J96228O99311J56936q87909N64347J794204J831208J706009P70187
$$ plain form
2319.3 716586914 717097015 717532196 718096237 719036484 719023132 719197998 720693893 722807541 723771210
2328 723771210 724240189 725940018 726374207 725645218 725142822 725134888 724626846 724975204 726199341 725278702
2337.7 725278702 725716629 726991653 727794113 728333588 728716354 728374634 725936356 723908081 720910950
2346.3 720910950 716612473 711360550 711097946 717193909 721355438 724327164 726662216 728653412
2354.1 728653412 731686935 732272797 735321655 736413498 738248215 739065323 738579636 739028702 737158203
2362.7 737158203 736291656 733925171 732627258 729423141 725858917 723986664 721444321 719215622
2370.4 719215622 715889893 713506470 711090164 708904266 705908661 702711029 700445404 697463303
2378.2 697463303 695382614 692946701 691312332 690444336 688947678 687876129 686644363 685845108 684834442
$$ packed form
2319.3G16586914N10101M35181N64041R40247j3352J74866J495895K113648R63669
2328G23771210M68979J699829M34189p28989n02396p934n08042L48358J224137r20639
2337.7G25278702M37927J275024Q02460N39475L82766l41720k438278k028275k997131
2346.3G20910950m298477n251923k62604O095963M161529K971726K335052J991196
2354.1G28653412L033523N85862L048858J091843J834717Q17108m85687M49066j870499
2362.7G37158203q66547k366485j297913l204117l564224j872253k542343k228699
2370.4G19215622l325729k383423k416306k185898k995605l197632k265625k982101
2378.2F97463303k080689k435913j634369q67996j496658j071549j231766p99255j010666
$$ plain form
2386.8 684834442 683608093 682638702 682095337 682074738 681891098 681746902 681397781 681676559 681956787 681805954
2396.5 681805954 681341934 680405579 679740829 679213104 679041214 678640060 678478622 678278961 678215485 678666000
2406.1 678666000 678467636 678271332 677672958 677171936 676514511 675745087 675193176 674558563 674747162 674381866
2415.8 674381866 674320221 674734726 674796524 674462967 673569031 672939835 672109604 671867294 671399994 670926743
2425.4 670926743 671011887 670623932 670547791 670644608 670823517 670173569 669245682 668430481 667833099 667863312
2435.1 667863312 667376938 667136993 666810684 666848907 667101135 666924210 666614838 665536652 664894409 664279938
2444.7 664279938 663607254 663280945 662768631 662226105 662094345 662299423 662045670 662008972 661697845 660942688
2454.3 660942688 660006790 659104614 658464127 657813187 658087387 658171082 657856216 657627487 657357254 656960068
$$ packed form
2386.8F84834442j226349r69391n43365k0599j83640j44196l49121K78778K80228j50833
2396.5F81805954m64020r36355o64750n27725j71890m01154j61438j99661o3476M50515
2406.1F78666000j98364j96304n98374n01022o57425p69424n51911o34613J88599l65296
2415.8F74381866o1645M14505O1798l33557q93936o29196q30231k42310m67300m73251
2425.4F70926743Q5144l87955p6141R6817J78909o49948r27887q15201n97382L0213
2435.1F67863312m86374k39945l26309L8223K52228j76925l09372j078186o42243o14471
2444.7F64279938o72684l26309n12314n42526j31760K05078k53753l6698l11127p55157
2454.3F60942688r35898r02176o40487o50940K74200Q3695l14866k28729k70233l97186
$$ plain form
2464 656960068 656293335 655657806 654691467 654502869 654031067 653321686 653296127 653052750 653144379 652811966
2473.6 652811966 652508240 651989746 651042023 650310211 649445724 648669891 647828979 647854462 648012314 647891617
2483.3 647891617 647665100 647110367 646914368 646284409 645319443 644413834 643645172 642919388 642609558 642503052
2492.9 642503052 642252197 642248611 641820450 641443863 640529175 639640999 639330521 638539696 637773209 637008018
2502.6 637008018 636668167 636355438 636207047 635958290 635372505 635218964 634674988 634120216 633335075 632560959
2512.2 632560959 632018585 631520424 631439705 631301270 630973129 630303230 630102615 629707298 629089737 628731689
2521.9 628731689 628085327 627415199 626422462 626241798 626386490 626172867 625663948 625061226 625155411 624744949
2531.5 624744949 624080315 623189316 622224503 621656799 621273575 621091728 620878525 620763588 620242004 619975815
$$ packed form
2464F56960068o66733o35529r66339j88598m71802p09381k5559k43377R1629l32413
2473.6F52811966l03726n18494r47723p31812q64487p75833q40912K5483J57852j20697
2483.3F47891617k26517n54733j95999o29959r64966r05609p68662p25784l09830j06506
2492.9F42503052k50855l586m28161l76587r14688q88176l10478p90825p66487p65191
2502.6F37008018l39851l12729j48391k48757n85785j53541n43976n54772p85141p74116
2512.2F32560959n42374m98161q0719j38435l28141o69899k00615l95317o17561l58048
2521.9F28731689o46362o70128r92737j80664J44692k13623n08919o02722R4185m10462
2531.5F24744949o64634q90999r64813n67704l83224j81847k13203j14937n21584k66189
$$ plain form
2541.1 619975815 619528198 619023170 618520470 617388420 617056923 616509323 616184387 616376953 615995979
2549.8 615995979 615507698 615006752 614591522 614014168 613726463 613013954 612288704 612180824 611954231 611711655
2559.5 611711655 611082802 610781784 610449562 610159492 610044174 609321175 608456650 607522888 606932793 606758919
2569.1 606758919 606910210 606563416 605888901 605428047 604872856 604745560 604461060 603984718 603279114 602698097
2578.7 602698097 602369041 602077255 601974564 601436577 601008987 600372658 599889221 599428749 598786163 598648338
2588.4 598648338 597964783 597511902 597285881 596536026 595607338 595127373 595054626 594753265 594635468 594195366
2598 594195366 593412437 592405777 591712074 591310005 590732880 590552673 590300484 590060577 589470177 588879929
2607.7 588879929 588423882 587843094 587279472 586211586 585461578 584813957 584799500 585014076 584307594 583466301
$$ packed form
2541.1F19975815m47617n05028n02700j132050l31497n47600l24936J92566l80974
2549.8F15995979m88281n00946m15230n77354k87705p12509p25250j07880k26593k42576
2559.5F11711655o28853l01018l32222k90070j15318p22999q64525r33762n90095j73874
2569.1F06758919J51291l46794o74515m60854n55191j27296k84500m76342p05604n81017
2578.7F02698097l29056k91786j02691n37987m27590o36329m83437m60472o42586j37825
2588.4E98648338o83555m52881k26021p49855r28688m79965p2747l01361j17797m40102
2598E94195366p82929j006660o93703m02069n77125j80207k52189k39907n90400n90248
2607.7E88879929m56047n80788n63622j067886p50008o47621j4457K14576p06482q41293
$$ plain form
2617.3 583466301 582885971 582694778 581984177 581494560 580997276 580033684 579383011 578847961 578883743 578355484
2627 578355484 577502365 577014885 576734276 576371231 575297699 574517021 574001083 573734703 573305817 572689857
2636.6 572689857 572579231 572287903 571370773 570352402 569959831 569543304 569154663 568470116 567575417
2645.3 567575417 567152176 566800919 566766167 566142273 565473175 565179977 564654083 564278488 563689461 563047104
2654.9 563047104 562511826 562206879 561664696 561188850 561136665 560637589 559885330 559234123 558972168 558789787
2664.6 558789787 558439598 557802010 557290649 557113304 556754951 556458778 555879669 555262718 554805527 554708824
2674.2 554708824 554627838 554025345 553586082 553303490 553218613 552723312 552153931 551718407 551461678 551684685
2683.9 551684685 551069565 550129776 549342728 548972511 548971405 548743362 548282356 547586975 547288551 547009125
$$ packed form
2617.3E83466301n80330j91193p10601m89617m97284r63592o50673n35050L5782n28259
2627E78355484q53119m87480k80609l63045j073532p80678n15938k66380m28886o15960
2636.6E72689857j10626k91328r17130j018371l92571m16527l88641o84547q94699
2645.3E67575417m23241l51257l4752o23894o69098k93198n25894l75595n89027o42357
2654.9E63047104n35278l04947n42183m75846n2185m99076p52259o51207k61955j82381
2664.6E58789787l50189o37588n11361j77345l58353k96173n79109o16951m57191r6703
2674.2E54708824q0986o02493m39263k82592q4877m95301n69381m35524k56729K23007
2683.9E51684685o15120r39789p87048l70217j106k28043m61006o95381k98424k79426
$$ plain form
2693.5 547009125 546848946 546645775 546401062 546105118 545649719 545326614 544218788 543489876 543183975
2702.2 543183975 543036003 543189583 542998276 542685852 541996498 542077217 541908340 541144257 540654907 539932289
2711.8 539932289 539560776 539192963 539285812 539273415 538958855 538619614 538271027 538369598 537918320 537861443
2721.5 537861443 537524605 536585732 536154671 535716133 535484772 535233688 535079269 534820671 534575653 534264183
2731.1 534264183 534095840 534219208 533499146 532858543 532580910 532506180 532235146 531734619 531858330 531814384
2740.8 531814384 531502419 531094971 530886307 530770950 530307312 529932098 529790916 529553642 529158325 529118080
2750.4 529118080 529054565 528924408 528943939 528636627 527819176 527225189 527204895 527019882 526886215 526518059
2760 526518059 525984077 525760651 525724983 525711746 525243683 524920197 524692001 524374084 523933868 523142891
$$ packed form
2693.5E47009125j60179k03171k44713k95944m55399l23105j107826p28912l05901
2702.2E43183975j47972J53580j91307l12424o89354Q0719j68877p64083m89350p22618
2711.8E39932289l71513l67813R2849j2397l14560l39241l48587R8571m51278n6877
2721.5E37861443l36838r38873m31061m38538k31361k51084j54419k58598k45018l11470
2731.1E34264183j68343J23368p20062o40603k77633p4730k71034n00527J23711m3946
2740.8E31814384l11965m07448k08664j15357m63638l75214j41182k37274l95317m0245
2750.4E29118080o3515j30157J9531l07312q17451n93987k0294j85013j33667l68156
2760E26518059n33982k23426l5668j3237m68063l23486k28196l17917m40216p90977
$$ plain form
2769.7 523142891 522397728 522145958 522333641 522190475 521802368 520945816 520259018 519931145 519529991 519588089
2779.3 519588089 519071579 518554764 518365784 517684822 516826935 516622887 516723099 515827293 515525932 515421562
2789 515421562 514526024 513877563 513315506 512950211 512649765 512419014 511728516 510766754 510168686 509439926
2798.6 509439926 508564186 507653809 506925392 506255493 505625801 505029449 504831963 504561577 503711967 503208160
2808.3 503208160 502874222 502341537 501141090 500112457 499471245 498423309 497715912 496939240 496212234
2816.9 496212234 495750809 495219078 494393234 493196564 492129974 491283150 490615082 489662361 488776894
2825.6 488776894 487953377 487278900 486742287 485784302 485231361 484600906 483459015 482065163 480883904
2834.3 480883904 479951477 478653412 477445107 476169662 475033951 473990440 472664413 471132584
$$ packed form
2769.7E23142891p45163k51770J87683j43166l88107q56552o86798l27873m01154N8098
2779.3E19588089n16510n16815j88980o80962q57887k04048J00212q95806l01361j04370
2789E15421562q95538o48461n62057l65295l00446k30751o90498r61762n98068p28760
2798.6E09439926q75740r10377p28417o69899o29692n96352j97486k70386q49610n03807
2808.3E03208160l33938n32685j200447j028633o41212j047936p07397p76672p27006
2816.9D96212234m61425n31731q25844j196670j066590q46824o68068r52721q85467
2825.6D88776894q23517o74477n36613r57985n52941o30455j141891j393852j181259
2834.3D80883904r32427j298065j208305j275445j135711j043511j326027j531829
$$ plain form
2842 471132584 469386902 467558022 465680389 463872223 461780663 459817581 457840424 455893631 454330406
2850.7 454330406 452887077 451954613 450832710 449951973 449422646 448808632 448600578 448748436 449154434
2859.4 449154434 448775291 448136406 447771683 447104378 446506348 446128311 445457077 444237747 443203583
2868.1 443203583 442369385 441735077 441155510 440476341 439271660 437729073 437316589 436949158 436223068
2876.7 436223068 435822945 435551453 434636002 433266449 432798424 432145958 431043282 430133820 429730644
2885.4 429730644 429315300 428242073 427192078 425994682 425313568 424679947 423779221 422936401 421996193
2894.1 421996193 421401711 420178566 418882751 418221436 418039894 417484970 416191101 415510330 415065422
2902.8 415065422 414455719 413661156 412968674 411649742 409999542 409332962 408670082 408119583 407114143
$$ packed form
2842D71132584j745682j828880j877633j808166k091560j963082j977157j946793j563225
2850.7D54330406j443329r32464j121903q80737n29327o14014k08054J47858M05998
2859.4D49154434l79143o38885l64723o67305n98030l78037o71234j219330j034164
2868.1D43203583q34198o34308n79567o79169j204681j542587m12484l67431p26090
2876.7D36223068m00123k71492r15451j369553m68025o52466j102676r09462m03176
2885.4D29730644m15344j073227j049995j197396o81114o33621r00726q42820r40208
2894.1D21996193n94482j223145j295815o61315j81542n54924j293869o80771m44908
2902.8D15065422o09703p94563o92482j318932j650200o66580o62880n50499j005440
$$ plain form
2911.4 407114143 405819206 404894485 403771896 402451439 400783539 399346390 397716599 396187820
2919.2 396187820 395098534 393844223 392765923 391994743 391456528 390791092 390800514 391049385 390886459
2927.8 390886459 391058693 390954285 390457230 390567894 391275749 391319237 391105232 391228905 391816635 392696342
2937.5 392696342 393020172 393540497 394467278 395547867 396349182 396756973 397098999 397421455 398120728
2946.2 398120728 398784790 399406776 399888496 400665741 401810570 402619095 402945557 402965698 403736267 404021339
2955.8 404021339 404167900 404931488 404982681 405471916 406244392 406847878 407641830 408240433 408977051 410057182
2965.5 410057182 410848923 411079178 411364288 411810150 412707214 413857346 414642067 415222054 415969772
2974.1 415969772 416665039 417096329 417724495 418407135 419175949 419634628 419698601 419455528 419330978 420146828
$$ packed form
2911.4D07114143j294937r24721j122589j320457j667900j437149j629791j528779
2919.2C96187820j089286j254311j078300p71180n38215o65436R422K48871j62926
2927.8C90886459J72234j04408m97055J10664P07855M3488k14005J23673N87730Q79707
2937.5C92696342L23830N20325R26781J080589Q01315M07791L42026L22456O99273
2946.2C98120728O64062O21986M81720P77245J144829Q08525L26462K0141P70569K85072
2955.8D04021339J46561P63588N1193M89235P72476O03486P93952N98603P36618J080131
2965.5D10057182P91741K30255K85110M45862Q97064J150132P84721N79987P47718
2974.1D15969772O95267M31290O28166O82640P68814M58679O3973k43073j24550Q15850
$$ plain form
2983.8 420146828 420700684 421031799 421259270 421555443 422146988 422329445 422576180 422501678 422464256 422338676
2993.4 422338676 422000580 421723900 421312828 421394043 421270981 421387787 421226463 420251350 419801636 419657021
3003.1 419657021 419389038 418627357 417764397 417036285 416729202 416459312 415710831 415161285 414596100 414167862
3012.7 414167862 413526993 413021355 412696457 411991997 411252708 410103226 409334259 409017868 408783302
3021.4 408783302 408466682 407708626 407050095 406392479 405282860 403962593 403440590 402872467 401934547
3030.1 401934547 401280632 400182419 399182205 398360519 397614517 397215729 396737175 395832710 394719276
3038.7 394719276 393894081 393168526 392431412 391615105 390788879 390126305 389617043 388525887 387165756
3047.4 387165756 386580734 385969391 385135994 384021416 383072853 382461090 381708260 381340637 380605278
$$ packed form
2983.8D20146828N53856L31115K27471K96173N91545J82457K46735p4502l7422j25580
2993.4D22338676l38096k76680m11072Q1215j23062J16806j61324r75113m49714j44615
3003.1D19657021k67983p61681q62960p28112l07083k69890p48481n49546n65185m28238
3012.7D14167862o40869n05638l24898p04460p39289j149482p68967l16391k34566
3021.4D08783302l16620p58056o58531o57616j109619j320267n22003n68123r37920
3030.1D01934547o53915j098213j000214q21686p46002l98788m78554r04465j113434
3038.7C94719276q25195p25555p37114q16307q26226o62574n09262j091156j360131
3047.4C87165756n85022o11343q33397j114578r48563o11763p52830l67623p35359
$$ plain form
3056.1 380605278 379649849 378855057 377698174 376513977 375961037 375788689 375231285 374593811 373651695
3064.8 373651695 372848740 372184982 371236572 370494919 369533691 368742905 368200684 367772675 367157402 366368752
3074.4 366368752 366081505 365856438 365653954 365075035 364157753 362955551 361657257 360778236 359837418
3083.1 359837418 359420929 359172287 358657494 358262100 357554054 356794167 356288872 355654144 354768829 353902473
3092.7 353902473 353017311 352540131 352129631 351079178 350360870 350052185 349349403 348528404 348067741
3101.4 348067741 347518272 346820068 346034927 345116310 344407082 343934669 343462334 342663307 342021790 341387596
3111.1 341387596 340861053 340347443 339323044 339052582 338394051 337004089 336227264 335382500 334810982
3119.8 334810982 334689178 334447174 333498230 332373047 331770363 331045151 330043335 329046593 328380547
$$ packed form
3056.1C80605278r55429p94792j156883j184197n52940j72348n57404o37474r42116
3064.8C73651695q02955o63758r48410p41653r61228p90786n42221m28009o15273p88650
3074.4C66368752k87247k25067k02484n78919r17282j202202j298294q79021r40818
3083.1C59837418m16489k48642n14793l95394p08046p59887n05295o34728q85315q66356
3092.7C53902473q85162m77180m10500j050453p18308l08685p02782q20999m60663
3101.4C48067741n49469o98204p85141r18617p09228m72413m72335p99027o41517o34194
3111.1C41387596n26543n13610j024399k70462o58531j389962p76825q44764n71518
3119.8C34810982j21804k42004r48944j125183o02684p25212j001816r96742o66046
$$ plain form
3128.4 328380547 327707558 327061386 326528320 325647774 324887619 324415169 323683319 322759819 322119713 321815071
3138.1 321815071 321328812 320178604 319340496 318920498 318157921 317366581 316170921 315307026 314865894
3146.8 314865894 313977566 312980862 312012882 311653271 311494102 311066093 310555973 309671783 308717957 307990437
3156.4 307990437 307123318 306069775 305392017 304898987 304238071 303075848 302155380 302045326 301495152
3165.1 301495152 300486183 299479542 299016094 298881645 298274212 297026520 295683956 295290413 294699421
3173.8 294699421 293952332 293630543 293052082 292520046 291959553 291366634 290316277 289248219 288705292
3182.4 288705292 288105831 287362633 286388512 285615177 285188770 285050373 284706936 283759861 282780495 282336597
3192.1 282336597 282091179 281102085 280145550 279432049 278761559 278552570 277945213 276788311 276131382
$$ packed form
3128.4C28380547o72989o46172n33066q80546p60155m72450p31850r23500o40106l04642
3138.1C21815071m86259j150208q38108m19998p62577p91340j195660q63895m41132
3146.8C14865894q88328r96704r67980l59611j59169m28009n10120q84190r53826p27520
3156.4C07990437q67119j053543o77758m93030o60916j162223r20468j10054n50174
3165.1C01495152j008969j006641m63448j34449o07433j247692j342564l93543n90992
3173.8B94699421p47089l21789n78461n32036n60493n92919j050357j068058n42927
3182.4B88705292n99461p43198r74121p73335m26407j38397l43437r47075r79366m43898
3192.1B82336597k45418r89094r56535p13501o70490k08989o07357j156902o56929
$$ plain form
3200.8 276131382 276373253 276227627 275457287 274740086 273842468 273241005 272926540 272351837 271779404 271233311
3210.4 271233311 270318623 269686375 269580326 269188995 268435974 267776203 267250710 266592484 266195965 265801449
3220 265801449 265461960 265210743 264110126 263234768 262825470 262162075 261732159 261500454 261079235 260839100
3229.7 260839100 260830116 260337849 259692650 259053268 258712349 258530273 257861881 257038078 256384773 256339455
3239.3 256339455 255873890 254956264 254415054 254092102 254035587 253398647 252948437 252946568 252420578 251536293
3249 251536293 250811214 250579967 250431194 250292835 249681778 249052486 248859386 248541641 248263130 247767811
3258.6 247767811 247323246 247023773 246591434 245858765 245393505 245308285 245176201 245391674 244852657 244218807
3268.3 244218807 244143753 243800755 243667278 243189793 242384911 241832161 241621246 241269894 240690136 240449829
$$ packed form
3200.8B76131382K41871j45626p70340p17201q97618o01463l14465n74703n72433n46093
3210.4B71233311r14688o32248j06049l91331p53021o59771n25493o58226l96519l94516
3220B65801449l39489k51217j100617q75358m09298o63395m29916k31705m21219k40135
3229.7B60839100q984m92267o45199o39382l40919j82076o68392q23803o53305m5318
3239.3B56339455m65565r17626n41210l22952n6515o36940m50210j869n25990q84285
3249B51536293p25079k31247j48773j38359o11057o29292j93100l17745k78511m95319
3258.6B47767811m44565k99473m32339p32669m65260q5220j32084K15473n39017o33850
3268.3B44218807p5054l42998j33477m77485q04882n52750k10915l51352n79758k40307
$$ plain form
3277.9 240449829 240254879 239992237 239421635 238973351 238629932 238116474 238029346 238051319 238034172 237985649
3287.5 237985649 237716541 237287312 236991253 236557102 236055431 235849628 235318909 235069561 235211830 234984741
3297.2 234984741 234506664 234007664 234104404 234130898 233364353 233197117 233526840 232952900 232166672 231933079
3306.8 231933079 231652184 231106071 231109409 231472797 231567745 231459560 230647736 229811192 229214172 228745079
3316.5 228745079 228569088 228202724 228211727 228008499 227843685 227659836 226841335 226569099 226090393 225445786
3326.1 225445786 224939690 224386654 223724232 222846050 222855816 223096218 223016815 222429161 221852055 221672688
3335.8 221672688 220799370 219963264 219512100 219291401 219052677 218794098 218660774 218226109 217731476 216962109
3345.4 216962109 216668835 216796570 216529579 216472645 216588478 216310883 215571022 215125847 214818993 214464893
$$ packed form
3277.9B40449829j94950k62642n70602m48284l43419n13458q7128K1973j7147m8523
3287.5B37985649k69108m29229k96059m34151n01671k05803n30719k49348J42269k27089
3297.2B34984741m78077m99000R6740K6494p66545j67236L29723n73940p86228k33593
3306.8B31933079k80895n46113L338L63388R4948j08185q11824q36544n97020m69093
3316.5B28745079j75991l66364R003k03228j64814j83849q18501k72236m78706o44607
3326.1B25445786n06096n53036o62422q78182R766K40402p9403n87654n77106j79367
3335.8B21672688q73318q36106m51164k20699k38724k58579j33324m34665m94633p69367
3345.4B16962109k93274J27735k66991n6934J15833k77595p39861m45175l06854l54100
$$ plain form
3355.1 214464893 214409943 214452400 214469643 214183540 213990936 213664742 212885399 212710075 212901421 212607727
3364.7 212607727 212517872 212801476 212853260 212659168 212033653 211546669 211400280 210894375 210390892 210706215
3374.3 210706215 210942841 210348606 210399895 210687027 210730057 210994034 210949974 210742340 210300522 210117645
3384 210117645 209856167 209511757 209759216 209878807 210073795 210258980 210157356 209717979 209631329 209860687
3393.6 209860687 209518394 209391899 209352303 209540520 209927692 209954243 209679966 209413166 209301548 208908710
3403.3 208908710 209354954 209904022 209669628 209635391 209520016 209591694 209663258 209494705 209629021 210367432
3412.9 210367432 210974026 210794353 210430412 210180035 210359707 210429115 210583820 210822334 210641537 211386013
3422.6 211386013 212198906 212198410 212229748 212551613 212971363 213342800 213734798 213990459 214319458 214462147
$$ packed form
3355.1B14464893n4950M2457J7243k86103j92604l26194p79343j75324J91346k93694
3364.7B12607727q9855K83604N1784j94092o25515m86984j46389n05905n03483L15323
3374.3B10706215K36626n94235N1289K87132M3030K63977m4060k07634m41818j82877
3384B10117645k61478l44410K47459J19591J94988J85185j01624m39377q6650K29358
3393.6B09860687l42293j26495l9596J88217L87172K6551k74277k66800j11618l92838
3403.3B08908710M46244N49068k34394l4237j15375P1678P1564j68553J34316P38411
3412.9B10367432O06594j79673l63941k50377J79672O9408J54705K38514j80797P44476
3422.6B11386013Q12893m96L1338L21865M19750L71437L91998K55661L28999J42689
$$ plain form
3432.2 214462147 214648151 215087833 214856033 214791832 215308342 215495605 215855637 216112556 216167393 216906147
3441.8 216906147 217384548 217542992 218084316 218849335 219563828 219420376 219548874 220437279 221164379 221476021
3451.5 221476021 221745243 222173481 222617264 223240242 223475285 223926258 224750557 225517120 226620808
3460.2 226620808 227233086 227605686 227899895 228253822 228708591 229221058 230035667 230384502 231350002 232557182
3469.8 232557182 233196735 233695507 234353752 235522079 235878983 236042614 236659718 237472248 238339996
3478.5 238339996 238736839 239502563 240234509 240611057 240798683 241651363 243239956 244193325 245249805
3487.2 245249805 246100788 246352177 247279587 248384209 248681278 248988819 249893436 250926533 252318535
3495.8 252318535 253544712 254180450 254634743 255011044 255510025 256654606 257793484 258122139 259003506
$$ packed form
3432.2B14462147J86004M39682k31800o4201N16510J87263L60032K56919N4837P38754
3441.8B16906147M78401J58444N41324P65019P14493j43452J28498Q88405P27100L11642
3451.5B21476021K69222M28238M43783O22978K35043M50973Q24299P66563J103688
3460.2B26620808O12278L72600K94209L53927M54769N12467Q14609L48835R65500J207180
3469.8B32557182O39553M98772O58245J168327L56904J63631O17104Q12530Q67748
3478.5B38339996L96843P65724P31946L76548J87626Q52680J588593R53369J056480
3487.2B45249805Q50983K51389R27410J104622K97069L07541R04617J033097J392002
3495.8B52318535J226177O35738M54293L76301M98981J144581J138878L28655Q81367
$$ plain form
3504.5 259003506 260322914 261478634 262006454 262538490 263735847 264674339 266139851 267482319 268182602
3513.2 268182602 268662300 269411106 270878677 272132931 273366165 274052811 274448318 275415306 276576920
3521.9 276576920 277512569 278383064 279706726 280793381 282392254 283632832 284136677 284863758 286096630
3530.6 286096630 287754326 288504963 290085239 291626759 292754173 294158478 294583321 295893021 296951656
3539.2 296951656 298158073 299875641 301171265 302708092 304213905 305831432 306727390 308048420
3547 308048420 308991489 310049667 311761513 313432083 315716324 316433048 317488003 318648415 320164528
3555.6 320164528 322730446 324041710 325759315 327265816 328397141 329515305 331693726 333690338
3563.4 333690338 334320641 337411804 339207649 340425491 341366043 341631508 345020981 346624908 347468452
$$ packed form
3504.5B59003506J319408J155720N27820N32036J197357R38492J465512J342468P00283
3513.2B68182602M79698P48806J467571J254254J233234O86646L95507R66988J161614
3521.9B76576920R35649Q70495J323662J086655J598873J240578N03845P27081J232872
3530.6B86096630J657696P50637J580276J541520J127414J404305M24843J309700J058635
3539.2B96951656J206417J717568J295624J536827J505813J617527Q95958J321030
3547C08048420R43069J058178J711846J670570K284241P16724J054955J160412J516113
3555.6C20164528K565918J311264J717605J506501J131325J118164K178421J996612
3563.4C33690338O30303L091163J795845J217842R40552K65465L389473J603927Q43544
$$ plain form
3572 347468452 349579048 352361031 354334869 355747185 357950172 359387436 361836967 364148941 365428848
3580.7 365428848 366678162 368659973 371250229 373103752 376890869 379241371 380085411 382392998
3588.4 382392998 382009201 384688072 387826118 390621910 392339211 393362350 397223740 397969933 399982872
3597.1 399982872 404096069 405935402 408883324 410364113 411447449 414249496 416581955 418921280
3604.8 418921280 421672173 424646454 425769310 428970680 430240059 430249176 436345863 439555397 439635391
3613.5 439635391 443234520 443810730 447606850 452257309 453484993 455597801 457134590 459287682
3621.2 459287682 462737160 466373596 469535446 472791977 475556335 478088646 484780617 488963661
3628.9 488963661 482462425 485278206 489485397 494321136 497169724 497900810 500944099 504346199
$$ packed form
3572C47468452K110596K781983J973838J412316K202987J437264K449531K311974J279907
3580.7C65428848J249314J981811K590256J853523L787117K350502Q44040K307587
3588.4C82392998l83797K678871L138046K795792J717301J023139L861390P46193K012939
3597.1C99982872M113197J839333K947922J480789J083336K802047K332459K339325
3604.8D18921280K750893K974281J122856L201370J269379R117O096687L209534P9994
3613.5D39635391L599129N76210L796120M650459J227684K112808J536789K153092
3621.2D59287682L449478L636436L161850L256531K764358K532311O691971M183044
3628.9D88963661o501236K815781M207191M835739K848588P31086L043289L402100
$$ plain form
3636.6 504346199 507835045 509972229 512106323 515045509 517661018 520236435 522632332 525813179
3644.4 525813179 530008507 535851974 536501579 535322037 542218132 544979820 544527016 543018112 547364998
3653 547364998 552825813 557554131 564096603 558779182 559834366 565971375 567815247 569580002 571058311
3661.7 571058311 573724747 575643730 577810669 580111771 581433105 586458054 589790726 590718460
3669.4 590718460 593048363 587729988 589278221 597354546 606936455 610072861 596549835 596824684
3677.1 596824684 603101768 607732239 607408180 607452278 609663086 611843643 613369598 614491653 615020180
3685.8 615020180 618936501 626041222 619515648 615894775 623893852 621707344 620045509 624152451
3693.5 624152451 626031609 628395157 629136047 628031807 629168243 629869690 631957932 635061035 631170273
$$ packed form
3636.6E04346199L488846K137184K134094K939186K615509K575417K395897L180847
3644.4E25813179M195328N843467O49605j179542O896095K761688m52804j508904M346886
3653E47364998N460815M728318O542472n317421J055184O137009J843872J764755J478309
3661.7E71058311K666436J918983K166939K301102J321334N024949L332672R27734
3669.4E90718460K329903n318375J548233Q076325R581909L136406j3523026K74849
3677.1E96824684O277084M630471l24059M4098K210808K180557J525955J122055N28527
3685.8F15020180L916321P104721o525574l620873P999077k186508j661835M106942
3693.5F24152451J879158K363548P40890j104240J136436P01447K088242L103103l890762
$$ plain form
3702.2 631170273 629432220 633566246 635580444 636261978 636627121 639280128 643566818 637454147 640315247
3710.9 640315247 646573334 634968224 636365433 640594330 641457367 641939316 644018173 645968475
3718.6 645968475 643730011 644759064 651109543 650287552 644463882 647548370 649638519 650545425 648972092
3727.3 648972092 647924881 650520554 651078339 656257477 655975494 649381027 656924820 658917694 650673981
3736 650673981 648717957 651062317 651216888 652021942 655641174 652418137 654179230 666314545 661355057
3744.7 661355057 642424927 650003204 656132431 662969513 661202087 650760269 661848755 660185394
3752.4 660185394 650524979 654196243 657341843 660624695 656502533 657532272 663906403 657864304
3760.1 657864304 654004745 658009491 660553741 660917816 663860245 662347946 657593307 659283981
$$ packed form
3702.2F31170273j738053M134026K014198O81534L65143K653007M286690o112671K861100
3710.9F40315247O258087j1605110J397209M228897Q63037M81949K078857J950302
3718.6F45968475k238464J029053O350479q21991n823670L084488K090149R06906j573333
3727.3F48972092j047211K595673N57785N179138k81983o594467P543793J992874q243713
3736F50673981j956024K344360J54571Q05054L619232l223037J761093J2135315m959488
3744.7F61355057j8930130P578277O129227O837082j767426j0441818J1088486j663361
3752.4F60185394r660415L671264L145600L282852m122162J029739O374131o042099
3760.1F57864304l859559M004746K544250L64075K942429j512299m754639J690674
$$ plain form
3767.8 659283981 664186707 665700073 656766281 657841949 661340408 661748657 662447357 662225800 662920990
3776.5 662920990 662995377 665721283 666925354 659912491 661075592 663066711 664043198 666967468 665266876
3785.2 665266876 662950974 663539886 664326096 665122833 665011444 664439011 664028625 664626541 664932327
3793.8 664932327 665560455 668601303 666948318 664240494 666529770 669625931 675837784 672616119
3801.5 672616119 660744095 662494278 664457550 668827591 674437866 666952133 662538147 666697235
3809.3 666697235 668909912 668641129 668095932 667547989 668781967 674290009 674285965 661583481 664385300
3817.9 664385300 669721451 674779282 677766113 662642136 662444534 667882156 670173721 671574249
3825.7 671574249 670976410 667415924 667607422 669151764 671554337 673836975 666609344 667464752 674506607
$$ packed form
3767.8F59283981M902726J513366q933792J075668L498459M08249O98700k21557O95190
3776.5F62920990P4387K725906J204071p012863J163101J991119R76487K924270j700592
3785.2F65266876k315902N88912P86210P96737j11389n72433m10386N97916L05786
3793.8F64932327O28128L040848j652985k707824K289276L096161O211853l221665
3801.5F72616119j1872024J750183J963272M370041N610275p485733m413986M159088
3809.3F66697235K212677k68783n45197n47943J233978N508042m044j2702484K801819
3817.9F64385300N336151N057831K986831j5123977j97602N437622K291565J400528
3825.7F71574249n97839l560486J91498J544342K402573K282638p227631Q55408P041855
$$ plain form
3834.3 674506607 671066589 669907837 677247391 671267776 665240555 672396545 669295349 667326279
3842.1 667326279 673569641 672411575 667842026 669653549 671069031 670448303 671725235 671824951 673770065
3850.7 673770065 679337540 675537338 679398346 667058792 662487488 670496368 669508743 667869034
3858.4 667869034 669958267 672120285 674722290 670572586 670596695 677582016 674700928 667333908 669164124
3867.1 669164124 673206329 678489532 673282547 664298401 666838303 672095032 676136932 667415314
3874.8 667415314 666821976 670814514 670471115 672144012 676377563 673385239 666594620 670713730 671925430
3883.5 671925430 672533188 677909622 668244095 668043213 671277390 671224213 675176697 676300659 669360733
3892.2 669360733 668475800 670718613 669635391 670704498 671823578 674220200 677871628 668682632
$$ packed form
3834.3F74506607l440018j158752P339554n979615o027221P155990l101196j969070
3842.1F67326279O243362j158066m569549J811523J415482o20728J276932R9716J945114
3850.7F73770065N567475l800202L861008j2339554m571304Q008880r87625j639709
3858.4F67869034K089233K162018K602005m149704K4109O985321k881088p367020J830216
3867.1F69164124M042205N283203n206985q984146K539902N256729M041900q721618
3874.8F67415314n93338L992538l43399J672897M233551k992324o790619M119110J211700
3883.5F71925430O07758N376434r665527k00882L234177n3177L952484J123962o939926
3892.2F69360733q84933K242813j083222J069107J119080K396622L651428r188996
$$ plain form
3899.9 668682632 671170959 673690262 668839264 673117905 670884933 669108963 669390488 669408722 671136246
3908.6 671136246 670802078 670489426 670430298 670514603 670109253 669660797 670506210 672296600 670511780 667132950
3918.2 667132950 670734177 672066345 668696976 669711075 671329346 672964630 671652985 668174896
3926 668174896 669301376 671152725 671671143 670437698 670197830 672870636 671647415 669476242 670457611
3934.6 670457611 670284271 669826202 669986420 669999313 669956665 669301758 669938660 671160583 668474731 668065643
3944.3 668065643 669766922 670040741 671133575 669507294 668883514 669659119 667732315 669027710 670241089
3953 670241089 669635391 669533920 669445190 669033737 668093719 668476944 668517609 669545670 670569611 669209442
3962.6 669209442 669110947 668988495 668615189 668432465 668276215 668712234 668237686 668147430 669003525 668935013
$$ packed form
3899.9F68682632K488327K519303m850998M278641k232972j775970K81525J8234J727524
3908.6F71136246l34168l12652n9128Q4305m05350m48456Q45413J790390j784820l378830
3918.2F67132950L601227J332168l369369J014099J618271J635284j311645l478089
3926F68174896J126480J851349N18418j233445k39868K672806j223221k171173R81369
3934.6F70457611j73340m58069J60218J2893m2648o54907O36902J221923k685852m09088
3944.3F68065643J701279K73819J092834j626281o23780P75605j926804J295395J213379
3953F70241089o05698j01471q8730m11453r40018L83225M0665J028061J023941j360169
3962.6F69209442r8495j22452l73306j82724j56250M36019m74548r0256Q56095o8512
$$ plain form
3972.2 668935013 668567734 668843460 669415436 669924774 669527054 669222794 669166641 668811951 668669205 668832321
3981.9 668832321 669466858 668727646 668015366 668467636 668653336 669164200 669392548 669982834 669999466 669095993
3991.5 669095993 669039841 668937683 668683777 668221741 668124313 668998947 669783554 669241409 668468628
4000.2 668468628
$$ packed form
3972.2F68935013l67279K75726N71976N09338l97720l04260n6153l54690j42746J63116
3981.9F68832321O34537p39212p12280M52270J85700N10864K28348N90286J6632r03473
3991.5F69095993n6152j02158k53906m62036r7428Q74634P84607n42145p72781
4000.2F68468628
##END=$$ End of the data block
