##TITLE=$$ Begin of the data block
##JCAMP-DX=5.00 $$ ACD/SpecManager v 10.08
##SPECTROMETER/DATA SYSTEM=Varian
##DATE=14 Jan 2013 10:11:42
##DATA TYPE=INFRARED SPECTRUM
##DATA CLASS=XYDATA
##ORIGIN=
##OWNER=
##NPOINTS=3735
##FIRSTX=399.26403809
##LASTX=4000.35498047
##MAXX=4000.35498047
##MINX=399.26403809
##MAXY=74.10455322
##MINY=20.95132065
##XFACTOR=1.0000000000
##YFACTOR=0.000000100000000
##FIRSTY=42.87897491
##DELTAX=0.96440572
##XUNITS=1/CM
##YUNITS=TRANSMITTANCE
##XYDATA=(X++(Y..Y))
399.3 428789749 415457268 409358635 404691048 405144234 412343178 423670578 427363396 415667496
407 415667496 410453491 409059219 407062798 406106987 407629929 417683067 412475319 406462822 411051788
415.7 411051788 410173874 410721130 406330795 414464951 418903999 411374893 404620132 400212364 405403557
424.3 405403557 410451851 411925507 410081673 406695938 409686432 412915306 409269218 405724144
432.1 405724144 403317375 400565987 401742363 403211784 406773071 409342957 408105278 409223099
439.8 409223099 410276794 409507484 409464798 409627953 406724396 405984993 405153847 400441399 399949989
448.4 399949989 401484451 403733139 406636734 410122986 406520309 400466080 403855400 408647385
456.2 408647385 411970673 402398643 394712067 397703362 401437225 402660828 400989799 403472710
463.9 403472710 402570190 401168098 400351257 391362495 393019562 401533318 403563309 400822754 394940109
472.6 394940109 392529297 394059525 396575317 395294456 394334488 392869339 390826836 391556740 392732010
481.2 392732010 394068375 391349182 387509613 392046661 398608360 395711937 387483711 385684052
489 385684052 390260391 391590614 386537628 385839005 386722679 384924011 385515900 385823593 383916168
497.6 383916168 382163124 381141472 380276833 381481133 384579582 385413933 384729347 384597015 385416336
506.3 385416336 385090866 383639984 381011200 378500099 378449097 379926147 380349236 379418182 379873085
515 379873085 379706535 378515778 377019691 375700264 375261765 374545250 373320694 371800156 373093452
523.7 373093452 372880783 370895233 372015953 371753807 372633514 372914009 371272697 371205559 370150871
532.4 370150871 369905663 370421104 370111656 370933647 371119461 370553551 370590248 370404854 370168495 369060707
542 369060707 367552109 367319908 366384163 365701447 365864639 365336456 365625992 366609650 366741714 364649734
551.6 364649734 362317963 361287384 360073891 359394073 359279556 360385933 361705627 360888748 360592194
560.3 360592194 360574036 360927353 361475983 360296135 360159798 359987411 359915733 360396004 359637718 360468025
570 360468025 361640129 362123222 361876793 360813026 359671135 357792130 357845573 358414383 357968216 358247185
579.6 358247185 359098244 359752388 359396935 358937607 358413658 358795166 359834633 359356728 358428535 358311844
589.3 358311844 358892441 360115585 361546059 361790085 361920891 362278061 362509460 362537689 362071571 362717705
598.9 362717705 363553925 363736420 363464050 362639503 361682587 360651627 360036469 358465576 357484856
607.6 357484856 357755547 357688675 358027916 357720032 356528511 355418854 356185760 356848412 356343117 356921349
617.2 356921349 356947327 356670685 355586700 354730568 355600433 356385498 357555962 359004860 360157776
625.9 360157776 360634880 361395836 362892075 363761673 364684944 366400833 367995567 369143600 369887047
634.6 369887047 370569305 372684746 374772339 375840225 376476250 376605797 377620163 378597183 379744835
643.3 379744835 381538467 382795258 385041313 387678070 388874893 388283615 387427330 387833710 388710976
651.9 388710976 389663887 390481033 391918030 392962494 392553635 391824913 391766777 391691093 390587158 391311722
661.6 391311722 391963768 390890999 389933853 388978004 390234337 395041008 405492477 400129089 394964676
670.3 394964676 393732224 394476280 395687447 396639671 397071190 398250237 399973602 400601807 401043892
678.9 401043892 402911797 404248848 405679016 406256332 406066742 407599373 408823204 409743958 410227661
687.6 410227661 410719070 412241173 412542648 412049026 413272285 414875145 414773064 414854736 415412178
696.3 415412178 415768127 415842094 415938568 416104126 416732597 418514671 418632088 418648262 419815636 420467186
705.9 420467186 421797104 423369675 424159126 423803291 424414749 424940948 424421463 424860039 425598793
714.6 425598793 426436729 426360474 427139969 428779411 430486374 432482758 432468300 433002052 433565521 433055420
724.3 433055420 433001404 433679352 434277611 434905777 436730080 437513618 439172821 441518173 441676178
733 441676178 441818924 442530746 442493324 441595497 442259026 443321533 443780975 444597740 445343170 446311798
742.6 446311798 447081795 447582779 446956139 446854973 447196693 446813698 447545242 449118538 450927849
751.3 450927849 451893578 452509308 453541641 455301476 457479630 458584900 457717361 456839027 458329506
760 458329506 458454475 459507294 462226868 463540344 465041275 465515633 465943031 465736580 466231537
768.6 466231537 466755791 466372681 468241920 468877945 468921967 468597755 468382492 469223328 468641548 468263245
778.3 468263245 468502998 469181709 469167099 468403740 467436981 467893867 470117912 472095909 473779449
787 473779449 473084717 472270012 472660522 473489342 473946762 473214340 473099670 472968597 473602486 473478355
796.6 473478355 472468147 470897331 469708633 469832268 468265152 467396393 466362152 465062447 463969231
805.3 463969231 462186356 460886917 458964615 458003654 456545410 454977989 453992615 452773705 451841011
814 451841011 449508629 447879143 446987076 446472168 446022148 445227547 445585670 445987625 447121773 449008141
823.6 449008141 450816078 452177391 454139748 457281418 459918938 462638016 465477219 468183403
831.3 468183403 470859070 474194756 477290955 480109329 482763863 484284019 486035652 487497520
839 487497520 489883919 492357407 494285545 495922470 496756363 498483429 500367203 502207146 502331924
847.7 502331924 503587418 506494102 507874031 509393463 510605431 511817169 512177048 513920898 516228790
856.4 516228790 517119598 518621483 519772987 522181931 523294258 522835121 523380699 524660454 525554543
865.1 525554543 524971695 524059410 522568169 521939125 520767899 519643211 518994827 517161751 516124802
873.8 516124802 515076637 513202782 511189995 511248550 510992126 509508057 508379135 506759529 505993080
882.4 505993080 505029678 505066528 504898300 504186325 503829269 502434731 502012100 502090683 502726555 502395210
892.1 502395210 502142792 503207703 503848076 504652367 505246353 506391487 506719475 507274284 507586365
900.8 507586365 507479668 508220520 507711601 508466377 510077171 512382317 514751129 516914253 519122925
909.4 519122925 520086479 521649170 521002693 520053940 519964714 519808540 519594116 517077637 514389839
918.1 514389839 511644821 509340897 506836662 504264717 501553040 498245659 495426903 491759644
925.8 491759644 488675079 485252075 482149887 479418068 475847588 473041306 470313263 468656120
933.6 468656120 467192307 465899773 465099907 463957520 463061676 462009010 461462669 460622902 459410629
942.2 459410629 457990685 457091370 456342812 454564285 453563690 453031769 453516655 454106064 453450432
950.9 453450432 452718544 452327614 452384262 451416130 449794693 448338203 447008171 445200195 442557678
959.6 442557678 440454559 439304962 437794952 435398293 433320351 431235237 429326591 427193222
967.3 427193222 425182533 424128304 421793098 418752747 416025200 413575363 411045074 408073463
975 408073463 404700165 400493088 396613655 392833443 388805351 384784546 380527382 375920601 370472870
983.7 370472870 364786644 359817657 355435829 351244698 346716347 341894646 337752914 334003296
991.4 334003296 330227356 326272850 323031082 320896568 318069420 314065456 309849644 306380939
999.1 306380939 303412380 300289631 297118092 294829178 292687531 290124664 288103638 286421375
1006.8 286421375 285004902 283053074 281768188 280572777 278429394 276793346 275184994 273809872
1014.6 273809872 271834927 269962730 267941074 265029526 262248306 259496994 257639141 255644569
1022.3 255644569 254194775 252815037 251045532 249324436 247532711 246555252 244520416 243006325
1030 243006325 242298622 241980915 241099968 239616356 239562950 239446487 240619831 241490479 242366600 243524761
1039.6 243524761 244409008 246063499 246773281 248172455 248735447 248959160 249292870 249003201 248630829
1048.3 248630829 247839603 247793407 246163197 245356216 245028400 244580326 245247498 244398022 243776741 242942486
1058 242942486 243078918 243490124 243606606 244705105 246612549 249289989 250299759 251959686 253825207
1066.6 253825207 254968796 256024075 256997032 258057594 258185196 258763905 259410114 260435791 260593891
1075.3 260593891 261012306 262040958 262086811 263612270 264848232 265591545 265909157 266942501 268401451
1084 268401451 269157257 270768948 271736412 273407974 274767704 276209297 278412132 279811916 281309242
1092.7 281309242 282344494 283692150 285166607 286639118 287422485 288402119 290529575 292231445 294495792
1101.4 294495792 296746178 298306274 299703751 300793724 301009083 302308216 303998814 304437733 305884037
1110 305884037 306966896 307676678 307895126 308462219 310221195 311135502 312086258 312197475 312335052 312608738
1119.7 312608738 311959648 311513767 311726875 312710629 313203850 313799706 314139366 314953995 316315727
1128.4 316315727 317292652 318892784 320150337 321777573 323545876 325637741 328236160 330601349
1136.1 330601349 332485695 334105263 336656418 338184891 339215660 340559464 341450539 342759743
1143.8 342759743 343848000 344204559 344435387 345463142 346197472 346407547 346688766 346940079 347587051
1152.5 347587051 347467499 346954956 346806259 347039566 347017746 346378136 346093445 345493240 344983406 344571877
1162.1 344571877 344228096 344591141 345293617 346680908 348305931 349979820 351925468 354229088 356775970
1170.8 356775970 359392815 361638794 364045525 367399979 370307350 372321892 374550819 377151260
1178.5 377151260 379754486 382112885 384181061 386153221 387116241 387859840 389212303 390690842 392175331
1187.2 392175331 392547035 392712936 393479691 393875809 393370438 393119583 393356667 392459488 390885124
1195.9 390885124 389529800 388847237 387979202 386616020 385568275 384301491 382956276 381879463 380898666
1204.5 380898666 379893913 379213409 378572807 377446785 376581116 376077271 376010895 376040878 375648003 375534096
1214.2 375534096 375518684 375575981 375852356 375822220 375435333 375152969 375125084 375017204 374678040 374576530
1223.8 374576530 374714012 373905792 372900543 372377739 371542320 371058540 370785751 370000343 368811417
1232.5 368811417 367877846 367552071 367142448 366852684 366620140 366175613 365711479 365376091 365238533 365043983
1242.2 365043983 364790955 364108696 363753319 363352051 362325287 361922531 361398277 360976982 360936699 360827293
1251.8 360827293 360884247 360635986 360558167 360700989 360669403 360287781 359977493 359813004 359520531 359699440
1261.4 359699440 360051765 360531731 360992203 361781464 362783623 363143997 363350677 363523140 363788795
1270.1 363788795 364675407 366197472 367290382 367902985 368851624 369983482 371237602 372408142 373554306
1278.8 373554306 374865532 375852928 376503754 377253036 378259850 379794350 381325722 382855339 384686775
1287.5 384686775 386224823 387542725 388640175 389983978 390932236 391413994 392129669 392680817 393356209
1296.2 393356209 394075356 394929390 395559959 396178474 396780014 397213593 397661362 397504539 397586060 397546310
1305.8 397546310 397246475 396525002 395919838 396565666 396904411 396835632 396222382 395362701 395060577 395022736
1315.4 395022736 395078011 394789124 395009995 395852661 396916771 397956696 398745766 399628754 400735817
1324.1 400735817 401549263 401512985 401528130 401671791 401965637 401995544 401395111 400952110 400835495 400787239
1333.8 400787239 400431366 400380287 400289383 400071487 400074425 400402451 400727730 400204735 400614052 401451645
1343.4 401451645 402381706 403277168 403624649 404375954 404680901 404850922 404695015 404464111 404105263 403623047
1353.1 403623047 403906784 403606262 403062096 402642097 402705650 402336121 401519928 400897789 399751205 399830246
1362.7 399830246 399649849 399082031 398754196 398387833 398415718 398057632 397458649 396293564 395541267 395303116
1372.3 395303116 395206604 395050850 394688988 395227242 395122147 394656296 394108276 393847351 393230362 392065048
1382 392065048 391057854 389245834 387957077 387274284 386789017 384919090 382989044 382287636 380694084
1390.7 380694084 379051743 377579651 376214600 373569984 370145149 368393135 366549721 365094414
1398.4 365094414 362584953 360423546 359034081 357131081 355659103 354468040 352242470 349417572
1406.1 349417572 347842064 346259804 344700432 343856239 342503929 341362839 340502396 339720154 338932762
1414.8 338932762 337724648 336776428 336214294 336525269 335019531 334979172 336247025 336797485 337985229
1423.4 337985229 337873039 338195953 339136505 339723396 340727310 341332626 342615814 343186874 344456444
1432.1 344456444 346019020 347483978 349773865 351915588 354201012 354210205 355961037 357801895 359390869
1440.8 359390869 361041069 362008591 363784523 364938698 366406670 367708397 368863068 370175858
1448.5 370175858 371072006 372570038 373441582 374492683 375411224 377089119 378811188 380609131 382508774
1457.2 382508774 381699524 384293976 385353661 387303848 388853951 390070915 392421951 393756866
1464.9 393756866 395755234 397320328 399856491 402365074 404957542 408324738 411181374 414520340
1472.6 414520340 416905060 420285721 423296928 426294785 428788910 430999146 433263054 435405540
1480.3 435405540 437808914 439568405 441487389 443245392 444782410 446642189 447995491 448807259
1488.1 448807259 450519981 451854973 450986862 450618629 450393677 449574661 448789253 448199120 443886757
1496.7 443886757 443386192 443045769 440262985 439209824 437528534 435820694 434467392 434447670 434693794
1505.4 434693794 431778908 428325233 427886162 429362717 429591446 429730453 428555374 426868896 426819801
1514.1 426819801 426673508 426153831 424070282 421642303 421924362 423251076 422078896 420429382 422168350
1522.8 422168350 422757492 424457741 424510918 424431076 424970894 425110703 425858498 426524353 427410736 428710518
1532.4 428710518 430105400 428951797 430198441 431057053 431422691 433484230 432715263 429402275 430421982
1541.1 430421982 432370224 432917862 433707008 435050964 434880753 436026230 436155167 437004204 437186775
1549.8 437186775 436058807 436751556 436973801 438296394 436823616 436803169 438883972 441932068 442363052
1558.5 442363052 433945885 433857460 432100983 432149277 430742455 429482803 426980247 423950996 422814560
1567.1 422814560 420891380 420708237 413775520 410570068 408297653 404562988 401545181 398458061
1574.9 398458061 397736282 386956100 384439278 381293373 377074432 372989540 367305489 363497086
1582.6 363497086 357814026 354437065 349526062 345225830 340977325 336088142 333224525 327660980
1590.3 327660980 324654579 319231701 315532017 311747742 307211494 304558048 299616909 297637997
1598 297637997 293322811 291115837 287875557 284348526 282025661 278183708 277442741 274096222 272799206
1606.7 272799206 269801311 268408928 267172012 264341717 264476814 261917439 262145405 260318298 260728855
1615.4 260728855 261371193 256835480 258334751 256766453 257692204 256891842 258430977 258156452 256184959
1624 256184959 258033676 257792969 260391235 259853420 260928154 261405544 262430840 263920155 264267101
1632.7 264267101 266987343 267635784 271075974 269404068 271861591 273441429 274292507 276415482 276304436
1641.4 276304436 278801708 279480476 281795101 283713284 283856583 286954803 285832233 288229675 288599339
1650.1 288599339 291170025 292822590 292871227 295618057 293674183 296096325 296346321 298216515 298742943
1658.8 298742943 300048199 301978188 303761368 306979256 306581688 309553356 311305943 314016457
1666.5 314016457 316550522 318580513 322562752 324104652 328887939 331044197 334453392 337247581
1674.2 337247581 339989891 344285316 347441635 352167778 355196533 360222931 363656387 367804565
1681.9 367804565 373336258 376646042 383165398 383947792 389405975 393730354 398519287 404050713
1689.6 404050713 408704185 414091721 418912354 424398613 429276886 435283585 439197998 443711090
1697.3 443711090 450005608 456827583 467122002 465485916 470035591 474886932 479605484 483510208
1705 483510208 487112846 490717468 493954697 498307610 501604156 504236946 506822815 509869194 513524590
1713.7 513524590 515826874 517931519 521232414 524417496 521630440 523165512 526157646 528241997
1721.4 528241997 530475960 532222672 533337097 534681015 536051483 537625732 539743729 541920242
1729.1 541920242 542537956 543268776 546249123 549873047 552159615 549728546 551167030 554335365 556644630
1737.8 556644630 559554405 561584702 561292763 564885712 568190575 569867783 572157326 575579758
1745.5 575579758 579305000 582711678 586382217 589031754 593161507 595913887 598156929 602725296
1753.3 602725296 605944214 609419136 613459053 615525627 617579880 620536118 623385048 627356567
1761 627356567 628901062 629044800 631912384 633757019 635582466 637790985 640151825 639732628 641491699
1769.7 641491699 646045990 648184433 648067093 646489334 649546127 652022781 651782608 653576355 654649124
1778.3 654649124 656481018 657507477 657440643 658824997 660621262 662413177 662679596 663325424 664968719
1787 664968719 666610184 667208481 668408356 669760666 671278992 671024475 669666672 672628403 674110489
1795.7 674110489 674209137 675369720 677228851 678391876 677695999 679766998 680072327 680338211 681673889
1804.4 681673889 682340622 683395538 684193649 685290222 686108017 687575150 687239761 687322769 688484116
1813 688484116 688793335 689605255 689746857 691052551 691664734 692301407 693277893 693345795 694170609 693967361
1822.7 693967361 695180206 696611710 695565643 695201187 696475830 698760452 699775162 697756577
1830.4 697756577 697587357 699590530 700071335 700259857 700530624 701103210 702323227 701991501 702896118
1839.1 702896118 703026047 703218079 703692780 704870834 706473312 702721252 704245987 706187286 706466446
1847.8 706466446 706030655 706168747 707429276 707566071 708447800 708277130 708214111 708675995 708938904 709525681
1857.4 709525681 709535065 710340805 710435867 710802307 710725784 710939484 711558456 711373596 711912994 711653824
1867.1 711653824 712741852 712748871 712130585 713104858 713405838 714040298 714194794 714532089 714405746 714497147
1876.7 714497147 714334183 714145889 714514847 714264526 714963531 714954453 715542526 716264572 716242828 716674423
1886.3 716674423 716453781 717010880 716937943 715612869 715475006 716316605 716517715 717042694 718152390
1895 718152390 717927399 718639908 718802109 718673859 718584976 718361969 718276596 717666931 717880325 717921295
1904.7 717921295 718757324 719375229 719705048 720200500 720128784 720132523 719504013 720064926 719528427 718977585
1914.3 718977585 719337234 719678345 721113586 720109634 719693680 720207062 720781784 721795273 720965729
1923 720965729 719993820 719982452 720555954 720266495 720132065 720289917 720595398 721223297 721246490 721427917
1932.6 721427917 720931625 721158295 721174622 720736084 720681458 720627747 721083984 720811234 721623993 721918869
1942.3 721918869 720709763 720788727 721161957 721218109 720474319 720493164 720604019 720626144 720431519 720453186
1951.9 720453186 720897293 720740814 720895691 720239944 719967957 720193253 720277252 720181198 719757614 720055695
1961.6 720055695 719939270 719969788 719763794 719840088 720027771 719470825 719382477 719359283 719764328 719565277
1971.2 719565277 719809952 720250854 720254593 720469589 720100250 719888000 719115982 719083481 719216309 718801651
1980.8 718801651 718884659 718922043 719291992 719278793 719525757 719619141 719515686 718928223 718123016 718324356
1990.5 718324356 718182373 718155594 717967529 718326950 718597336 718409348 718529739 718330002 718532791 718062286
2000.1 718062286 717624435 716957169 716534958 716802139 716646271 717179031 717272263 717458725 717427368 717333908
2009.8 717333908 717362366 716477890 715882645 715459595 715450821 715245361 715420227 715674133 715712891 715948257
2019.4 715948257 715731049 715971527 715291977 714658127 714088898 713549500 713636856 713323212 713667526 713790665
2029.1 713790665 714182053 714084702 713556137 713498993 713080063 713114700 712912064 712838898 712526321 712346802
2038.7 712346802 712405548 712373047 712399673 711974792 712274399 712062912 711935349 711724777 711322937 711394730
2048.4 711394730 711058426 711210709 710984955 711144485 710855560 710454407 710637970 710159683 710298691 710057449
2058 710057449 710073853 709932632 709925842 710363846 710107269 710325012 710145264 709976807 709514999 709243469
2067.6 709243469 709219894 708979340 709165268 709095306 709488525 709351654 709496613 709718018 709457932 709585190
2077.3 709585190 709046478 708413391 707800522 708026047 708112793 708018723 708245163 708411942 708981247 708292007
2086.9 708292007 707700577 707425919 707127228 706730118 706298141 706709824 706761551 707020416 706991348 707109375
2096.6 707109375 706913910 706286850 706306839 705925446 705803375 705240326 704932632 704960098 704954605 705314026
2106.2 705314026 705653839 706055603 705381775 705036697 704854813 704415741 704049988 703947449 704013977 703275909
2115.9 703275909 703538818 703686447 703824234 703952560 703484650 703449478 703079758 703097229 702780914 702733688
2125.5 702733688 702520981 702349091 703006897 702891235 703125916 702858582 702690353 702730865 702489700 702584381
2135.1 702584381 702170792 702040558 701951904 702167358 702444077 702838135 703065491 702825623 702729340 702331161
2144.8 702331161 702441330 702334290 702473907 702656937 702676773 702912369 702588425 702517014 702077789 702119293
2154.4 702119293 702106705 702055130 702350082 702068558 702310333 702433243 702890091 703023071 702945480 702816315
2164.1 702816315 702474899 702693481 702189484 702080765 702010727 702183990 702373810 702595901 703358231 702890549
2173.7 702890549 702709351 702440186 702337036 702255096 702080841 702558212 702452164 702885208 703214111 703603592
2183.4 703603592 703746414 703688278 703654633 702946396 702861481 702433929 702432327 702577362 702845230 703465958
2193 703465958 703747559 704282990 703986664 704123917 703989182 703602219 703446350 702885513 703075867 703157578
2202.6 703157578 703615646 704079132 704397354 704384384 704083710 704104614 703676300 703623505 703410339 703427277
2212.3 703427277 703460999 703362274 703623199 703852921 704502335 704621124 704587097 704341202 704215622 703960648
2221.9 703960648 703443069 703718033 703768845 703999405 704349136 704853439 704798965 704585953 704622574 703971100
2231.6 703971100 703914642 703671722 703723755 703831177 703796844 704120560 704180069 704368820 704029846 704275284
2241.2 704275284 704162445 703787460 703782272 703376770 703420410 703307495 703798294 704013748 704323120 704907150
2250.9 704907150 704788513 704871216 704630508 704558716 703934860 703577499 703648224 703653107 703932724 703937149 704626083
2261.5 704626083 704785233 704768753 704561310 704317398 704284744 703831253 703974838 703696136 703867187 703915176
2271.1 703915176 704195328 704680328 704242172 704264755 703680649 703573685 703240128 702961349 702926102 702180939
2280.8 702180939 702589417 702837067 703229370 703161011 703101044 703299561 702612839 702771149 702683182 702852707
2290.4 702852707 702970352 703237991 704250717 704655838 705129776 705212860 705404358 705306702 705371857 705546188
2300 705546188 705238113 705874176 706014709 706465073 707601471 708483582 709259872 709761963 710576172 710880127
2309.7 710880127 711209412 711602402 711911316 712251129 712025375 713229675 715092163 716169586 717406158
2318.4 717406158 718720779 720034103 720200500 720301132 721408615 721528244 721739120 723066788 724712524
2327.1 724712524 725509109 726160812 727460251 727630081 727061386 726269302 726212082 726113586 726405029 727596359
2336.7 727596359 727198257 727713318 729313507 730301895 730168686 730105515 729525452 728214569 727239761
2345.4 727239761 723507080 718401718 712860565 712760468 718803482 722327805 725276718 729014893
2353.1 729014893 732342834 735046997 734483948 736768799 738223953 740161438 739795074 738985443 741045532
2361.8 741045532 740458221 739162064 736766205 735112381 731289978 728075562 725888977 723356705
2369.5 723356705 721608276 717695923 714867554 712520752 710458984 707728729 704311447 702216568
2377.2 702216568 699537811 697127686 695250320 693989639 692637939 690896835 689564667 688483200
2384.9 688483200 687799683 686698151 685627670 684460220 683874207 683846054 683484879 683437805 683271179
2393.6 683271179 683881836 684022064 683575668 683175888 681999588 681286545 680837250 680719757 680557632
2402.3 680557632 680344162 680162811 680098114 680505142 680473251 680191269 679377365 678865433 678422775 677571106
2411.9 677571106 676922836 676705780 677121277 676785889 676727524 676740723 676356964 676327362 675798187 675128250
2421.6 675128250 674462433 673887405 672979584 672593613 672642288 672169418 672026596 672199631 672492371 671816788
2431.2 671816788 670978088 670424652 669820023 669488754 668887939 668574295 668316269 668704147 669008636 668371048
2440.8 668371048 667780304 667292480 666819839 665803299 665133667 664979630 664868240 664607010 664463196
2449.5 664463196 664544601 664123077 663867645 663189774 662532959 662061005 661433487 661010895 660431976 660147781
2459.2 660147781 659638138 659506836 659493790 659374008 659099045 658061447 657182617 656098862 655736160
2467.8 655736160 655391922 654782104 654932632 655087204 655277176 654733658 654007416 653251724 652552795 651932755
2477.5 651932755 650951462 650230942 649643631 649599991 649481583 649531479 649289932 648345337 647994843 647548370
2487.1 647548370 646916885 646071701 645336227 644853363 644432373 643902512 643454208 643564148 643457947 643168488
2496.8 643168488 642089767 641345291 641109085 640317535 639732208 638924904 638415260 637881889 637773361
2505.5 637773361 637947388 637508621 637021599 636045570 635483856 634997826 634417686 633851967 633288383 633303909
2515.1 633303909 632996521 632312279 631599655 631683197 631529083 630737076 630307617 629696465 628989487 628342552
2524.7 628342552 628204536 627950020 627529793 626955147 626436043 626346893 625701675 625423965 624920883 623994064
2534.4 623994064 623561707 623387527 622895660 622199402 622312202 622080917 621752815 621133118 620256691 619881935
2544 619881935 619029388 618381004 617835732 617664452 617555351 617030869 616696396 616459427 616285400 615744438
2553.7 615744438 615474930 614866486 614060974 613845482 613673897 613269615 612508926 612239723 611869507 611716385
2563.3 611716385 611604424 610736237 609848213 608873177 608423882 608267975 608339005 608248711 607607079 606972275
2573 606972275 606411057 606234055 606140594 606068115 605253372 604269562 603878403 603511124 603277664 602840958
2582.6 602840958 602516136 602121582 601736145 601091957 600261726 599798050 599315605 599148026 598541336 597797737
2592.2 597797737 597240601 596905708 596830711 596438713 596235962 595726280 595186844 594551392 593568687 592542496
2601.9 592542496 592013779 592280235 592086563 591616364 590866966 590269928 589785004 589134941 588589249 587719574
2611.5 587719574 587198143 586630745 586488876 586186638 585434113 585221291 584700279 584202881 583481674 583034058
2621.2 583034058 582552490 581828613 581357765 580565567 580392036 579908981 579187851 578866081 578423386 577755356
2630.8 577755356 576929436 576502647 575783653 575138931 574462204 573750000 573468513 573055191 572514763 572028809
2640.5 572028809 571918106 571207352 570299721 569695053 569017105 568526535 568014755 567742233 567226830 566914291
2650.1 566914291 566719551 566271362 565983391 565432854 564759636 564087906 563573570 562661552 562072144 562025833
2659.8 562025833 561846352 561748047 560880508 560230827 560123100 559875183 559498558 558924484 558250732 557532616
2669.4 557532616 557360497 557314644 557209320 556700020 556118813 555884895 555627403 555513916 554937439 554693222
2679 554693222 554518890 553795319 553114853 552867317 553016663 552430992 551684189 551038475 550709419 550427208
2688.7 550427208 549700623 549202805 548700142 548519783 548391953 548549042 548695831 548329811 547638550 546740990
2698.3 546740990 546576920 545985718 545178871 544804001 544495735 544339714 543996696 543802223 543586617 543580132
2708 543580132 543267670 542614326 541987648 541685715 541630669 540897598 540935707 540835838 540170746 539931374
2717.6 539931374 539575539 539320374 539023170 539270744 538977776 538033600 537549629 537268410 537157326 536898079
2727.3 536898079 536830978 536464958 536211090 536086082 535783081 535537300 534695282 534250145 534070740 533785820
2736.9 533785820 533530693 533498077 533553047 533254242 533293839 533004913 532648010 532491875 532253532 531976166
2746.5 531976166 531527672 531317520 530928307 530735321 530467529 530016403 529942703 529752502 529432640 529070587
2756.2 529070587 528896027 528708115 528462639 527970619 527317848 527169762 527201958 526950569 526570969 526386909
2765.8 526386909 525844460 525400238 525212250 524632111 524080505 523882599 523972282 523557091 523063927 522669487
2775.5 522669487 521958809 521385612 521166229 521049194 520370445 519935417 519677925 519104691 518362999 517564087
2785.1 517564087 517289772 517117958 517082520 516660233 515853157 515261345 514903755 514653320 513837547 513225975
2794.8 513225975 512837448 512538910 512095909 511164818 510275726 509184303 508488312 508238831 507818527
2803.4 507818527 506779099 505922012 505587616 504845543 504310837 503761482 503204460 502356644 501162567
2812.1 501162567 500565758 500026817 499251099 498401604 497692184 496871796 496229477 495559654 494712868 493969040
2821.8 493969040 492682457 491906700 491484528 490819435 489930840 488711815 487890625 487038803 486063309
2830.4 486063309 485200081 484534378 483369370 481922531 481067047 480032005 478978004 477997284 477160683
2839.1 477160683 476138306 474778328 473352547 471218910 468969383 466852798 464675789 462670631
2846.8 462670631 460818481 458927956 457083473 455140762 453250847 452327080 451668091 451049843 450489388
2855.5 450489388 450094566 450023956 449775009 450019989 449801941 448844910 448253479 448033333 447773170 447358398
2865.2 447358398 447184677 446362267 445058212 443998985 443007889 441941605 440845413 440091476 439230118
2873.8 439230118 438498039 437948570 437256012 436889000 436746788 436161003 435100021 434112511 433356209
2882.5 433356209 432673073 431487579 430471611 429830437 429154243 428573265 427541885 426862679 426113663
2891.2 426113663 425043068 424114304 422790642 421902199 421345177 420690346 419790192 419049454 418304520
2899.9 418304520 417230453 416979256 416614151 415606232 414521866 413497009 412726479 412175102 411710663
2908.6 411710663 410751266 409397392 407886009 406658401 405693398 404635849 403470612 402136841 400696335
2917.2 400696335 398885841 397346344 396112976 394885178 393797989 393350639 393365974 392349472 391604881
2925.9 391604881 391725197 391769257 391973953 392209091 391962814 391584053 392018089 392226601 392149277 392328720
2935.6 392328720 392798424 393539543 393768845 394321747 395256882 396397247 397463875 397978325 398683128
2944.2 398683128 399259109 399699287 400365829 401217117 401759682 401995430 402406693 402890091 403604660 404239540
2953.9 404239540 404625854 404936371 405257416 405386620 405940857 407179146 407632713 407656746 408292694 409109497
2963.5 409109497 409789429 410638542 411264420 411917343 412726974 413272820 414224014 414905586 415710487 416536751
2973.2 416536751 416986351 417986031 418423424 418975754 419944420 420462112 420709305 420778923 420846863 420691566
2982.8 420691566 420996056 421650391 422189789 422381248 422550392 423075371 423263092 423562889 423596191 423335495
2992.5 423335495 423319244 423374557 423209724 422822495 422871819 422560272 421822090 421440544 421460648 421044502
3002.1 421044502 420229263 420130920 419875565 419426346 419192047 418665504 417814026 417182121 416718254 416215172
3011.7 416215172 416008301 415271606 414494057 413719673 413150711 413197365 412176208 410818443 410188141
3020.4 410188141 410007172 409516525 408606491 407745476 406619186 405531120 404663429 404305077 403821793
3029.1 403821793 403304253 402817917 401793365 401313896 400836334 399973984 398734818 397545090 396847496
3037.8 396847496 395931931 395146103 394501495 394014626 393288155 392382126 391817245 391106606 390098000
3046.5 390098000 388941002 388239326 387587242 386694794 385695419 384584885 384034691 383688965 382802734
3055.1 382802734 381629333 380770569 379790802 378798523 378004456 377194862 376669350 376245041 375812683
3063.8 375812683 374922295 374283562 373979874 373095398 372134209 371204834 370750847 370271912 369210091
3072.5 369210091 368121185 367340851 366866684 366397285 366218567 365848846 365147514 364231720 363407707
3081.2 363407707 362849655 361979103 361335678 360410614 359570274 359411469 358889618 358100433 357338943 356783409
3090.8 356783409 356171417 355536842 354935341 354091988 353263893 352422867 351991768 351679916 351029778 350484657
3100.5 350484657 349779930 348902740 348133469 347198944 346289978 345601692 345025482 344472160 343966560 343617172
3110.1 343617172 343003464 342394180 341823921 341134758 340333099 338873863 338014870 337854652 337480965
3118.8 337480965 336889572 336030731 335213432 334092178 333276863 332750931 332130165 331436539 330239639
3127.5 330239639 329526901 329027710 328182945 327496643 327178650 326754913 325812912 325059052 324421997 323719368
3137.1 323719368 322786522 321857147 321145058 320320778 319692669 319300289 318829498 317858276 317064896 316441841
3146.8 316441841 315598850 314868164 313858604 313070469 312372952 311717510 311181946 310263271 309564686
3155.4 309564686 309101315 308422699 307531281 306971645 306487751 305504398 304269638 303298149 302900887
3164.1 302900887 302549324 302117233 301667194 301202793 299972725 298363571 297647820 297027416 296627007
3172.8 296627007 296392727 295745583 294687309 293724747 293311958 292682991 292361774 291857948 290680256
3181.5 290680256 289861908 289154739 288323631 287507725 286931744 286355762 285849075 285678692 285263405 284408474
3191.1 284408474 283498917 282828274 282248631 281481476 280732307 280457230 279684772 278555260 278307495
3199.8 278307495 278197918 277666492 276741924 276050396 275632286 275185146 274600525 273666172 273275890 272914906
3209.4 272914906 272041092 271314621 271226025 271151409 270180969 269383335 268749886 267917709 267528133 267623520
3219.1 267623520 267201462 266288548 266004276 265552406 265116425 264794884 263911095 263228645 262805920 262430382
3228.7 262430382 262228146 261840153 261230793 260967922 260444794 259748421 259309368 258645039 258208942 257680035
3238.4 257680035 257286224 257074394 256466064 255868969 255217152 254682274 254438076 254273071 253484440 252501087
3248 252501087 252014198 251780071 251778698 251452141 251128006 250739689 250065289 249548492 249315529 249348793
3257.7 249348793 248967075 248283234 247503834 247236481 247196770 246839962 246930580 246753769 246083183 245420475
3267.3 245420475 244978962 244489803 243867702 243661480 243563805 243318481 242669220 242177620 241940651 241439552
3276.9 241439552 241206493 241305275 241269703 240824699 240185509 239618797 239415550 239025154 238690643 238773899
3286.6 238773899 238519001 238381844 237949257 237491894 237215252 236762123 236893463 236934128 236546497 235998440
3296.2 235998440 236115303 236505108 236167889 235693512 234981613 234480057 234219856 233854733 233631992 233484440
3305.9 233484440 233112297 232980061 233075275 232317371 232102509 232065048 231393032 231079292 230723171 230830688
3315.5 230830688 230643845 229781876 229313431 228896847 228282757 227614822 227422962 227598801 227461033 226846485
3325.2 226846485 226242332 225683422 225248909 225002441 224239960 223496571 223010101 222822132 222813568 222589588
3334.8 222589588 222467499 221814651 221031494 220696316 220352898 219999504 219457703 219119606 218925762 218144226
3344.4 218144226 217631798 217790298 217497406 216895638 216645546 216971245 217118893 216426353 215887299 215604401
3354.1 215604401 215253830 214863796 214799118 215037708 215012798 214779816 214168644 213847885 213785133 213461456
3363.7 213461456 213328133 213325386 213229580 212816620 212485542 212317581 212352638 212572861 212295303 211656570
3373.4 211656570 211297207 211445866 211462078 211401577 211396999 211247692 210983391 210842190 211209450 211013317
3383 211013317 210598106 210704079 210723934 210567741 210216026 210231590 210392056 210455818 210632744 210707760 210545483
3393.6 210545483 210171471 209950676 209678783 209513206 209761639 210021610 210014153 209848690 209874001 210177555
3403.3 210177555 210250759 209894466 210207424 210760555 210642128 210189533 209841442 210097008 210284996 210162392
3412.9 210162392 210269241 210760365 211262722 211612835 211540852 211096687 211717205 212446079 212496986 212578716
3422.6 212578716 212672558 213034592 213055878 213005657 213299561 213828049 214343815 214474754 214171200 214114189
3432.2 214114189 214934158 215617237 216163826 216467743 216653023 216761818 216544991 216795368 217005177 217662258
3441.8 217662258 217960758 217757626 218141747 218645306 219728680 220266018 220714912 221472721 222040939
3450.5 222040939 222354832 222130871 222564335 222924080 223413239 224459362 225413628 225951958 226205406
3459.2 226205406 226996250 227654133 228142281 227934456 228371048 229737434 230438690 231119080 231173210 231669445
3468.8 231669445 232698841 233686581 234455872 234569206 235236435 235861092 236544437 237283840 238379135
3477.5 238379135 239327717 239551525 240328426 241005440 242245045 243126106 243552513 244552650 245393867
3486.2 245393867 246216164 246236305 246608124 247691555 248544350 248998146 249668598 251201210 252448292
3494.9 252448292 253228054 253452892 254441242 255816536 256354771 257202225 258390884 259596424 260000782
3503.6 260000782 260604324 261568851 262220249 263167439 264223804 265256481 266171017 267314091 268002949
3512.2 268002949 269144421 270532818 271059780 272105007 272959328 273644485 274586048 275836029 276938381
3520.9 276938381 277891941 279345131 279993458 281094532 282285137 283072281 284681416 286069775 286967831
3529.6 286967831 288167439 289212666 289679031 291031780 292765312 294371738 295417328 295788460 296965733
3538.3 296965733 298092365 299751587 301277027 302473488 303930035 305079918 305985909 307193050
3546 307193050 309782810 310664692 311732216 313750782 315169849 317111015 317922535 319492874 320827866
3554.7 320827866 322205620 324340210 325454025 327269096 328859138 330386696 331566200 333569031
3562.4 333569031 335595436 336674004 339924431 341144409 342631378 344249535 343811531 346475067
3570.1 346475067 348946800 350738144 352420807 354236870 355471497 357503395 360444260 361619186
3577.8 361619186 363912888 366146660 367427330 369353447 371856728 373857498 375041275 378856049
3585.5 378856049 381585808 382400589 385239334 385591850 387391853 389843254 392652130 395012245 396885071
3594.2 396885071 400597649 401027451 402617493 406293373 408360062 411800804 413743515 414658203 416698341
3602.9 416698341 418524895 420973434 424190369 427599144 428601151 431813278 432894173 432357597
3610.6 432357597 438321877 441185913 441174049 445104790 446203651 449896240 454542694 457154121 459378929
3619.3 459378929 460064316 462479057 466145821 469487648 472317848 475452003 478216133 480902748
3627 480902748 487123413 491514359 486403198 489018669 493271179 498172073 500939026 500766640 503576469
3635.7 503576469 507537804 511100807 513321915 515220146 517818527 520752716 523679161 525847816
3643.4 525847816 528273048 531414185 536995850 539579697 538928833 545614586 548411484 546375084
3651.1 546375084 545715714 550788994 556308632 561260910 568054733 562837257 562706680 567607727 570000000
3659.8 570000000 572700233 574117050 577278900 579691658 581538315 583784294 585131645 589895439
3667.5 589895439 593085480 593784065 595977669 591275024 592915955 600926514 610384521 613681145
3675.2 613681145 600154533 599771042 606804276 611404800 609331703 609550896 612525406 614706421
3682.9 614706421 616401978 617954712 618484802 621927490 629449921 624329605 620265083 628633308
3690.6 628633308 625835457 623091507 627271194 628692665 630552368 631598434 631424942 632970352
3698.4 632970352 633440323 635565147 638362694 634314117 632697563 636849174 638892097 639265289 639672127
3707 639672127 642485580 647567825 641990967 643599777 648951569 637985992 640102768 644042358
3714.8 644042358 644517670 644803619 646899033 649487610 647280807 648092499 654171677 652953720 647258301
3723.4 647258301 650456085 652873459 654025345 652463379 651119080 653913574 654842072 659826431
3731.2 659826431 659483337 652610321 659606018 660283203 651980286 651235428 653514252 654440842 656709213
3739.8 656709213 660395203 656344299 657827835 669164505 663354721 645944138 653657761 658836670
3747.5 658836670 663894119 663189087 655197906 665157700 662403030 653608780 657484131 660913773
3755.3 660913773 664601974 660075989 661061020 667427979 661580276 658144455 661679306 663378906
3763 663378906 663368454 666809006 665299377 661324768 663853226 667941895 669396133 660764923 661413193
3771.7 661413193 664744034 665078888 665920715 665637054 666709290 666969757 669470749 670212479 662844315
3780.3 662844315 664464417 666684341 667598801 669333267 667441101 666708984 667139893 667511444 668229828
3789 668229828 667873306 667738037 668024445 668538132 668605957 669886093 673267136 671082764 667163696
3797.7 667163696 668292007 671786118 679060287 676358185 663530197 664644852 667309647 672042694
3805.4 672042694 677958832 671060486 665408096 669278641 671569824 671358490 671193542 670706100 672035751
3814.1 672035751 677714691 677911301 664801865 667415771 672731476 677325974 680316391 665866623
3821.8 665866623 666002579 670754700 672490311 675013428 675259781 671230392 670777817 672806244 676407242
3830.5 676407242 678783035 671293335 671770325 678034515 673815079 672764816 681160126 675769577
3838.2 675769577 669431076 676875534 673382950 670794296 676741562 675637436 671400833 672958145
3845.9 672958145 673999252 673671570 675041504 674773865 676753540 681985168 677196350 679470215 666817551
3854.6 666817551 665227509 674494934 673841782 671781616 672937241 674741211 678052979 674395065
3862.3 674395065 673992462 680302277 677021027 670405731 672819977 677468414 683582230 677131424
3870 677131424 666785660 670532990 676668015 680503845 671052704 670542984 674831009 674374008 675762711
3878.7 675762711 680056076 677409821 670378189 673865356 675068893 676348343 681650238 671999054
3886.4 671999054 671498337 674041519 674372787 678865051 680108643 672400589 671048279 673847656 672865677
3895.1 672865677 673787384 674658432 676445541 679195251 670561295 674614868 677066193 671530762 675719604
3903.8 675719604 673982849 672685089 672545166 672866516 674969177 674785461 674517975 674040375 673718719
3912.5 673718719 673501968 673820038 674966965 677200241 675498199 671260910 674777832 675952225 672291565
3921.1 672291565 673139954 674622498 676099167 674908752 671520767 672130127 674344406 675417099 674124756
3929.8 674124756 673525620 675292664 673841019 671695862 672572021 673250046 673609085 673832855 673850098
3938.5 673850098 673405914 672396622 673687592 675981064 673363190 671319885 672647476 673630295 674271011
3947.2 674271011 672888947 672884445 673765106 672099991 672971878 673383713 672505264 672778091 672956161 673066864
3956.8 673066864 672666855 672730331 672097015 672202835 672849655 671520157 671599960 672395935 672513123 672733536
3966.5 672733536 672950897 673084946 672845688 672649078 672900696 672678146 672045822 672544022 672863922 672408371
3976.1 672408371 672016144 671790314 671655807 671477127 671775208 671892929 671745453 671774673 671972580 671594772
3985.7 671594772 671598129 672703323 672833633 673092270 673111343 672723618 673047943 672778778 672457962 671480255
3995.4 671480255 670598221 671455841 672504578 672375717 672413788
4000.2 672413788
##END=$$ End of the data block
