##TITLE=$$ Begin of the data block
##JCAMP-DX=5.00 $$ ACD/SpecManager v 10.08
##SPECTROMETER/DATA SYSTEM=Varian
##DATE=14 Jan 2013 10:31:48
##DATA TYPE=INFRARED SPECTRUM
##DATA CLASS=XYDATA
##ORIGIN=
##OWNER=
##NPOINTS=3735
##FIRSTX=399.26403809
##LASTX=4000.35498047
##MAXX=4000.35498047
##MINX=399.26403809
##MAXY=77.13749695
##MINY=27.44144440
##XFACTOR=1.0000000000
##YFACTOR=0.000000100000000
##FIRSTY=49.07365036
##DELTAX=0.96440572
##XUNITS=1/CM
##YUNITS=TRANSMITTANCE
##XYDATA=(X++(Y..Y))
399.3D90736504p530556R92660R229508Q947067M915276k437744j081086m214325o100502
407.9D93456802k225303q74176k56806L496170J2516136M698639o798286j0851631
415.7D93161545r335556O58684O092491J5035133O506271l543205p249374p954979
423.4D93371010k810402k069435M025192p58667n51567N158348K076149J277428L48091
432.1E00066147l73840l507271m851227m022141K022515P216415P08199K85644J645241
440.7D99189682K141342O3248n894470j844254P39861n54848P1487K419739K586403
449.4D98918190q32481m660950n721855L90358K597160k26211Q38203O27060k804642
458.1D89124832l39737q02650O0158J066360l645821J33133P95021p10945J209107
$$ plain form
399.3 490736504 483205948 484198608 493428116 502375183 507290459 504852715 503771629 499557304 493456802
407.9 493456802 491231499 490357323 490100517 493596687 506112823 510811462 504013176 493161545
415.7 493161545 483825989 484484673 490577164 505612297 512118568 508575363 501325989 493371010
423.4 493371010 490560608 488491173 492516365 491757698 491206131 496364479 498440628 499718056 500066147
432.1 500066147 499692307 496185036 491333809 487311668 489334183 496550598 497258797 497544441 499189682
440.7 499189682 501331024 501394272 495499802 493655548 494395409 493840561 493912048 496331787 498918190
449.4 498918190 498085709 493424759 487702904 488093262 490690422 490464211 491302414 491929474 489124832
458.1 489124832 488785095 487982445 488042603 489108963 485463142 485596275 486391296 485680351 486889458
466.8D86889458n715103k565728K599869o89812k287597k938919M773330L465653P81364
475.5D84312515K179985K67678l025437l191376j245002l913498R32846L791199l043900
484.1D77065010N368271M548988n721321m582939m853592k202034K805176M567222
491.8D76994781L046837q95042j258583k250557m615097j569405K154579j94244J058998
500.5D72472267M682884R41658j555481q87184l003654l641663k231560J479950K601471
509.2D70858688L54424J097412J358261j499901r2888j634674l000679k000122m797783
517.9D60642738l59649M614334K102127j279946m54444n58968l555794j408500O58378
526.6D60400276J623192K543030J605606J102638k506294l878937k812385k887078
$$ plain form
466.8 486889458 481174355 478608627 481208496 480518684 478231087 475292168 480065498 483531151 484312515
475.5 484312515 486492500 486760178 483734741 480543365 479298363 475384865 476317711 480108910 477065010
484.1 477065010 482433281 486982269 481260948 476678009 471824417 469622383 472427559 476994781
491.8 476994781 480041618 479146576 477887993 475637436 471022339 469452934 471607513 471413269 472472267
500.5 472472267 477155151 478096809 476541328 475654144 472650490 469008827 466777267 468257217 470858688
509.2 470858688 471213112 472310524 473668785 472168884 472075996 470441322 467440643 465440521 460642738
517.9 460642738 460283089 464897423 466999550 465719604 465265160 464706192 461150398 459741898 460400276
526.6 460400276 462023468 464566498 466172104 467274742 464768448 460889511 458077126 455190048
534.3D55190048j787529M75464M359207L632698l44391j086273k395210l467255m71878
543D54104881N49660l30772O36825K495651L141709j358299l265648k444764k807617
551.6D50721626p17582j105156o20346J794242K139054J881408K75078j165657k486305
560.3D50716362m039345k419548J987076K810097M00848N67169L189583P28989m481812
569D49459419l939171j719131N36003J725960R64584J642418J006203J46866r54171
577.7D48868980j911354j823539j916695L91540K357445K384835J156768M47655O52962
586.4D50608597o95915j714211j091423j057167o30798K171363M244156L355103l58048
595D54831657k449264j605759j599884j628990n92270J634140K650223K812271R03626
$$ plain form
534.3 455190048 453402519 453877983 458237190 461869888 461525497 460439224 458044014 454576759 454104881
543 454104881 454654541 454323769 454960594 457456245 460597954 459239655 455974007 453529243 450721626
551.6 450721626 450004044 448898888 448278542 450072784 452211838 454093246 454368324 453202667 450716362
560.3 450716362 446677017 444257469 446244545 449054642 449455490 450022659 453212242 453941231 449459419
569 449459419 445520248 443801117 444337120 446063080 447027664 448670082 449676285 449823151 448868980
577.7 448868980 446957626 445134087 443217392 443608932 445966377 448351212 449507980 449955635 450608597
586.4 450608597 449912682 448198471 447107048 446049881 445419083 447590446 451834602 455189705 454831657
595 454831657 452382393 450776634 449176750 447547760 446955490 448589630 451239853 454052124 454955750
603.7D54955750k266350k633553k086067q92181q00782r00497O28662J345482J017341
612.4D48367805j136856j517219j749535k871704j284866M23775J499824J713715K371292
621.1D45816231J737594M30603N53780j284943j803283N94673J277466K929382M596519
629.8D54848022K459069Q32519m5776o44798j66664L09333J758499K230607K835044
638.4D64415855L220787K332612R86824n83992m94194j43548n9700R82438K570877
647.1D73227959L785972L340378J393013r17435j458892o74935j185760j162453J933899
655.8D78281746M076919K388802L45612o55175j158523k384834k814217p86018N09300
664.5D77803612J581573L063545K836533L99017j080970j915894k030258q01354L27797
$$ plain form
603.7 454955750 452689400 450055847 447969780 447077599 446276817 445376320 446004982 447350464 448367805
612.4 448367805 447230949 445713730 443964195 441092491 439807625 440231400 441731224 443444939 445816231
621.1 445816231 447553825 447984428 448538208 447253265 445449982 446044655 447322121 450251503 454848022
629.8 454848022 457307091 458139610 458093834 457449036 457282372 457591705 459350204 461580811 464415855
638.4 464415855 467636642 469969254 470956078 470372086 469877892 469734344 469674644 470657082 473227959
647.1 473227959 477013931 480354309 481747322 480829887 479370995 478696060 477510300 476347847 478281746
655.8 478281746 482358665 484747467 485093079 484437904 483279381 480894547 478080330 477294312 477803612
664.5 477803612 479385185 482448730 485285263 485684280 484603310 482687416 480657158 479855804 480183601
673.2D80183601K473603L758888L320389K004318O22482l40767p80639j017189m91333
681.8D89733353J560821K545624L037643L451806K057189N77469m65927j406250j344261
690.5D99747467l24249J051254K611351L682785L251343J337623n46379j592750k432099
699.2E06786346j356697P64313K090225K923737K689590K057305J392860Q17032n89142
707.9E17575569k588158j676521J252899K330437L106346L484955J413727j53389j659966
716.6E23085899j832313k00005m85573O55671L339271L721581K916641J418762m19922
725.2E32200012j665573j517029n59540Q45719J874733K801170L765488K415581j374
733.9E40159187j129303r77554n95856r50927j17875J807366K489357K602157J157685
$$ plain form
673.2 480183601 482657204 486416092 489736481 491740799 492363281 492022514 491241875 490224686 489733353
681.8 489733353 491294174 493839798 496877441 500329247 502386436 502963905 502497978 501091728 499747467
690.5 499747467 499423218 500474472 503085823 506768608 510019951 511357574 510811195 509218445 506786346
699.2 506786346 505429649 506193962 508284187 511207924 513897514 515954819 517347679 518164711 517575569
707.9 517575569 514987411 513310890 514563789 516894226 520000572 523485527 524899254 524745865 523085899
716.6 523085899 521253586 521053581 520568008 521223679 524562950 528284531 531201172 532619934 532200012
725.2 532200012 530534439 529017410 528457870 529303589 531178322 533979492 537744980 540160561 540159187
733.9 540159187 539029884 538052330 537456474 536505547 536387672 538195038 540684395 543286552 544444237
742.6E44444237j67542j210212k839890j175880N25665J686706L165322L399505K183533
751.3E50011444l56407l73612m16221j348992q09936J319961L371773L282624L069648
760E57750282J359406L52516j332893k684555R8495O01692J039963K556381L149910
768.6E62891197J934700m6844j168022l254967k172089m90074P84302K044334J745110
777.3E62267647J227340Q698K04239r42078j895942p82052k40287P24182K591705L573342
787E66736794J640052L81852j025658k013245j313400j069183N60646J675529J800270
795.6E67373657J216507N12390n86509k057000l183326l380356j037598l86543l9215
804.3E58432007O8817p36122r74732k160530k184829k990342l686294k364273n47180
$$ plain form
742.6 544444237 544276695 543066483 540226593 539050713 539576378 541263084 544428406 547827911 550011444
751.3 550011444 549655037 549281425 548865204 547516212 546706276 548026237 551398010 554680634 557750282
760 557750282 559109688 559462204 558129311 555444756 555543251 556144943 557184906 559741287 562891197
768.6 562891197 564825897 564779053 563611031 560356064 558183975 557693901 558478203 560522537 562267647
777.3 562267647 563494987 563503685 563707924 562765846 560869904 560087852 559847565 560571747 563163452 566736794
787 566736794 568376846 568758698 567733040 565719795 564406395 563337212 563897858 565573387 567373657
795.6 567373657 568590164 569102554 568516045 566459045 563275719 559895363 558857765 558471222 558432007
804.3 558432007 558500824 557764702 556789970 554629440 552444611 549454269 545767975 543403702 542856522
813E42856522M00047M76456L92646j200027j817360j492958j711197j343231L76663
821.7E36937561K180328K685624L210182K865371J878777P43790O57692P94792J062965
830.4E53017082L865967M562340M340858L657570K266693K177582R98116R4833n5428
839E74925613J901818K831688K926788L800392K826309J830483M08745k56424o82984
847.7E90512428J2932J395645L185845M598922K924042J553078j38168J61170M16222
856.4F04622116j0376J110611J741562L894577L407974K060166J468124K48222j311340
865.1F17231636k310219l89404L1662L09372R32045Q23364j01318r06906j444512l077278
874.7F11098442k631798j889419l40500J468582K095642M64172j438941j536103k675972
$$ plain form
813 542856522 543256569 543733025 544125671 542925644 541108284 539615326 537904129 536560898 536937561
821.7 536937561 539117889 541803513 545013695 547879066 549757843 550501633 551159325 551954117 553017082
830.4 553017082 556883049 561445389 565786247 569443817 571710510 573888092 574886208 574981041 574925613
839 574925613 576827431 579659119 582585907 586386299 589212608 591043091 591451836 591195412 590512428
847.7 590512428 590525360 591921005 595106850 599705772 602629814 604182892 604044724 604205894 604622116
856.4 604622116 604611740 605722351 607463913 611358490 614766464 616826630 618294754 618542976 617231636
865.1 617231636 614921417 614532013 614563675 614873047 615805092 616628456 616527138 615620232 614175720 611098442
874.7 611098442 608466644 606577225 606236725 607705307 609800949 610265121 608826180 607290077 604614105
883.4F04614105j890106j919327q61473O53382O89163J576881j03645m30107j474343
892.1F00854530k319069j144256J31340Q87298j04942J413651J421051O17218q50029
900.8F00906792k575379j447677j078644M15687J655693L270836L629036K784539J836814
909.4F09397697q44421j018715j620369j255493n4855O15730Q13408j84937p18956
918.1F05129089k636985l315468l905258l802109k538452j632538j349144k013931
925.8E83935204j879883l431473l778801l553009l683167k924232k085876l61138m33998
934.5E61803627R6664m45900j813468j548729k166253k416534k805672j199264O38084
943.2E50142555Q32596O24199k70577j248703k552528k038956j219558j66550M95186
$$ plain form
883.4 604614105 602723999 600804672 599943199 600596581 601285744 602862625 602758980 602328873 600854530
892.1 600854530 598535461 597391205 597522545 598409843 598304901 599718552 601139603 601756821 600906792
900.8 600906792 598331413 596883736 595805092 596220779 597876472 601147308 604776344 607560883 609397697
909.4 609397697 608553276 607534561 605914192 604658699 604603844 605219574 606032982 605848045 605129089
918.1 605129089 602492104 599176636 595271378 591469269 588930817 587298279 585949135 583935204
925.8 583935204 582055321 578623848 574845047 571292038 567608871 564684639 562598763 562237625 561803627
934.5 561803627 561900291 561454391 559640923 558092194 555925941 553509407 550703735 549504471 550142555
943.2 550142555 550975151 551599350 551328773 550080070 547527542 545488586 544269028 544102478 544597664
951.9E44597664L99551P29523k31972j220360l105239l642846l638572l721581j684646
960.6E28481522r89609m94423k22893j383056k902642l756714l037529k593307k762337
969.2E10339012j881790m69856j015244k193985l024635m038124m244652m346352m441604
977.9D84682770m366722l592110k492104k870216m178505n319939n961265n787010
985.6D50114899n951462n515595m531211l962479k611923k655869l881035m871368
993.3D16133957m811096m184799l821793k786179k701416l279991k772636j786194
1001.1C89989853k420540k721291k928199k947922k065735k395401j279144j664086
1008.8C71567535k015228j021728j483651j427307k139206k023582k243233k307281
$$ plain form
951.9 544597664 544997215 545726738 545494766 544274406 541169167 537526321 533887749 530166168 528481522
960.6 528481522 527491913 526997490 526774597 525391541 522488899 518732185 515694656 513101349 510339012
969.2 510339012 508457222 507987366 506972122 504778137 501753502 497715378 493470726 489124374 484682770
977.9 484682770 480316048 476723938 474231834 471361618 467183113 461863174 455901909 450114899
985.6 450114899 444163437 438647842 434116631 430154152 427542229 424886360 421005325 416133957
993.3 416133957 411322861 407138062 403316269 400530090 397828674 394548683 391776047 389989853
1001.1 389989853 387569313 384848022 381919823 378971901 376906166 374510765 373231621 371567535
1008.8 371567535 369552307 368530579 367046928 365619621 363480415 361456833 359213600 356906319
1016.5C56906319k073822k398987k015419k215843k000046k982063k805672k523346
1024.2C37891121k393684j488381j585960n73006r83734j068001j821022j814575j064034
1032.9C25098724j104736J90010k37274R66949J461182J770401J995888J529770J580543
1041.6C33251457m08096L51601Q91609P96966K92206m05235j28708j177483r55391
1050.2C32508926j754150j196938o28356j091118n04418k71683R1897p55806k04735
1058.9C26193619Q7051J190758J617584J902657K664642J179886K174683K381019K413712
1067.6C41805611J464729J069145J260910L14446J182670R2926J093941J420822Q14247
1076.3C50519447N10598K97622J794052l05862k19269Q56247J534844J394538R71184
$$ plain form
1016.5 356906319 354832497 352433510 350418091 348202248 346202202 343220139 340414467 337891121
1024.2 337891121 335497437 334009056 332423096 331850090 330866356 329798355 327977333 326162758 325098724
1032.9 325098724 323993988 324183998 323946724 324913673 326374855 328145256 330141144 331670914 333251457
1041.6 333251457 332843361 333194962 334086571 334883537 335175743 334770508 334641800 333464317 332508926
1050.2 332508926 330754776 329557838 328929482 327838364 327333946 327062263 327154160 326398354 326193619
1058.9 326193619 326280670 327471428 329089012 330991669 333656311 334836197 337010880 339391899 341805611
1067.6 341805611 343270340 344339485 345600395 345914841 347097511 347190437 348284378 349705200 350519447
1076.3 350519447 351030045 351327667 353121719 352815857 352596588 353452835 354987679 356382217 357353401
1085C57353401K224312J439629J379242r7084J251602K569847J968231K752495J374359
1093.6C72216034J779251Q02727Q63647K030716R92203L35083L24936J800003K133102
1102.3C83277702K701073J812859J152610J225891K40059M18969j8311P96471Q41827
1111C92449150J123352J453819O00129J490478J413841L18184j095047k58751O63338
1119.7C98158493L11394M80728j14136M39110N91621O54030N09033N68696J107177
1128.4D02706146J913986K698708J115341J918564L144455K187080J217347N26657
1136.1D17428284J821670L145828K364960J605873K331925J972503J232186N44548
1143.8D32447777j04637M44908N86891N33791Q61015J783485R53636o39991k94915
$$ plain form
1085 357353401 359577713 361017342 362396584 362299500 363551102 366120949 368089180 370841675 372216034
1093.6 372216034 373995285 374798012 375661659 377692375 378684578 379019661 379344597 381144600 383277702
1102.3 383277702 385978775 387791634 388944244 390170135 390410194 390829163 390810852 391607323 392449150
1111 392449150 393572502 395026321 395626450 397116928 398530769 398848953 397753906 397495155 398158493
1119.7 398158493 398469887 398950615 398836479 399275589 399867210 400521240 401030273 401598969 402706146
1128.4 402706146 404620132 407318840 408434181 410352745 413497200 415684280 416901627 417428284
1136.1 417428284 419249954 422395782 424760742 426366615 428698540 430671043 431903229 432447777
1143.8 432447777 432343140 432788048 433374939 433908730 434769745 436553230 437506866 436866875 436571960
1152.5D36571960m66117q11882o74057n75905o81496m31366l33176n32493m6959m07600
1162.1D31610909l74680k68936K90947J441993J586838K254982L171540L423004K481842
1170.8D45618439K791099K757302K152977K841377K862625K841339K991715L488922
1178.5D68345795K704277J990585K606735K056656J017761J119500K022895K127991
1186.2D83992195J719246R69772M50440K44179M1999j46713o20308p01256q95767p18269
1195.9D84335518k05383o24695j090889j081085j258927j374016j208076j414185j479683
1204.5D74598579p97309k06414m54330r89266q49533n46531l33634n88302r07517l49007
1214.2D68576736k24990q1444k12746n67436m20647p49626l68500k13585l51982p0076
$$ plain form
1152.5 436571960 436105843 435293961 434619904 434043999 433362503 432931137 432597961 432065468 432018509 431610909
1162.1 431610909 431236229 430967293 431258240 432700233 434287071 436542053 439713593 443136597 445618439
1170.8 445618439 448409538 451166840 453319817 456161194 459023819 461865158 464856873 468345795
1178.5 468345795 471050072 473040657 475647392 477704048 478721809 479841309 481864204 483992195
1186.2 483992195 485711441 486681213 487131653 487375832 487417831 487271118 486650810 485949554 485053787 484335518
1195.9 484335518 484130135 483505440 482414551 481333466 480074539 478700523 477492447 476078262 474598579
1204.5 474598579 473801270 473594856 473140526 472151260 471301727 470755196 470421562 469833260 468925743 468576736
1214.2 468576736 468351746 468270302 468057556 467490120 467069473 466319847 465951347 465737762 465385780 465315704
1223.8D65315704m45404n78422o11801p28798r53636j081391q79440m50058k25563
1232.5D59361191q06122n26390k09694o48270p77054k79159J07574k90336k81067m16451
1242.2D55234222l02200j6823j16043k22320n51415n41992q01773n71480k94533l1624
1251.8D51784019N05028m1885l09792n88340n90249l4561L9482j14631K79121P80907
1261.4D51709099J27754O6681L58505N91583P86095O99501R14345N31006M63905R09042
1271.1D57157516J315880J380425R14497R52873J280594J138230J127319J509666J661187
1279.8D68438187J459121J185723J396026J538658J730957J662293J623650K038078
1287.5D81072693J602249J289635J195030J175308Q60939R69353J050758N43671J103744
$$ plain form
1223.8 465315704 464870300 464291878 463680077 462951279 461997643 460916252 460036812 459586754 459361191
1232.5 459361191 458555069 458028679 457818985 457170715 456393661 456114502 456222076 455931740 455650673 455234222
1242.2 455234222 454932022 454915199 454799156 454576836 454025421 453483429 452681656 452110176 451815643 451784019
1251.8 451784019 452289047 452247162 451937370 451349030 450758781 450724220 450763702 450649071 450928192 451709099
1261.4 451709099 451836853 451903534 452262039 452853622 453639717 454339218 455253563 455784569 456248474 457157516
1271.1 457157516 458473396 459853821 460768318 461721191 463001785 464140015 465267334 466777000 468438187
1279.8 468438187 469897308 471083031 472479057 474017715 475748672 477410965 479034615 481072693
1287.5 481072693 482674942 483964577 485159607 486334915 487195854 488165207 489215965 489759636 490863380
1296.2D90863380J364785J245384N04265J84898K37007Q7319O53762K20833J08376
1304.8D95470009L35846N20248M26026k08092r30672j495704n86052l66097m83780
1313.5D92681732k08435p934J61933m5929K45247J05553O24199P20825M11072R20486
1323.2D95608749J237908J442947N43595K72750M5205l52631k53563p61833p29752
1331.8D97053375k53753J59225J9455j37520m04625m96177K8648J73187q5602l83491
1341.5D95672722P42798J279525Q37288P50275N34668L54080j40495J94244l2501k86064
1351.1D99906540k7313R3155L23181l41568l29514k62184n00603j061172n23377R4834
1360.8D97371979k56577L64151q43315j68991J11961r89112p12510r37729n41305k05612
$$ plain form
1296.2 490863380 492228165 493473549 493977814 494162712 494399719 494487038 495140800 495361633 495470009
1304.8 495470009 495805855 496326103 496752129 496544037 495613365 494117661 493531609 493165512 492681732
1313.5 492681732 492473297 492465363 492627296 492581367 492826614 492932167 493556366 494277191 494688263 495608749
1323.2 495608749 496846657 498289604 498833199 499105949 499151154 498798523 498544960 497783127 497053375
1331.8 497053375 496799622 496958847 496978302 496840782 496436157 495939980 495968628 496141815 496056213 495672722
1341.5 495672722 496415520 497695045 498532333 499282608 499817276 500171356 500030861 500225105 500192604 499906540
1351.1 499906540 499879227 499972382 500295563 499953995 499624481 499362297 498861694 497800522 497277145 497371979
1360.8 497371979 497115402 497479553 496636238 496467247 496579208 495590096 494877586 493939857 493398552 493192940
1370.4D93192940l8033M8638N52330L92723r44596l10287l54004k17552n94902m25072
1380.1D91302185m8447k94151o87408j660576j007767q46443p98874k266884j953316
1388.7D81738319k15950j127433j567002j683616j165123k258263l525276j774407
1396.4D68421249j766891j285324k688370k231560j508178k196846j546860j382904
1404.2D53814316k888184l612366j695938j365432j615258j212005j562538j496392
1411.9D38366203j618118j100273j267777j262931j96572p84454q9760j408615k16522
1420.6D30421181Q85505l95889N34287Q9378N72700J035882O39610J457252J075554
1429.2D36315460R37424L56445J087990J159248J356278K263298J884460K198410J231804
$$ plain form
1370.4 493192940 493154907 493203545 493755875 494148598 493204002 492893715 492539711 492322159 491727257 491302185
1380.1 491302185 491253738 490959587 490272179 488611603 487603836 486757393 485958519 483691635 481738319
1388.7 481738319 481522369 480394936 478827934 477144318 475979195 473720932 470195656 468421249
1396.4 468421249 466654358 465369034 462680664 460449104 458940926 456744080 455197220 453814316
1404.2 453814316 450926132 447313766 445617828 444252396 442637138 441425133 439862595 438366203
1411.9 438366203 436748085 435647812 434380035 433117104 432920532 432136078 432046318 430637703 430421181
1420.6 430421181 431306686 430910797 431445084 431534462 432107162 433143044 433782654 435239906 436315460
1429.2 436315460 437252884 437609329 438697319 439856567 441212845 443476143 445360603 447559013 448790817
1437.9D48790817K173996J500244J307030J361008P03354J502418J176682J949959
1445.6D60465508J966094J984139Q93784O65130J542778P70989J376342Q25005K104301
1454.3D72594070K400170J355705K150803Q66928L261947N75943J722260J613235J099282
1463D87640343K103271J008873L127899K108651K244606K184448J908684K772483K400208
1471.7E07499466K752075K403374L808212L272133K576942K236176K083969J809807
1479.4E28442154J668625J685753J323280K247772J988411J178131J451531N10711
1487.1E40496368N3940J262703K79045j004677k36053L22838j15395m99992m70047
1495.8E40088730m608154o97976j310501l648300p70988j264840r99107o85005M19273
$$ plain form
1437.9 448790817 450964813 452465057 453772087 455133095 455836449 457338867 458515549 460465508
1445.6 460465508 462431602 464415741 465309525 465974655 467517433 468288422 469664764 470489769 472594070
1454.3 472594070 474994240 476349945 478500748 479367676 482629623 483205566 484927826 486541061 487640343
1463 487640343 489743614 490752487 493880386 495989037 498233643 500418091 502326775 505099258 507499466
1471.7 507499466 510251541 512654915 516463127 519735260 522312202 524548378 526632347 528442154
1479.4 528442154 530110779 531796532 533119812 535367584 537355995 538534126 539985657 540496368
1487.1 540496368 540550308 541813011 542092056 541087379 540851326 541174164 541058769 540558777 540088730
1495.8 540088730 535480576 534782600 533472099 529823799 529052811 527787971 526788864 526103859 526523132
1504.5E26523132O08368k429390m654236q10623O01120j255569L44505m52804j493531
1513.1E16980972j82228p21245n62858j472130k605400J76010J796265Q85696j285362
1521.8E13009720n4398L58925J381264j355591k46124P84797n5236J134414J572838
1530.5E16530609J715469R40438M59938j353073R86976P41082O21986K912064J253929
1539.2E24809418j693154O76613p7209j51902J312104P04651j758385J088371O91681
1547.9E25602188J162529J477280k39563J91421M77600J841164k060852j236458J892433
1556.5E29107742K432976J669350m951859l657532j169929K83127j468926j274070
1564.2E20970879k547341k553634n80864j402092q43544p159386k083550k279815l863716
$$ plain form
1504.5 526523132 527131500 524702110 520047874 519237251 519838371 518582802 518927307 518474503 516980972
1513.1 516980972 516798744 516077499 515514641 514042511 511437111 511613121 513409386 514295082 513009720
1521.8 513009720 512955322 513314247 514695511 513339920 513093796 513878593 513823357 514957771 516530609
1530.5 516530609 518246078 519186516 519646454 518293381 519280357 520021439 520643425 523555489 524809418
1539.2 524809418 523116264 523792877 523715668 523563766 524875870 525580521 523822136 524910507 525602188
1547.9 525602188 526764717 528241997 528002434 528193855 528671455 530512619 528451767 527215309 529107742
1556.5 529107742 531540718 533210068 528258209 524600677 523430748 523713875 522244949 520970879
1564.2 520970879 518423538 515869904 515289040 513886948 513043404 505884018 503800468 501520653 497656937
1572.9D97656937l132019k947121o92101j0843505j807366l196831m091835l751945
1580.6D67194214n896492l860817n721397l522339n060768m667092m472313n123901
1588.4D28869095l150215n938568l482399n820427l994370m045296m777374k742615
1596.1C94917831m980392k479477n127830k950211m087105l690376k490120m806137
1603.8C64306183j364174l348122j096878l709411j650849j345405l876267l15819
1611.5C47599258k924118n7678j952514M17175O4888n726929J555252j776962P51457
1620.2C37949829j599159J382179P74078j932983R75494q03566K009392j747818R54247
1628.9C37961693J38664M75082J335144Q2589L189697M84352K085304r20067K638054
$$ plain form
1572.9 497656937 494524918 491577797 490885696 480042191 478234825 475037994 470946159 467194214
1580.6 467194214 461297722 457436905 451715508 448193169 443132401 438465309 433992996 428869095
1588.4 428869095 425718880 419780312 416297913 410477486 406483116 402437820 397660446 394917831
1596.1 394917831 389937439 387457962 382330132 379379921 375292816 371602440 369112320 364306183
1603.8 364306183 362942009 359593887 358497009 354787598 353136749 351791344 347915077 347599258
1611.5 347599258 344675140 344617462 342664948 343082123 343147011 337420082 338975334 337198372 337949829
1620.2 337949829 336350670 337732849 338506927 336573944 337549438 336745872 338755264 337007446 337961693
1628.9 337961693 338100357 338575439 339910583 339993172 343182869 343667221 345752525 344832458 347470512
1637.5C47470512Q59986O65893K841759K93503K771644P83768K741928K491532P33261
1646.2C61653786L361549k002029K984199R32770L237343K762489K65122M46548j058845
1654.9C72582932L649673O88553K011719P10334J675644K571564J979294L631325P75222
1663.6C90276260L810311K008095K434806L045197L525162M564628R29299M939956
1671.3D15533714K669983M240837L975640L472862L194313L010673M894219L161125
1679D44153366N289154M384003M608993N828934M106026N078010K73133N449638M819870
1687.7D83991127M694633M853402M875984N304260M246788N037918N005799N269355
1695.4E23279266K103463N686187O185761N429878O078835K60200O103249M813614
$$ plain form
1637.5 347470512 348330498 348996391 351838150 352131653 354903297 355687065 358428993 360920525 361653786
1646.2 361653786 365015335 363013306 365997505 366930275 370167618 372930107 373195229 373641777 372582932
1654.9 372582932 376232605 376921158 378932877 379643211 381318855 383890419 385869713 389501038 390276260
1663.6 390276260 394086571 396094666 398529472 401574669 405099831 409664459 410593758 415533714
1671.3 415533714 418203697 422444534 426420174 429893036 433087349 436098022 440992241 444153366
1679 444153366 449442520 453826523 458435516 464264450 468370476 473448486 473721619 479171257 483991127
1687.7 483991127 488685760 493539162 498415146 503719406 507966194 513004112 518009911 523279266
1695.4 523279266 525382729 531068916 537254677 542684555 548763390 549023590 555126839 559940453
1703.1E59940453L683776K843132L937111L770104K423401L743972L278695K906456
1710.8E86527100K328643K415696L008651J377182J310540K913932J994286j826553
1718.5F00049477L460960L232613J618309J624603J212196O44684J149292J667824
1726.3F14659958J549072J703682K362938P64618N20019L427735L655929r81674l439102
1734.9F24223175L235779L423195K239952L263702J268120j635208L527183L308716
1742.7F42854614J281204J603013L414611L933945K910080K184982J452027M374847
1750.4F64009323K257309L99475L848114K978363L732682M309082J396179J452179
1758.1F84382706K604522K182618K939071K77634J92261L223114K078552K071304K635422
$$ plain form
1703.1 559940453 563624229 566467361 570404472 574174576 576597977 580341949 583620644 586527100
1710.8 586527100 588855743 591271439 594280090 595657272 596967812 599881744 601876030 600049477
1718.5 600049477 603510437 606743050 608361359 609985962 611198158 611842842 612992134 614659958
1726.3 614659958 616209030 617912712 620275650 621040268 621560287 624988022 628643951 627662277 624223175
1734.9 624223175 627458954 630882149 633122101 636385803 637653923 636018715 639545898 642854614
1742.7 642854614 644135818 645738831 649153442 653087387 655997467 658182449 659634476 664009323
1750.4 664009323 666266632 666666107 670514221 673492584 677225266 681534348 682930527 684382706
1758.1 684382706 686987228 689169846 692108917 692386551 692578812 695801926 697880478 699951782 702587204
1766.8G02587204J907806j919479J247711L957749J622848J97983j233292K905655
1774.5G11274185K303086j77384J510696M61426J136704P74383j46942J166153K161331
1783.2G20463638K154465k51083p7820R02633O35911O01120J742401J345214J066971
1791.8G28583450o01959q19244L132858J246185m65164M36630J397629J113587m01230
1800.5G33622742K128982M31366O17371J448135K45514L66593k57950J25808Q35877
1809.2G39564438J535416l9063O59637J678162N17044K86179k76947P43789l16696
1817.9G44351959L60794J253205O62307J659623L18756J352615J365280k404861j141892
1826.5G47777786R01718K000962J450424j635513M89502K003707n6762k81067j92948
$$ plain form
1766.8 702587204 704495010 702575531 703823242 707780991 709403839 709601822 708368530 711274185
1774.5 711274185 713577271 713399887 714910583 715372009 716508713 717283096 717136154 718302307 720463638
1783.2 720463638 722618103 722367020 722289200 723191833 723827744 724428864 726171265 727516479 728583450
1791.8 728583450 727981491 727162247 730295105 731541290 731076126 731512756 732910385 734023972 733622742
1800.5 733622742 735751724 736183090 736800461 738248596 738494110 738860703 738602753 738728561 739564438
1809.2 739564438 741099854 741060791 741720428 743398590 743915634 744201813 743924866 744668655 744351959
1817.9 744351959 744712753 745965958 746628265 748287888 748606644 749959259 751324539 748919678 747777786
1826.5 747777786 748679504 750680466 752130890 750495377 750984879 752988586 752931824 752650757 752457809
1835.2G52457809K54288N36041k86178J347275P83081J043167Q15735J275558Q66089
1843.9G59092865n166016R84192J748047O28357M23737Q23288J066284j51749L57590
1852.6G59806595n77316k53525l98560L0441J085892O48575J353226L67279L08456
1861.3G62371063p13959m61578L7003l62549J128464N92346J511154O2790j292420
1869.9G62872314K03095J50146L0899n55572M22516L9825R64813J065445K94877O85195
1879.6G66173553n38101m08630o60477J33209p6141N2033J218490N88989J410447L61251
1889.2G68254623j494903p66525J12304m3258K75344P95517k12173Q61130N04608M4250
1898.9G68330917n19790p08466K44217j90353N05142L90930P91321P51800J20469k88163
$$ plain form
1835.2 752457809 752712097 753248138 752961960 754309235 755092316 756135483 756951218 758226776 759092865
1843.9 759092865 753926849 754911041 756659088 757287445 757711182 758534470 759600754 759449005 759806595
1852.6 759806595 759229279 758975754 758577194 758607635 759693527 760342102 761695328 762062607 762371063
1861.3 762371063 761657104 761195526 761232529 760869980 761998444 762590790 764101944 764164734 762872314
1869.9 762872314 763075409 763225555 763256454 762700882 763123398 763163223 764128036 765193481 765488358 766173553
1879.6 766173553 765635452 765226822 764566345 764699554 764623413 764675446 765893936 766482925 767893372 768254623
1889.2 768254623 766759720 765993195 766105499 766062241 766337585 767133102 766920929 767782059 768286667 768330917
1898.9 768330917 767811127 767102661 767346878 767156525 767661667 768052597 768843918 769595718 769716187 769428024
1908.5G69428024o62536j29319p65762K43225M42581P50733O60248K44598J163177
1917.2G71374969j769027j272736L22113J20926O98090r5597p3089P14645O34995m36402
1926.8G70218887l7918m43496n91279J9684q1176Q63647M39987O13480J00708m71802
1936.5G70630722l33481m62112r1782o98089R54055Q70591o94886N66407K99072o37665
1946.1G70402832j023102l81164j49308M97208M05045K25296M25262j22452J24665
1954.8G70404282p18384m89731k14996m51050Q5449O17676J220169L88031j17340p47376
1964.5G69976730m29687k48184j148148k25830Q38318R99145P1640K26746k70996m95758
1974.1G69293976r0714r31701m86603M9667R35974N96390L23715M75769k97088l96500
$$ plain form
1908.5 769428024 768765488 768636169 767870407 768113632 768556213 769306946 769967194 770211792 771374969
1917.2 771374969 769605942 768333206 768655319 768776245 769474335 769378738 769305649 770020294 770655289 770218887
1926.8 770218887 770180969 769737473 769146194 769165878 769084702 769948349 770388336 771001816 771102524 770630722
1936.5 770630722 770297241 769835129 769743347 769045258 769999313 770869904 770175018 770741425 771040497 770402832
1946.1 770402832 769379730 768998566 768849258 769346466 769751511 769976807 770402069 770279617 770404282
1954.8 770404282 769685898 769196167 768981171 768530121 768615570 769233246 770453415 770841446 770724106 769976730
1964.5 769976730 769547043 769298859 768150711 767924881 768763199 769762344 769833984 770060730 769789734 769293976
1974.1 769293976 769203262 768271561 767784958 767834625 768770599 769366989 769690704 770166473 769869385 769472885
1983.7G69472885j010513m88510l91693Q0413O00357L43781J251373N55649r23386
1992.4G69490356j301116l94898m79431l13797M55246J75705O03332L79258M70809
2001.1G69085464n26428j074524p16552q89893K35596K06833O59713O81229K90680
2009.8G67952118m3411o66199l57285j014251n59388q8119K97012Q11615O06003K89459
2019.4G67227554m27093k01798q98437r52301n69840l87802J31760N75943R97543K49558
2029.1G65745087L19214m49143j095047p99026l02430J15967m59671O03028N59997
2037.7G64237976L34778M5090q18329q46558j135330l8071K29264O49719O77490J54724
2047.4G63490753J50986l45612n6762o91834m89120n33753j72653Q70972L00979K79694
$$ plain form
1983.7 769472885 768462372 767973862 767582169 767662582 768262939 768606720 769858093 770413742 769490356
1992.4 769490356 768189240 767794342 767314911 767001114 767456360 767632065 768235397 768614655 769085464
2001.1 769085464 768559036 767484512 766767960 765878067 766113663 766320496 766980209 767661438 767952118
2009.8 767952118 767908707 767242508 766885223 765870972 765311584 765223465 765520477 766332092 766938095 767227554
2019.4 767227554 766800461 766598663 765700226 764747925 764178085 763790283 763922043 764497986 765495529 765745087
2029.1 765745087 766064301 765615158 764520111 763721085 763418655 763534622 763074951 763677979 764237976
2037.7 764237976 764572754 764617844 763799515 762952957 761817627 761779556 762008820 762658539 763336029 763490753
2047.4 763490753 763641739 763296127 763239365 762547531 762058411 761524658 761352005 762222977 762523956 762803650
2057G62803650l5095l6774n73044o10199n40848l53546Q34351K55661M93698L59955
2066.7G62597809j6785k46734p44629o67267o88706J52893K08741O37588M16413R5596
2076.3G61744919R3612o93054k86636n27573k84576j73340M89044P02667k09655M45556
2086G61300964q8043m89960p34481n56565j18942J70670O58645m7455l6468k91214
2095.6G59767151J2436l89939r03015j74484j450P36008P3013J00708N39856J0910
2105.2G59771194o24694j048966n13687l58353M37165J46713K46048K76794k97470
2113.9G58034744K08435m65393j35040k79770k69699Q0566L3112N85175l8224l2120
2123.6G57721786l05099l00598m75769m88587L65143J17417K55661J09481J67008j91269
$$ plain form
2057 762803650 762768555 762731781 762158737 761548538 761007690 760654144 761488495 761744156 762237854 762597809
2066.7 762597809 762581024 762334290 761589661 760922394 760233688 760386581 760595322 761232910 761649323 761744919
2076.3 761744919 761838531 761145477 760858841 760331268 760046692 759873352 760362396 761065063 760855408 761300964
2086 761300964 761212921 760722961 759988480 759431915 759312973 759483643 760142288 760094833 760058365 759767151
2095.6 759767151 759779587 759389648 758486633 758312149 758310699 759046707 759119720 759220428 759760284 759771194
2105.2 759771194 759146500 758097534 757583847 757225494 757662659 757809372 758055420 758332214 758034744
2113.9 758034744 758243179 757777786 757642746 757362976 757093277 757173843 757206955 757792130 757753906 757721786
2123.6 757721786 757416687 757116089 756640320 756151733 756516876 756634293 756889954 756999435 757166443 756975174
2133.2G56975174q774J07498p72552k11640j63726P0114N29937Q59528J61362o58188
2142.9G56888733l12348l65142K16827M1351K52381M29077L22723J89209n70068q8577
2152.5G57004166l06168j88293k94190k14310M41971L86505N58930l8376J22910l25394
2162.1G57147751m32358l1967k35138K14615K52075O66657j35956l39966N417k10037
2171.8G56901093j5412k33688J32217j46255N12695O79169J49307K25296l06244k37732
2181.4G57660446n34363l2882p4387J08948P82699L72544K05993l08227J13296l11737
2191.1G57982330m59060j31684j61514N84564N91355O26907l53622l29361k29874o27213
2200.7G57492828J48850R6130K4796o0654Q15735N06134j82266n4093m12674L4714
$$ plain form
2133.2 756975174 756966400 757073898 756301346 756089706 755925980 755996094 756526031 757385559 757546921 756888733
2142.9 756888733 756576385 756211243 756428070 756469421 756721802 757150879 757473602 757662811 757092743 757004166
2152.5 757004166 756697998 756509705 756215515 756001205 756443176 756829681 757388611 757350235 757473145 757147751
2162.1 757147751 756715393 756683426 756448288 756662903 756914978 757581635 757445679 757105713 757111130 756901093
2171.8 756901093 756885681 756651993 756784210 756637955 757150650 757829819 757979126 758204422 757898178 757660446
2181.4 757660446 757126083 757093201 757018814 757127762 757910461 758283005 758488998 758180771 758294067 757982330
2191.1 757982330 757523270 757391586 757230072 757814636 758405991 759032898 758679276 758349915 758120041 757492828
2200.7 757492828 757641678 757737808 757762604 757701950 758517685 759023819 758841553 758787460 758374786 758409500
2210.4G58409500l77273p7515N340J79673O03714L05481L53012o94275l60871q7890
2220G58258896j0910M06265K00043L28827k24304j13678l52784j60751K65656j41297
2229.7G58455963k27966p7133M10232K34070L40881j64718k74582j33438m02832J09253
2239.3G58269730j76545L23334N19409M53644J36719l84140p3776n52216m24118l63846
2248.9G57728195P0572L96347L72467L23563M5700M1580j050262n35431J3733K63137
2258.6G57669601O27747K31094N15824p7286K26288O1111n13992p50656n94559N19028
2268.2G57914200J7700p7591K7390M61044L67279o8436k15301r15604k9220k31095
2277.9G57250366j12915N53818O61011J10321p96051O2408l54614l84674k51694k72674
$$ plain form
2210.4 758409500 758032227 757954712 757960052 758139725 758743439 759048920 759401932 758707657 758346786 758258896
2220 758258896 758247986 758654251 758854294 759183121 758958817 758845139 758492355 758331604 758597260 758455963
2229.7 758455963 758227997 758150864 758561096 758795166 759136047 758971329 758696747 758563309 758160477 758269730
2239.3 758269730 758093185 758416519 758935928 759389572 759526291 759142151 759068375 758516159 758092041 757728195
2248.9 757728195 757798767 758195114 758567581 758891144 758936844 758978424 757928162 757392731 757406464 757669601
2258.6 757669601 758297348 758528442 759044266 758966980 759193268 759254379 758740387 757989731 757395172 757914200
2268.2 757914200 757931900 757854309 757881699 758342743 758710022 758641586 758426285 757510681 757481461 757250366
2277.9 757250366 757137451 757691269 758352280 758462601 757666550 757728958 757374344 756989670 756737976 756465302
2287.5G56465302J38015M43497R16824j02539K20490m33884q54263k09961n55802K76108
2297.2G56303787Q4458O13479P25861K78244k08664p85599k35367n38864J38931m0283
2306.8G56335983M37775R30252k3117K09122k34833j34888n85251n09338m77829l12653
2316.4G55635223R91059M46930L19976N34745O48880q84400j091003k61765k51846
2325.1G56087799N99060k01950P36313J86310m38690O1340l14789k136p72171J041107
2334.8G56982193O11267q98285l45383k63366n29099l53698Q47091J28174N33676o67190
2344.4G56045380j456757o7139m08935p89108m4861J311950J26114j31454O99386Q34198
2354.1G56118774J247635l52096M77600j581268j708451l17611J33285K01950r97238
$$ plain form
2287.5 756465302 756603317 757046814 757963638 757861099 758081589 757647705 756793442 756583481 756027679 756303787
2297.2 756303787 756388245 757001724 757727585 758005829 757797165 757011566 756776199 756237335 756376266 756335983
2306.8 756335983 756773758 757704010 757680893 757890015 757655182 757520294 756935043 756425705 755947876 755635223
2316.4 755635223 756626282 757073212 757393188 757927933 758576813 757692413 756601410 756339645 756087799
2325.1 756087799 756686859 756484909 757221222 757407532 756968842 757030182 756715393 756713257 755941086 756982193
2334.8 756982193 757593460 756695175 756349792 756086426 755557327 755203629 756050720 756178894 756712570 756045380
2344.4 756045380 754588623 754521484 754112549 753323441 753278580 754590530 754716644 754585190 755284576 756118774
2354.1 756118774 757366409 757014313 757491913 755910645 754202194 753884583 754017868 754219818 753222580
2362.7G53222580J142273L76816l20969j254044P00074R54437j626740j029968j156845
2371.4G51007614O70929q9416q73795j020889r57718M91485n34591k55890l97492n13229
2381.1G47527008k10342m88129j27945j08871J449q94089n29480J06507j48316k44217
2390.7G44883575m47540K94724r1248j32065k68402l36304j61056o82755J9913l9673
2400.3G43039169L31192n1193n89218q9264p65076l79181l65066n17120m6769k7008
2410G40540466p5760R7046L23868j13220n20249q76770n22995l22265p6L72772l50723
2420.6G38552094m16642l91311m53644l64151Q1940j66932o63452p5531j8158R2621
2430.2G36176834p4844m35868q21380o20194l967k91595l74375l79410k6702j94245
$$ plain form
2362.7 753222580 754364853 754741669 754420700 753166656 753866730 754821167 753194427 752164459 751007614
2371.4 751007614 751678543 751589127 750715332 749694443 748736725 749228210 748693619 748437729 748040237 747527008
2381.1 747527008 747316666 746828537 746700592 746591721 746593170 745699081 745169601 745276108 745127792 744883575
2390.7 744883575 744436035 744730759 744639511 744507446 744239044 743902740 743741684 743058929 743078842 743039169
2400.3 743039169 743370361 743319168 742729950 742640686 741875610 741496429 741131363 740614243 740567474 740540466
2410 740540466 740464706 740561752 740885620 740772400 740252151 739375381 738852386 738530121 738530045 738902817 738552094
2420.6 738552094 738135452 737744141 737290497 736926346 737008286 736841354 736177902 736102371 736084213 736176834
2430.2 736176834 736101990 735666122 734844742 734224548 734220581 733928986 733554611 733175201 733148499 732954254
2439.9G32954254j64795k27813n26124J0529n94254m61578l67203m33273j52130l44238
2449.5G29693375K88314J5412m93546o23932k19345k28729o53763l07998m58146O0654
2459.2G27072296K01798j59684n92880r01947m93545l68424k3270n8364j13373l13416
2468.8G24249191l68576l84598m79965k48642p89871o75125m78134j46790K6474k06680
2478.5G20497284j92261p50809n84335l64380m9362l85513o32096o3552j18256K0981
2488.1G17377701n78919m22287l58657o47126n04074p50351N2109Q5220o6528l80096
2497.7G13806992p68128p00149q09937l08838o20346n04074k44522j70822K7771k30942
2507.4G09477005l38135o60858l27530n01861p35016o03714k46506K70462k66342k81220
$$ plain form
2439.9 732954254 732789459 732561646 732035522 732046051 731451797 730990219 730623016 730189743 730037613 729693375
2449.5 729693375 729981689 729997101 729503555 728879623 728660278 728431549 727777786 727469788 727011642 727072296
2459.2 727072296 727274094 727114410 726521530 725619583 725126038 724757614 724734344 724675980 724562607 724249191
2468.8 724249191 723880615 723496017 723016052 722767410 721977539 721302414 720824280 720677490 720703964 720497284
2478.5 720497284 720305023 719554214 718969879 718605499 718556137 718170624 717538528 717474976 717356720 717377701
2488.1 717377701 716798782 716376495 716017838 715370712 714866638 714116287 714168396 714253616 714187088 713806992
2497.7 713806992 713038864 712338715 711528778 711219940 710599594 710095520 709850998 709680176 709707947 709477005
2507.4 709477005 709138870 708478012 708150482 707648621 706913605 706309891 706063385 706333847 706067505 705786285
2517G05786285l10669k51083m09546n42679l16085q34656k35596K68555m15879r70840
2526.7G01767807m97437k08282m31900j57013l73077m43116m14199j76087l21884n19867
2536.3F98224945k35672l68881k5025l62396n95627l25470k60925k78854l75824k70996
2546F95125275q94471o14776n6458K9831j03683n67017n15518o75354l15094k42081
2555.6F91170654p4844r7427o47278k23770l47214l38974l51715m48532l84064m59137
2565.2F87797699k27127n17578n35965m64401k29798r002k32010k96173m13666m66690
2574.9F84405289m79431k31171l56903o77567m94232K39716J54419p66068n74570m56695
2584.5F80762787l96805l90854m25262l15323l04871j06125m22134j24359p8888m02451
$$ plain form
2517 705786285 705475616 705224533 704814987 704272308 703956223 703121567 702885971 703154526 702738647 701767807
2526.7 701767807 701270370 701062088 700630188 700473175 700100098 699656982 699242783 699066696 698744812 698224945
2536.3 698224945 697989273 697620392 697595367 697232971 696637344 696311874 696050949 695772095 695396271 695125275
2546 695125275 694230804 693616028 693559570 693589401 693485718 692918701 692403183 691727829 691412735 691170654
2555.6 691170654 691095810 690998383 690351105 690127335 689780121 689441147 689089432 688640900 688256836 687797699
2565.2 687797699 687570572 687052994 686517029 686052628 685822830 685813828 685581818 685285645 684871979 684405289
2574.9 684405289 683925858 683694687 683337784 682660217 682165985 682405701 682560120 681794052 681219482 680762787
2584.5 680762787 680365982 679975128 679549866 679234543 678929672 678823547 678401413 678277054 678198166 677795715
2594.2F77795715p42874p55615n2033l96270m14887o95266n37415J23520k84729j43814
2603.8F73896332m07028r70307j148834m29840Q2779j38474R3537l33100q74023p73926
2613.5F68997116p4234m55933p38296j19324m63333k69852k85110l64609l58124o97174
2623.1F65171127n66559n91201o33240o14014j85394j53046l86276l32336l98178p10984
2632.8F60599899q35113k56348m11682l42178k01645k81525j55487n44968l51944q39920
2642.4F56379089j197281n24902l88946l16773k21710n08576l86581J06430m10232
2651.1F52530518n26505m87823m91486O2485l08762n33752n45426n07049m19922k05307
2660.7F48566971j09253o19507o41861n37491j86844J8540m0436o24695p19070R5215
$$ plain form
2594.2 677795715 677052841 676297226 676245193 675848923 675434036 674738770 674201355 674324875 674040146 673896332
2603.8 673896332 673489304 672518997 671370163 670940323 671023102 670884628 670978165 670645065 669771042 668997116
2613.5 668997116 668922882 668466949 667728653 667609329 667145996 666876144 666591034 666226425 665868301 665171127
2623.1 665171127 664604568 664013367 663380127 662766113 662580719 662427673 662041397 661709061 661310883 660599899
2632.8 660599899 659764786 659508438 659096756 658754578 658552933 658271408 658115921 657570953 657219009 656379089
2642.4 656379089 655181808 654656906 654267960 653951187 653729477 653220901 652834320 652940750 652530518
2651.1 652530518 652004013 651516190 651024704 651087189 650778427 650244675 649699249 649192200 648772278 648566971
2660.7 648566971 648457718 647838211 647196350 646658859 646472015 646490555 646450119 645825424 645106354 645201569
2670.4F45201569k51236n40238o08978j69220k04086m66004K90680Q4610k54288o88705
2680F42394104m13132m91562q73184j18713m65851o04439n71823l28369q8921j13639
2689.6F38324471l3074n75943m10385o51283l31078J93939j43089j11427n70603n68924
2699.3F35122604l45611l46718n08423m94804k41318k35214j65291j69563Q4114k04773
2708.9F32495003n08309o64634m88129k57912p04841j33133K07710j33438m63371j83602
2718.6F29165344J31798k44484m24499q03223j73187J29966l54919o33621n86663p4195
2728.2F26132317m05121l35236j18027q773l92647m52156J75857l31344k2126k11143
2737.9F24031601n65109j32065k12784j82915k46811Q774k18239n4550J59569l74489
$$ plain form
2670.4 645201569 644950333 644410095 643801117 643631897 643427811 642961807 643252487 643337097 643082809 642394104
2680 642394104 641980972 641489410 640616226 640497513 640031662 639427223 638855400 638527031 638438110 638324471
2689.6 638324471 638291397 637715454 637305069 636653786 636322708 636516647 636373558 636262131 635691528 635122604
2699.3 635122604 634776993 634430275 633921852 633427048 633185730 632950516 632785225 632615662 632699776 632495003
2708.9 632495003 631986694 631322060 630833931 630576019 629871178 629738045 629945755 629812317 629348946 629165344
2718.6 629165344 629297142 629052658 628628159 627824936 627651749 627781715 627426796 626793175 626206512 626132317
2728.2 626132317 625727196 625391960 625273933 625265160 624872513 624420357 624596214 624264870 624242744 624031601
2737.9 624031601 623466492 623334427 623121643 622938728 622691917 622700691 622482452 622427902 622587471 622212982
2747.5F22212982l42789o752q2359o47659k24075k44904m89349l17383l89824j09367
2757.2F19358521l65906k44217j98212k479r6169m87595j95388o43883l75595l04527
2766.8F16444550n25132j38664J14212J32446m52842o21605m98390J20849l32145j198006
2776.4F13045273m90570q1673j85852k39067p3586n81741o13937l70446o53610k30865
2786.1F09523926j53427j89972m96063n42756m35829n65681o26488p25861l30467o24580
2795.7F04832802n41268m11071m60930n70793q92182n98221r62905m20304l99666n88379
2805.4E98987083k40860q55293l81050k82669n90477j153679q45261k91061j174698
2814E93172035o28395l46870l70789n27801r25408o65893r88083j002999j006469p16439
$$ plain form
2747.5 622212982 621870193 621863441 621781082 621133423 620909348 620664444 620175095 619857712 619467888 619358521
2757.2 619358521 618992615 618748398 618550186 618547707 618451538 617963943 617768555 617124672 616749077 616444550
2766.8 616444550 615919418 615780754 615894966 616027412 615574570 614952965 614454575 614575424 614243279 613045273
2776.4 613045273 612554703 612473030 612287178 612048111 611974525 611392784 610778847 610408401 609754791 609523926
2786.1 609523926 609370499 609180527 608684464 608141708 607705879 607140198 606513710 605787849 605457382 604832802
2795.7 604832802 604291534 603880463 603419533 602848740 601956558 601358337 600395432 599975128 599575462 598987083
2805.4 598987083 598746223 597890930 597509880 597227211 596636734 595483055 594637794 594346733 593172035
2814 593172035 592543640 592196770 591825981 591298180 590372772 589706879 588718796 587715797 586709328 585992889
2823.7E85992889n70831p60536m13857n09758n97267m33502r47266j329231r15680
2832.4E79514961j213226j154594p21055p04612o62232j030922j333122j816826j247406
2841.1E69630966j360550j960296j548195k159996j806183j605377j763955j735191
2848.8E55691223k172317k083283j925697r11446o17676m24957l71551n68085J27640
2857.4E46743851k10419k5024M615m30679l30276l65563n58586q70972p97844j128807
2867.1E42030296r67979o30188l56140k47994j132965j192932m72031l35731j081963
2875.8E35612373q22792o13594r64164m55475p05910p41768n93910p53365r90143p91015
2885.4E28180237l45535j106530j203041p05642o30799r78660j066742p52945o49567
$$ plain form
2823.7 585992889 585422058 584661522 584247665 583737907 583140640 582707138 581759872 580430641 579514961
2832.4 579514961 578301735 577147141 576426086 575721474 575059242 574028320 572695198 570878372 569630966
2841.1 569630966 568270416 566310120 564761925 562601929 560795746 559190369 557426414 555691223
2848.8 555691223 553518906 551435623 549509926 548598480 547980804 547555847 547184296 546616211 546743851
2857.4 546743851 546533432 546508408 546513023 546082344 545752068 545386505 544827919 543956947 543159103 542030296
2867.1 542030296 541062317 540432129 540075989 539827995 538695030 537502098 537030067 536694336 535612373
2875.8 535612373 534789581 534175987 533211823 532756348 532050438 531308670 530714760 529961395 528971252 528180237
2885.4 528180237 527834702 526728172 525525131 524819489 524188690 523210030 522143288 521390343 520740776
2894.1E20740776m20723r88426j430321j136131n71365o52009p34863l92647q88290
2902.8E13526001o96640q92754r06601n36422r73053j100006j422501p25632m20608
2911.4E05851784r27773j418228j934318j481476j393166j018028j324082j826210
2919.2D94528503r71527p38716r23080q53653n09758n69916m98428j53427P4386M15077
2928.8D89799461L73001J50300o7215L45001P6713m70581J94435N49775N06591P71866
2938.5D92229347R03626L42254N20935R83544N30662N23758Q30841P18651J81427J95007
2948.1D97960052P74193R20029O99272O19545K82974j16462L25966K15835P1411O94161
2957.7E02446976Q66127L64761M01230J092987O06422L18146L77236K33993Q78372
$$ plain form
2894.1 520740776 520320053 519331627 517901306 516765175 516193810 515541801 514806938 514414291 513526001
2902.8 513526001 512829361 511936607 511030006 510493584 509520531 508420525 506998024 506272392 505851784
2911.4 505851784 504924011 503505783 501571465 500089989 498696823 497678795 496354713 494528503
2919.2 494528503 493556976 492818260 491895180 491041527 490531769 489961853 489463425 489309998 489384384 489799461
2928.8 489799461 490172462 490322762 490255547 490600548 490677261 490206680 490401115 490950890 491457481 492229347
2938.5 492229347 493132973 493475227 493996162 494979706 495510368 496034126 496864967 497583618 497765045 497960052
2948.1 497960052 498734245 499654274 500353546 500973091 501256065 501139603 501465569 501681404 501752815 502446976
2957.7 502446976 503313103 503677864 504079094 505172081 505778503 506096649 506473885 506707878 507586250
2966.4E07586250R08051L99933N99250Q49114M33464N20477N31082M12751O87904L96004
2976.1E13324280N25589O37970N50232J09138k07252K54211K37885K90756Q3580O7444
2985.7E15873833K07901K87628M56619K07138M04625l7460k66419j51138n31654j70250
2995.3E16280823K80494q3885p69691l10135k06337m02680j97258p01637m35104j88217
3005E13266373l85475o82946q48770k47536m18548q98285m40064j51748p35092o64177
3014.6E07793732k58942n12848m93431n06401o94962o87294p58056o56204l83835p22809
3024.3E02118950p94182p53899j072921p04422o12259n11399o17637j071282p62291
3033D95218658p72857j157570j048393l18756m50860q81691p26013q40950o21528o01921
$$ plain form
2966.4 507586250 508494301 508894234 509493484 510342598 510776062 511296539 511827621 512240372 512928276 513324280
2976.1 513324280 513849869 514487839 515038071 515147209 514939957 515194168 515432053 515722809 515806389 515873833
2985.7 515873833 516081734 516369362 516825981 517033119 517437744 517400284 517133865 516982727 516451073 516280823
2995.3 516280823 516561317 516477432 515707741 515397606 515191269 514788589 514591331 513889694 513454590 513266373
3005 513266373 512880898 512197952 511349182 511101646 510683098 509784813 509344749 509193001 508457909 507793732
3014.6 507793732 507534790 507021942 506528511 506022110 505327148 504639854 503881798 503225594 502841759 502118950
3024.3 502118950 501324768 500570869 499497948 498793526 498181267 497669868 497052231 495980949 495218658
3033 495218658 494445801 493288231 492239838 491921082 491470222 490588531 489862518 489021568 488400040 487798119
3042.6D87798119o69403p86438j127854j234588r03817m04358r23767j093979q66241
3051.3D79787674r61723m75960m01230r84802j054001q48808p69005p59011j093292
3060D72439842n92270m64897r06906k97203l16658m89731j051254j434021q04024q84895
3069.6D65197983n07088j16539m53720q78143r47495q56972p38487m50401p67937n92613
3079.2D58888588k60582l08113m68674q50563j005669j339607r34562k65580k69050
3087.9D53186188o83136r93767o87828p53822r00345n85099k12516k92702j098366
3096.6D46978607j499595n10560Q8120p38564j086464o87675m15840q48045q16765
3105.3D40463219l95394p19299p58438p29675p27730q36029n49393o43349q16917j24016
$$ plain form
3042.6 487798119 487128716 486342278 485214424 483979836 483076019 482671661 481747894 480653915 479787674
3051.3 479787674 478825951 478349991 477948761 476963959 475909958 475061150 474292145 473533134 472439842
3060 472439842 471847572 471382675 470475769 470178566 469861908 469372177 468320923 466886902 466082878 465197983
3069.6 465197983 464690895 464574356 464120636 463242493 462294998 461438026 460699539 460249138 459481201 458888588
3079.2 458888588 458628006 458319893 457851219 457000656 455994987 454655380 453720818 453455238 453186188
3087.9 453186188 452503052 451509285 450821457 450067635 449167290 448582191 448369675 448076973 446978607
3096.6 446978607 445479012 444968452 445056572 444318008 443231544 442543869 442128029 441279984 440463219
3105.3 440463219 440067825 439348526 438590088 437860413 437132683 436296654 435747261 435103912 434286995 434162979
3114.9D34162979j187630j491050l78418k41890l83606n95780q55903j503411j071205
3123.6D26454086p05681r43298o87981q14170q36945p85751m88854o51741p71713n97382
3133.3D19170570p72705n29823p96738j092987j006050p22732o96373n49965n50728
3141.9D12452469j269493p36504n79910o91910n06325r80987r62067q24432o41709
3150.6D05259132r24568j015739n07736m00467q45452r82780o53534j145172r47304
3159.3C97836380p18460j123848r13086n22308m77944q72116n58548q18062j007156
3168C90824852o32553j134186j152573o93016l17649r46541j393662r67941o51512
3176.6C82935219l21427m50210n86891r80797q60748q65059j160202l85285k32658
$$ plain form
3114.9 434162979 432975349 431484299 431105881 430863991 430480385 429884605 429028702 427525291 426454086
3123.6 426454086 425748405 424805107 424117126 423302956 422466011 421680260 421191406 420539665 419767952 419170570
3133.3 419170570 418397865 417868042 417071304 415978317 414972267 414249535 413553162 413003197 412452469
3141.9 412452469 411182976 410446472 409866562 409174652 408668327 407687340 406725273 405900841 405259132
3150.6 405259132 404334564 403318825 402811089 402410622 401565170 400582390 399928856 398783684 397836380
3159.3 397836380 397117920 395994072 395080986 394558678 394080734 393208618 392650070 391832008 390824852
3168 390824852 390192299 389058113 387905540 387212524 386894875 385948334 384554672 383586731 382935219
3176.6 382935219 382613792 382163582 381576691 380595894 379735146 378870087 377709885 377324600 377091942
3185.3C77091942p38297j063270r13887q38433q17756q77152q51135m51241p14111
3194C69826660n19218q39424r94149o34308q99009m91829n23834j76316m82673j339913
3203.6C62925987r70611l55416J18103q79554j022644n71366j080208p53822k20451
3212.3C57190018o1531r02787j260566o06537n51949m27856k03018q46100p49398p3966
3222C51506310p07703n49545o43654r09729k32659o80961q19245o33812l77540l30849
3231.6C45620613m72717l52631q98247p76176n43289o25420o28967p11289p57141m73976
3241.3C39380760j62506p57446n08499k10953l61214k23236o97594p40928n67513m48456
3250.9C34702415m82749m76189m21829o16227m53071n29442n44968m79812n71747n61562
$$ plain form
3185.3 377091942 376353645 375290375 374376488 373538055 372720299 371843147 370992012 370540771 369826660
3194 369826660 369307442 368468018 367473869 366839561 365940552 365448723 364924889 364748573 364265900 362925987
3203.6 362925987 361955376 361599960 361718063 360838509 359815865 359244499 358164291 357410469 357190018
3212.3 357190018 357128487 356225700 354965134 354358597 353806648 353378792 353175774 352329674 351580276 351506310
3222 351506310 350798607 350249062 349605408 348695679 348463020 347782059 346962814 346329002 345951462 345620613
3231.6 345620613 345147896 344795265 343897018 343120842 342577553 341952133 341323166 340611877 339854736 339380760
3241.3 339380760 339218254 338460808 337952309 337741356 337380142 337156906 336459312 335718384 335150871 334702415
3250.9 334702415 334219666 333743477 333321648 332705421 332252350 331722908 331177940 330698128 330126381 329564819
3260.5C29564819l06091m00391p95021l70636j49116k71378m65584n23414l34435l11050
3270.2C25637703l10974n52483l22380k02064m68178o79436q03757l84636R1401N5732
3279.8C22060928n51033l88260m19349p72095n05791k86140j47820p52372o01445n30071
3289.5C17106552m91600K38361k26554l37887p36256l98464J53255q19034o99806k13776
3299.1C13574791N4188m55017n20802J37196k51389k86541m22821l14960l80955p45049
3308.8C10388641n22709o90345n12448n14755n71594m51908n30262j71757P8506p7533
3318.4C06423836q24929r44194l55110n88570p09496l66687k99530l94211n49622o60534
3328.1C00730953o01978q09479r61475m78840j97868l54920o44970q63724l92437j25160
$$ plain form
3260.5 329564819 329258728 328858337 328063316 327692680 327543564 327272186 326806602 326283188 325948753 325637703
3270.2 325637703 325326729 324774246 324451866 324249802 323781624 323102188 322298431 321913795 322005196 322060928
3279.8 322060928 321509895 321121635 320702286 319930191 319424400 319138260 318990440 318238068 317636623 317106552
3289.5 317106552 316614952 316853313 316626759 316288872 315552616 315154152 315307407 314488373 313788567 313574791
3299.1 313574791 313628979 313173962 312653160 312790356 312538967 312252426 311829605 311514645 311133690 310388641
3308.8 310388641 309865932 309175587 308663139 308148384 307576790 307124882 306594620 306422863 306501369 306423836
3318.4 306423836 305598907 304654713 304299603 303711033 303001537 302634850 302335320 301941109 301391487 300730953
3328.1 300730953 300128975 299319496 298358021 297879181 297681313 297326393 296681423 295817699 295425262 295300102
3337.7B95300102o12106r60713r57527l79371j70136n96199q38966q28533m48876n68676
3347.3B88938999l82652r0866l99113k00367o96220o16970J30062k12994m27284p34348
3357B85308247q00438l47596N8213q4801p72514n42431N0373J25713k12707p75662
3366.6B82006397p27558j68075j50032l41263n4531r8057l88508m58927l69702l3187
3376.3B79216557J99546K3537k48775o57635j067753l61080P0534l40138j8196J66492
3385.9B76983089J69964j29394n50480N4264L36666j79405p09267m46243K76718K22626
3395.6B76028538J08242k8992m44050n32398j58348K95772J41049m7150m71077m77142
3405.2B74414444N32532M09584j76316L2597L65715N2376l18680K02713j2112n31406
$$ plain form
3337.7 295300102 294687996 293727283 292769756 292390385 292220249 291624050 290785084 289956551 289507675 288938999
3347.3 288938999 288556347 288465481 288066368 287866001 287169781 286552811 286682873 286469879 286042595 285308247
3357 285308247 284507809 284160213 284218426 284133625 283361111 282818680 282869053 282994766 282782059 282006397
3366.6 282006397 281278839 281110764 280960732 280619469 280564938 280466881 280078373 279619446 279249744 279216557
3376.3 279216557 279416103 279439640 279190865 278533230 277465477 277104397 277174931 276834793 276816597 276983089
3385.9 276983089 277153053 277023659 276473179 276527443 276864109 276684704 275975437 275529194 275805912 276028538
3395.6 276028538 276136780 276107788 275663738 275131340 274972992 275268764 275409813 275362663 274891586 274414444
3405.2 274414444 274946976 275356560 275180244 275212841 275578556 275630932 275312252 275514965 275502853 274971447
3414.8B74971447n19085J70097R47724L58066K0562o9180o7692p4291k62833M70829
3424.5B75945644O25611M31728L53737L33652N55745K27031q6555q1749K37751L12233
3434.1B78854828K62680N26352P50275O95056L61863L90911L83339K80246J60294K13814
3443.8B82879658L50876P22999J093750L17612K83241L63388P5684J17779K03895R08299
3453.4B87317181Q87832Q71773O85635K32467N62134Q53748J259041Q26931K13871
3462.1B93710613K62108P00722P09514L52002N77278L71666J040859J343098N40867
3470.8B99608727N82923R64051J171016N38636O15921R56134M77658O30131Q54492
3479.5C06399689Q01086R74617J025677M18033P59888J141606O96983P23534M30660
$$ plain form
3414.8 274971447 274452362 274622459 275570183 275928249 275948811 275879631 275811939 275737648 275474815 275945644
3424.5 275945644 276571255 277002983 277356720 277690372 278246117 278473148 278386593 278304844 278542595 278854828
3434.1 278854828 279117508 279643860 280394135 281089191 281451054 281841965 282225304 282505550 282665844 282879658
3443.8 282879658 283230534 283953533 285047283 285364895 285648136 286011524 286087208 286204987 286408882 287317181
3453.4 287317181 288205013 289076786 289762421 289994888 290557022 291410770 292669811 293496742 293710613
3462.1 293710613 293972721 294673443 295382957 295734959 296312237 296683903 297724762 299067860 299608727
3470.8 299608727 300191650 301155701 302326717 302865353 303481274 304437408 304915066 305545197 306399689
3479.5 306399689 307200775 308175392 309201069 309619102 310378990 311520596 312217579 312941113 313371773
3488.1C13371773L24001J063614J688042J031780M58183Q03528R02882J103916O83975
3496.8C21431694P45544J237450P96166R10186J527939J127320N49354Q58727Q99887
3505.5C30084267P46078P57141J747666J162719l79066J195831J585922J384736R56420
3514.2C39241714O04287J557922J406593J179924O00663K89268Q03681J543655J355934
3522.9C48583641L48167J131249J253738J899529J862793R54399R53407P35321J280175
3531.5C59002419Q93936J024398J563149J868057J296768K94991J492386J677894J714516
3540.2C70828514J441803J273155J323242J123505J445465R03549J445580L89671J013298
3548.9C81187782K259064K445030K667961K44942R03740J180305J963196K418099O15043
$$ plain form
3488.1 313371773 313695774 314759388 316447430 317479210 317937393 318740921 319643803 320747719 321431694
3496.8 321431694 322177238 323414688 324210854 325121040 326648979 327776299 328325653 329184380 330084267
3505.5 330084267 330830345 331587486 333335152 334497871 334118805 335314636 336900558 338285294 339241714
3514.2 339241714 339846001 341403923 342810516 343990440 344591103 344880371 345684052 347227707 348583641
3522.9 348583641 348931808 350063057 351316795 353216324 355079117 356033516 356986923 357722244 359002419
3531.5 359002419 359896355 360920753 362483902 364351959 365648727 365943718 367436104 369113998 370828514
3540.2 370828514 372270317 373543472 374866714 375990219 377435684 378339233 379784813 380174484 381187782
3548.9 381187782 383446846 385891876 388559837 388804779 389708519 390888824 392852020 395270119 395885162
3557.6C95885162J970177J939888J809731J029205J904793K911300J192818L487434
3565.3D12130508J892510N22232J342468N00717K931404J302300J395073K385445K201805
3574D26604462J647911J143379J869850J523514K723999K578316J392097J396103K500992
3582.6D43380623K660026J260682L535537K094727N36308K331162n96962K628288L484306
3591.3D61314697L391190K183304R33151L525696O24847J872597L791275J660004K847976
3600D82144737J857758J318855K330399K193451K410049K954865L049812Q63533L552666
3608.7E02676125R01374k8152P174606L284798j135140L405533Q43849M204407M967804
3617.4E26295204J742172K580414k44179O25420L386421L421212L050117L200798K688484
$$ plain form
3557.6 395885162 397855339 399795227 401604958 402634163 404538956 407450256 408643074 412130508
3565.3 412130508 414023018 414545250 415887718 416388435 419319839 420622139 422017212 424402657 426604462
3574 426604462 428252373 429395752 431265602 432789116 435513115 438091431 439483528 440879631 443380623
3582.6 443380623 446040649 447301331 450836868 452931595 453467903 455799065 455202103 457830391 461314697
3591.3 461314697 464705887 466889191 467822342 471348038 471972885 473845482 477636757 479296761 482144737
3600 482144737 484002495 485321350 487651749 489845200 492255249 495210114 498259926 499123459 502676125
3608.7 502676125 503577499 503549347 510723953 514008751 512873611 516279144 517122993 521327400 526295204
3617.4 526295204 528037376 530617790 530373611 530999031 534385452 537806664 540856781 544057579 546746063
3626E46746063K789650O693382L237877p808990K622795M251862N055580L175964M89883
3634.7E67254066K956925L415604K869949J884842K077713K552986L204956L161621
3642.4E89378662J578217K777519M408913N867996M55169k434120N541497J748619
3650.1F09322472r35173j44043M559440M374237M007798O200027m900970N24215N038719
3658.8F28046722K287178K197113R28383K370949J800652K013244J977387J128082
3666.5F42749710M847412L419190J393814Q85849o599198J807175P959976R072190
3674.3F65536118P44705j4599533J233825O751633M334717j302719Q75854K396546
3682F65971146J526794J416550P04651Q85772M567871P264634o998673l715744P846756
$$ plain form
3626 546746063 549535713 556229095 559466972 551657982 554280777 558532639 563588219 566764183 567254066
3634.7 567254066 570210991 573626595 576496544 578381386 580459099 583012085 586217041 589378662
3642.4 589378662 590956879 593734398 598143311 604011307 604466476 602032356 607573853 609322472
3650.1 609322472 608387299 608243256 612802696 617176933 621184731 627384758 622483788 623008003 628046722
3658.8 628046722 630333900 632531013 633459396 635830345 637630997 639644241 641621628 642749710
3666.5 642749710 647597122 651016312 652410126 653295975 646696777 648503952 656463928 665536118
3674.3 665536118 666280823 651681290 652915115 659666748 664001465 662698746 663574600 665971146
3682 665971146 667497940 668914490 669619141 670504913 675072784 682337418 675338745 671623001 679469757
3690.6F79469757m520721j878510M416733J452866J617050N59387Q4610J283798R82666
3699.3F83467636L139114L182908m961930k955780L891754J526184J18180Q88824L094940
3708F91391830L734055o124954M054870N319596j2508011K723541M227219O28738P29828
3716.7F94176712K147980J545791k414245J454849M935455l638534m347077N189362
3724.4F99050293K180557p74231k699508q31833K799835J145172N585480j066437o429138
3733.1F98960190Q363190J439895q202286r18960J351852K29492J393052L586731j642533
3741.8G04560623K784958J1647568o410980j8294983P991180N080185N487824j745224
3749.5G11101151r487458J0563736l551712r532242M470826M176864L573914m304734
$$ plain form
3690.6 679469757 674949036 673070526 677487259 678940125 680557175 681116562 681201172 682484970 683467636
3699.3 683467636 686606750 689789658 684827728 681871948 685763702 687289886 687408066 688296890 691391830
3708 691391830 695125885 689000931 693055801 698375397 685867386 688590927 692818146 693446884 694176712
3716.7 694176712 696324692 697870483 695456238 696911087 701846542 698208008 693860931 699050293
3724.4 699050293 701230850 700456619 697757111 696925278 699725113 700870285 706455765 705389328 698960190
3733.1 698960190 707323380 708763275 700560989 699642029 700993881 701223373 702616425 706203156 704560623
3741.8 704560623 707345581 718993149 712582169 694287186 702278366 707358551 712846375 711101151
3749.5 711101151 701613693 712177429 708625717 699093475 703564301 707741165 711315079 707010345
3757.2G07010345J561280N659942o366043k739639L327484J442719L77273L789215
3764.9G14062576j183319m419784K605514M698181J470566q457107L07617L067856
3772.6G12152100J94091K08664q30230Q98895O88705K739945N15594p116317J696624
3781.3G11148071J947403J173783K248611k917862j554718J205063J142120P86667
3789G15179138O1264j30920n64957O43006O3171R34906L302383k732544l626632J669388
3798.7G14798203L884887O606674m737472j0729294K775955K329254M238434N339890
3806.4G24506531q632508m320221M539719J627655K1897K73056l05329J408844N993653
3815.1G25113297o56052j3584137M386444N237961L459930K085877j4474564M17862
$$ plain form
3757.2 707010345 708571625 714231567 707865524 705125885 708453369 709896088 710273361 714062576
3764.9 714062576 712879257 708459473 711064987 715763168 717233734 708776627 709084244 712152100
3772.6 712152100 712346191 712554855 711724625 712623520 713312225 716052170 716567764 709451447 711148071
3781.3 711148071 713095474 714269257 716517868 713600006 712045288 713250351 714392471 715179138
3789 715179138 715240402 715109482 714544525 715187531 715250702 716185608 719487991 716755447 713128815 714798203
3798.7 714798203 718683090 725289764 720552292 709822998 712598953 714928207 719166641 724506531
3806.4 724506531 715874023 711553802 716093521 717721176 717743073 718016129 717710800 719119644 725113297
3815.1 725113297 724457245 710873108 715259552 720497513 723957443 726043320 711568756 711986618
3822.8G11986618M108582J439666K065583K45819k927323j84707J769485L211594K020721
3831.4G23736038p490845J402970O826401n450821j385346P503052o324463l653412
3839.2G15163574O782303m252930o31179N819473k214813l898468J904373J262283
3846.9G19934616j39542J539994k43759J729660N208282m211960J699143j3264008
3854.6G12252426j357422R232559j41677k093964J339340K576981K914657m365692
3862.3G20357208K4643N692673m901276n847702K845688M300766N894089m688568r317322
3871G14360199J992187N335007M291763q230361m75464K867660k14004K634659L270263
3879.7G25831909m934387o170883N026703J357422M79965M043426j0895004O85043
$$ plain form
3822.8 711986618 716095200 717534866 719600449 719846268 716918945 716734238 718503723 721715317 723736038
3831.4 723736038 716245193 717648163 724474564 719023743 717638397 725141449 718816986 715163574
3839.2 715163574 721945877 717692947 717061768 722881241 720666428 716767960 718672333 719934616
3846.9 719934616 719795074 721335068 721091309 722820969 728029251 723817291 725516434 712252426
3854.6 712252426 710895004 720127563 719985886 717891922 719231262 721808243 724722900 720357208
3862.3 720357208 720381851 726074524 721173248 715325546 718171234 722472000 728366089 723677521 714360199
3871 714360199 716352386 721687393 725979156 717748795 717273331 720140991 719926987 722561646 725831909
3879.7 725831909 720897522 714726639 719753342 721110764 721590729 725634155 714739151 715424194
3887.4G15424194L590241J038208M859772J30615o777954O02111K398453j581497M68521
3896.1G20152664O58875L032760L710404r215851L237839J708069o051331M488754
3903.8G21722183p53097j998444n40924N03998J710205k92359N7374j13907r156n6762
3913.4G20229111J37939J137390J936264k222900l238144L487091j6937l554230J124878
3922.1G19020462J438446J684113j328965l308715R82132J799926R72977o06842k92282
3930.8G20361252K163620j452942k326584J150436J11847o29959O6605J94855J831
3939.5G19640961k58484J152954J379547k493744q19244J538391R78317J152649k193069
3948.1G20078278r31244M34951j501770J525650L33939r43680N5847J12229k95868
$$ plain form
3887.4 715424194 719014435 720052643 724912415 725043030 718265076 718867187 721265640 719684143 720152664
3896.1 720152664 720811539 723844299 727554703 718338852 721576691 723284760 717233429 721722183
3903.8 721722183 720969086 718970642 718429718 718933716 720643921 720351562 720408936 720295029 720285873 720229111
3913.4 720229111 720367050 721504440 723440704 721217804 717979660 721466751 721449814 717895584 719020462
3922.1 719020462 720458908 722143021 720814056 717505341 718487473 720287399 721260376 720653534 720361252
3930.8 720361252 722524872 721071930 718745346 719895782 720007629 719377670 719444275 719639130 719640961
3939.5 719640961 719382477 720535431 721914978 719421234 718601990 720140381 721118698 722271347 720078278
3948.1 720078278 719147034 719581985 718080215 719605865 719939804 718996124 719051971 719164200 718868332
3956.8G18868332j264191R47037N72586N48477J039353j201249n56640L58658M44717
3965.5G19757080n86853j20850J192627L0899o81686j23138l7842j060410k43530N08881
3975.1G18635178O0653J01242k64129K4185J69372K07749M29535J30844j53732j29242
3984.8G19211655j06430M40673M15345j30463O49872l46604r88464j54419J94702P57675
3994.4G19943542l38592k41242L36686O1874J61972o17523
4000.2G19306717
$$ plain form
3956.8 718868332 717604141 718551178 719123764 719672241 720711594 719510345 718953705 719312363 719757080
3965.5 719757080 719170227 719049377 720242004 720272903 719591217 719468079 719430237 718369827 718126297 718635178
3975.1 718635178 718695831 718797073 718532944 718557129 718726501 718934250 719363785 719494629 719340897 719211655
3984.8 719211655 719105225 719545898 719961243 719830780 720480652 720134048 719145584 718991165 719185867 719943542
3994.4 719943542 719604950 719363708 719700394 719762268 719924240 719306717
4000.2 719306717
##END=$$ End of the data block
