##TITLE=$$ Begin of the data block
##JCAMP-DX=5.00 $$ ACD/SpecManager v 10.08
##SPECTROMETER/DATA SYSTEM=Varian
##DATE=14 Jan 2013 10:31:34
##DATA TYPE=INFRARED SPECTRUM
##DATA CLASS=XYDATA
##ORIGIN=
##OWNER=
##NPOINTS=3735
##FIRSTX=399.26403809
##LASTX=4000.35498047
##MAXX=4000.35498047
##MINX=399.26403809
##MAXY=77.43513489
##MINY=27.57818031
##XFACTOR=1.0000000000
##YFACTOR=0.000000100000000
##FIRSTY=49.89590836
##DELTAX=0.96440572
##XUNITS=1/CM
##YUNITS=TRANSMITTANCE
##XYDATA=(X++(Y..Y))
399.3D98959084q305893K823104J1245423K090797J535340m292069r735527q071670
$$ 498959084 490653191 493476295 504721718 506812515 508347855 504055786 494320259 486248589
407D86248589o62041J0442962P011757K407113J694183K303696K271919j878624j2359543
$$ 486248589 485586548 496029510 503041267 505448380 507142563 509446259 511718178 509839554 497480011
415.7D97480011j5582123L891297J6910553l776513P717324N113945o294556j2161713
$$ 497480011 481897888 485789185 502699738 498923225 506640549 511754494 505459938 493298225
423.4D93298225q51249J1978l210144J202850O653938M650918l06054k180252m244003
$$ 493298225 492446976 492458954 489248810 490451660 497105598 501756516 501450462 499270210 495026207
432.1D95026207K831840K390671q078727n071183L637085P473336L380088k224884
$$ 495026207 497858047 500248718 492169991 487098808 490735893 498209229 501589317 499364433
439.8D99364433j642685j146316J770401k235375p800941q12035L281250N140801N207176
$$ 499364433 497721748 496575432 498345833 496110458 488309517 487497482 490778732 495919533 501126709
448.4E01126709m13933l580551k843704j916313j336937j150551J238136K538643J164284
$$ 501126709 500712776 497132225 494288521 492372208 491035271 489884720 491122856 493661499 494825783
457.1D94825783j060372j369362q48579j405334m95644j168480j017189J273041K334404
$$ 494825783 493765411 492396049 491547470 490142136 489646492 488478012 487460823 488733864 491068268
465.8D91068268M337501l70941n274467k516442l634452k091370j345635k799720O82411
$$ 491068268 495405769 495034828 489760361 487243919 483609467 481518097 480172462 477372742 478055153
474.5D78055153L455086M465370k073822l880310j819000n75829J576920l42675O63986
$$ 478055153 481510239 485975609 483901787 480021477 478202477 477626648 479203568 478860893 479524879
483.2D79524879m32930J007042K982979l04680o49490n453949m419250M028930M749336
$$ 479524879 479091949 480098991 483081970 482777290 482127800 476673851 472254601 476283531 481032867
491.8D81032867K50435k040100n37987P40967r69276k713051k862167k848435R42383
$$ 481032867 481283302 479243202 478705215 479446182 478476906 475763855 472901688 470053253 470995636
500.5D70995636N487289N008774m9019l861351l624305k336312k464676j842918O19278
$$ 470995636 476482925 481491699 481442680 477581329 473957024 471620712 469156036 467313118 467932396
509.2D67932396K409668N31120K117501l90854k760544j587334l164215L75023J516266
$$ 467932396 470342064 470873184 472990685 472599831 469839287 468251953 465087738 465462761 466979027
517.9D66979027j48621K256432J574783j684341k795449j067237j529503l886795k557221
$$ 466979027 466830406 469086838 470661621 468977280 466181831 465114594 463585091 459698296 457141075
526.6D57141075K246514L895111M113311J749268j986923k996826m154358l466530
$$ 457141075 459387589 463282700 467396011 469145279 467158356 464161530 460007172 456540642
534.3D56540642o61240J424446K669373K572136J639366q21076k641983k929458j829071
$$ 456540642 455879402 457303848 459973221 462545357 464184723 463363647 460721664 457792206 455963135
543D55963135j260910K8686K341500K015647O09627j348533m17405j189384l161316
$$ 455963135 454702225 454730911 457072411 459088058 459697685 458349152 457931747 456742363 453581047
551.6D53581047k037086j582337J86272L42254J413193K217102K3346j540069l076783
$$ 453581047 451543961 449961624 450147896 450490150 451903343 454120445 454143791 452603722 449526939
560.3D49526939k890739q90541L029213K687340N72319J893234J184654j499138k971267
$$ 449526939 446636200 445745659 448774872 451462212 452034531 453927765 455112419 453613281 450642014
569D50642014k170296j866379l24936Q93517J027336L694763K754974j030540l387680
$$ 450642014 448471718 446605339 446280403 447173920 448201256 451896019 454650993 453620453 450232773
577.7D50232773k747917p41158J23367Q34237m425J365585K295685L15551j367263
$$ 450232773 447484856 446743698 446867065 447701302 447696877 449062462 451358147 451673698 450306435
586.4D50306435j508599r26437o25725J37863k19421J655922M183616L542748O14929
$$ 450306435 448797836 447871399 447245674 447383537 447164116 448820038 453003654 456546402 457161331
595D57161331j955261k012444k664489j104508L17345J87569K227973K211380j51176
$$ 457161331 455206070 453193626 450529137 449424629 449741974 449929543 452157516 454368896 454217720
603.7D54217720j386070j888657k291679j896134j391639O02073K063561Q66775L85628
$$ 454217720 452831650 450942993 448651314 446755180 445363541 445965614 448029175 448895950 449281578
612.4D49281578k33192q24547k011185k134933j040345k99148J520805J859970K118378
$$ 449281578 449048386 448223839 446212654 444077721 443037376 442738228 444259033 446119003 448237381
621.1D48237381Q67424L53432Q97865j462593k290917J34850K967072L255844L439140
$$ 448237381 449104805 449458237 450356102 448893509 446602592 446737442 449704514 452960358 456399498
629.8D56399498K711182p5608K17972Q20580k4987P325J459312K279854K340088L452377
$$ 456399498 459110680 459035072 459253044 460073624 460048637 460055962 461515274 463795128 466135216 469587593
639.4D69587593L132057J58158j377678m5204J07803r6092J875305K762298K360077
$$ 469587593 472719650 472877808 471500130 471454926 471562729 471466637 473341942 476104240 478464317
648.1D78464317K275849J878814P70150n86319j411705j392327j016159J914025M595413
$$ 478464317 480740166 482618980 483389130 482802811 481391106 479998779 478982620 480896645 485492058
656.8D85492058J369209n48935J12953j514320k550926k544670j239357J98936K198372
$$ 485492058 486861267 486312332 486425285 484910965 482360039 479815369 478576012 478774948 480973320
665.4D80973320L633614J605033p57713P07092r28573k050667j238747J329079K671509
$$ 480973320 484606934 486211967 485454254 486161346 485232773 483182106 481943359 483272438 485943947
674.1D85943947L267593L542938K111092P77397M89388l90625j643296m63943J166191
$$ 485943947 489211540 492754478 494865570 495642967 496132355 495741730 494098434 493634491 494800682
682.8D94800682K103615K947311L078842L065682J435661p61223k189903j371689M52156
$$ 494800682 496904297 499851608 502930450 505996132 507431793 506670570 504480667 503108978 503561134
691.5E03561134O33965K079010L413582K738838R77096l80172j134758k169075q29582
$$ 503561134 504195099 506274109 509687691 512426529 513403625 513023453 511888695 509719620 508890038
700.2E08890038K22625R21974K949372L398170K657089J264039o2943j471558j860580
$$ 508890038 509112663 510034637 512984009 516382179 519039268 520303307 520240364 518768806 516908226
708.8E16908226r43146J100693L894272L594589K506981J618919n06820j495705j396637
$$ 516908226 515965080 517065773 520960045 524554634 527061615 528680534 528173714 526678009 525281372
717.5E25281372j018333n75028R36051K978401K523155K325363K354126l6354j288185
$$ 525281372 524263039 523688011 524624062 527602463 530125618 532450981 534805107 534768753 533480568
726.2E33480568j727905j527443Q45985J938896L060189L935890K698631M11720j655044
$$ 533480568 531752663 530225220 531071205 533010101 536070290 540006180 542704811 543116531 541461487
734.9E41461487k077942j935539k91748J575470K524108K930871K276496R04580p64275
$$ 541461487 539383545 537448006 537156258 538731728 541255836 544186707 546463203 547367783 546603508
743.6E46603508j277275k120819j771698K87285K396888L891220K753678J421661O83937
$$ 546603508 545326233 543205414 541433716 541721001 544117889 548009109 550762787 552184448 552868385
752.2E52868385l51257j528206j532326K24610J618118K425308K805329L052787J751519
$$ 552868385 552517128 550988922 549456596 549681206 551299324 553724632 556529961 559582748 561334267
760.9E61334267k44255j287384j350708m98047K81448J768379K569275L016091J408691
$$ 561334267 561090012 559802628 558451920 557953873 558235321 560003700 562572975 565589066 566997757
769.6E66997757r96246m55437j497002k680893j201820Q45718J467095J875496K333450
$$ 566997757 566001511 565546074 564049072 561368179 560166359 561012077 562479172 564354668 566688118
778.3E66688118J209030l91693j488228j627426k209167m08059J728402J989898K533493
$$ 566688118 567897148 567505455 566017227 564389801 562180634 561772575 563500977 565490875 568024368
787E68024368J324806J023903k80342j454010j142959j792221j41640J552582J891327
$$ 568024368 569349174 570373077 570092735 568638725 567495766 565703545 565561905 567114487 569005814
795.6E69005814J395073P51647q12454k148094k803802l855286j479111j68419K77863
$$ 569005814 570400887 571152534 570340080 568191986 565388184 561532898 560053787 559885368 560163231
804.3E60163231J149712m37470j705513k703285l161698l249816k659188j397667p42264
$$ 560163231 561312943 560875473 559169960 556466675 553304977 550055161 547395973 545998306 545256042
813E45256042R0104O07872l70751j159515j921616k722473j417198r05151N09033K770118
$$ 545256042 545346146 545954018 545583267 544423752 542502136 539779663 538362465 537457314 537966347 540736465
822.6E40736465K965432L264846K466050J396789O60629J416970J904068J177749L275567
$$ 540736465 543701897 546966743 549432793 550829582 551490211 552907181 554811249 555988998 559264565
831.3E59264565M061050M244804L773957K452621K331925J113777L93905n493J404991
$$ 559264565 563325615 567570419 571344376 573796997 576128922 577242699 577636604 577631111 579036102
840E79036102K351036K933388L971787K896080J553039L31497N18952k11449l30086
$$ 579036102 581387138 584320526 588292313 591188393 592741432 593072929 593591881 593380432 593050346
848.7E93050346P48825L006402M230957J569824K083816J776772M1962m72260k20566
$$ 593050346 593799171 596805573 601036530 602606354 604690170 606466942 606508904 606036644 605816078
857.4F05816078J236115K507972M655571L268128J832657Q81195p90482j188240j966934
$$ 605816078 607052193 609560165 614215736 617483864 619316521 620197716 619407234 618218994 616252060
866F16252060o36292L19329J017875J077233P26166j20469j916427j898384k530670
$$ 616252060 615615768 615935097 616952972 618030205 618756371 618635902 616719475 614821091 612290421
874.7F12290421k643242j741181o34155K79465J180267R90639J17187m42047k386093
$$ 612290421 609647179 607905998 607271843 607551308 608731575 609722214 609839401 609397354 607011261
883.4F07011261k445259k254906j076164K64664O85577J877937L50266r59358j405487
$$ 607011261 604566002 602311096 601234932 601499596 602185173 604063110 604413376 603454018 602048531
892.1F02048531j049958j011200o59370J19705l06129J456108J541137Q33779j007385
$$ 602048531 600998573 599987373 599328003 599447708 599141579 600597687 602138824 602972603 601965218
900.8F01965218k867508j516152n39245P46154J441155L037071L350411K535629J730232
$$ 601965218 599097710 597581558 597042313 597788467 599229622 602266693 605617104 608152733 609882965
909.4F09882965k06108k67220j645126j607780m26789L63045L85704q57315q62999
$$ 609882965 609676857 609409637 607764511 606156731 605729942 606092987 606478691 605621376 604758377
918.1F04758377k322388l295364l506889k889901k865409l231659j598015p45354j162910
$$ 604758377 602435989 599140625 595633736 592743835 589878426 586646767 585048752 584303398 583140488
926.8E83140488k912178l475075l735390m006920l895607k829818J48887M06990n43213
$$ 583140488 580228310 576753235 573017845 569010925 565115318 562285500 562434387 562841377 562298164
935.5E62298164j206550j023140j172219k627258k375259k023468j278992n29327N30319
$$ 562298164 561091614 560068474 558896255 556268997 553893738 551870270 550591278 550061951 550592270
944.2E50592270Q69179k76947q02575j659660k146339j925469l87420J76239J50756
$$ 550592270 551461449 551184502 550381927 548722267 546575928 544650459 544263039 544439278 544590034
952.8E44590034Q66433N2604j267166k744446l109016l802795l716240j933747o67572
$$ 544590034 545456467 545509071 544241905 541497459 538388443 534585648 530869408 528935661 528268089
961.5E28268089k22244j373901j952362k769890l160668l100166l132973j609573j539002
$$ 528268089 528045845 526671944 524719582 521949692 518789024 515688858 512555885 510946312 509407310
970.2E09407310j558837j131363j665726k693863m110908m568749m635200m287835
$$ 509407310 507848473 506717110 505051384 502357521 498246613 493677864 489042664 484754829
977.9D84754829l749160l629952l145180k954368m021568n244866o042480o205521
$$ 484754829 481005669 477375717 474230537 471276169 467254601 462009735 455967255 449761734
985.6D49761734n907593n087585l999405l862534l565674l120269l179741m145775
$$ 449761734 443854141 438766556 434767151 430904617 427338943 424218674 421038933 416893158
993.3D16893158m642754m195747l911400l551330l328209k730599k123985j936264
$$ 416893158 412250404 408054657 404143257 400591927 397263718 394533119 392409134 390472870
1001.1C90472870k569695k626075k723694l003693k838707k635841j088066j306229
$$ 390472870 387903175 385277100 382553406 379549713 376711006 374075165 372987099 371680870
1008.8C71680870j200561j049042j919785j997032k560081j724091k158508k304383
$$ 371680870 370480309 369431267 367511482 365514450 362954369 361230278 359071770 356767387
1016.5C56767387k371292k474975j579552k493629k053833j872559k141609l047219
$$ 356767387 354396095 351921120 350341568 347847939 345794106 343921547 341779938 338732719
1024.2C38732719j980476j117668k560730j085816j261634o36521q62503j840858j358910
$$ 338732719 336752243 335634575 333073845 331988029 330726395 330089874 329227371 327386513 326027603
1032.9C26027603r87701K21710o08330P20215R74312J615181K363472R02710J359367
$$ 326027603 325039902 325261612 324653282 325373497 326347809 327962990 330326462 331229172 332588539
1041.6C32588539R81865J263390O3285J71624M78172p73277j10741p057p76520k548523
$$ 332588539 333570404 334833794 334897079 335068703 335546875 334773598 334662857 334655800 333879280 331330757
1051.2C31330757j065140j126442j293029j12152q58994O11115m58832m46587l395
$$ 331330757 330265617 329139175 327846146 327733994 326875000 327486115 327027283 326580696 326577301
1059.9C26577301M29688J104736J816292L814888J806030J958809K602691K536431
$$ 326577301 327006989 328111725 329928017 333742905 335548935 337507744 340110435 342646866
1067.6C42646866J846962O15539N96695R3003J357803O24733J286697J409150L52783
$$ 342646866 344493828 345109367 345706062 345799065 347156868 347781601 349068298 350477448 350830231
1076.3C50830231J034622J30730P9002o5918J153870Q93707Q09250J983719J710243
$$ 350830231 351864853 351995583 352074585 352008667 353162537 354056244 354865494 356849213 358559456
1085C58559456J976585J180725J329728J209831J670074N75752J53046K426567K819557
$$ 358559456 360536041 361716766 363046494 364256325 365926399 366502151 366655197 369081764 371901321
1093.6C71901321L046074Q99735P68928J300354J143608J623078Q33092K030601J708336
$$ 371901321 374947395 375847130 376616058 377916412 379060020 380683098 381516190 383546791 385255127
1102.3C85255127J580582J191635O25801J254082J076011P82967n73235O56548J627006
$$ 385255127 386835709 388027344 388653145 389907227 390983238 391766205 391192970 391849518 393476524
1111C93476524J472588J271515Q94165J496582N11742K35824k67410n5771k43340q81576
$$ 393476524 394949112 396220627 397114792 398611374 399123116 399358940 399091530 399035759 398792419 397910843
1120.6C97910843N40428O89774J103935O63872K17743N34057Q53958O19622N25436
$$ 397910843 398451271 399141045 400244980 400908852 401126595 401660652 402514610 403134232 403659668
1129.3D03659668K261543K177201K759628K846336K129402J602555O20956K289581
$$ 403659668 405921211 408098412 410858040 413704376 415833778 417436333 418057289 420346870
1137D20346870K374115J632920K223282K684478K320786N31502P43217R84039P6828
$$ 420346870 422720985 424353905 426577187 429261665 431582451 432113953 432857170 433841209 433918037
1145.7D33918037M53797M26025K24495N98984J043434P11060n78957q28209l98827
$$ 433918037 434371834 434797859 435022354 435621338 436664772 437375832 436796875 435968666 435569839
1154.4D35569839n31921k91901m42581r33723l00255L19214k4300l85132r2849m50020
$$ 435569839 435037918 434746017 434303436 433369713 433069458 433388672 433364372 432979240 432886391 432436371
1164D32436371j2398J353073J369820K036400L363151L409882K413368K028694K154579
$$ 432436371 432423973 433777046 435146866 437183266 440546417 443956299 446369667 448398361 450552940
1172.7D50552940K599564K974091L136634K912827K301216K896805L391762L134727
$$ 450552940 453152504 456126595 459263229 462176056 464477272 467374077 470765839 473900566
1180.4D73900566K542496J673508J009101J558266J851235J559104J702538R29451
$$ 473900566 476443062 478116570 479125671 480683937 482535172 484094276 485796814 486726265
1188.1D86726265P15256K08473l66554l78228n04722l46146l15246L0517m25796n80407
$$ 486726265 487441521 487649994 487283440 486905212 486400490 486054344 485739098 485769615 485343819 484763412
1197.8D84763412j108741j686592r39103j552658j854629j372261r28917o38542q70362
$$ 484763412 483654671 481968079 481028976 479476318 477621689 476249428 475320511 474681969 473811607
1206.5D73811607p21359q59527m95911m42085q83675n43785n44815l03955j13030m13017
$$ 473811607 473090248 472230721 471734810 471292725 470409050 469865265 469320450 469016495 468903465 468490448
1216.1D68490448l88908P1640J3084p91092j056023o60018l8338k75002n95398j56936
$$ 468490448 468101540 468173180 468186264 467395172 466339149 465679131 465640793 465365791 464770393 464613457
1225.8D64613457k42996q30842j215400j030426q98819n48897n07126q11729l41492
$$ 464613457 464370461 463539619 462324219 461293793 460394974 459846077 459338951 458527222 458185730
1234.4D58185730j56593J94206q4496p79724p67441n84144n9891j23711J57624J05095
$$ 458185730 458029137 458223343 458138847 457359123 456591682 456007538 455947647 455823936 455981560 456086655
1244.1D56086655m26827l37906o55861p44361n99976j70860k93465k16866M04892j15699
$$ 456086655 455659828 455321922 454666061 453921700 453321724 453150864 452857399 452640533 453045425 452929726
1253.7D52929726p6218n6496n55648n70641l96500p5988L25279M39606J94587M81987
$$ 452929726 452853508 452797012 452241364 451670723 451274223 451198235 451523514 451963120 452157707 452639694
1263.4D52639694M53949L80783P13043O96640O29235P84492J189232J390267J084671
$$ 452639694 453093643 453474426 454187469 454884109 455513344 456297836 457487068 458877335 459962006
1272D59962006P16285Q94738J025047J330261J374588J264267J430702J453896J556854
$$ 459962006 460678291 461573029 462598076 463928337 465302925 466567192 467997894 469451790 471008644
1280.7D71008644J072312J278495J348458J458473J970634J690140K092209J572494
$$ 471008644 472080956 473359451 474707909 476166382 478137016 479827156 481919365 483491859
1288.4D83491859Q63305J247291J556549R78050N11628R29756J076431J240463Q73299
$$ 483491859 484355164 485602455 487159004 488137054 488648682 489578438 490654869 491895332 492768631
1297.1D92768631J032791J015434J15509J67504O84471L42369o7711O40907N93262
$$ 492768631 493801422 494816856 494932365 495099869 495784340 496126709 496058998 496699905 497293167
1305.8D97293167M15459L3417l21885o22863j513443q53653o51131m58107k64359j75247
$$ 497293167 497708626 497742043 497420158 496797295 495283852 494430199 493779068 493320961 493056602 492881355
1315.4D92881355P78427M51127L86238K60849K10342N12123K89726Q36411J387825
$$ 492881355 493659782 494110909 494497147 494757996 494968338 495480461 495770187 496606598 497994423
1324.1D97994423J174889N59501M42658r8381m46511n33180o38466k85530l89366l65372
$$ 497994423 499169312 499728813 500171471 500073090 499626579 499093399 498454933 498169403 497780037 497414665
1333.8D97414665j57852L31078j41335n36461K81639R6550l45535m18777O65054J271057
$$ 497414665 497256813 497587891 497446556 496910095 497191734 497288284 496942749 496523972 497189026 498460083
1343.4D98460083J139946J184425N62249J89476l00599j89361j82686K36321M81414
$$ 498460083 499600029 500784454 501346703 501536179 501235580 501046219 500863533 501099854 501581268
1352.1E01581268j90620l1700m6158K8572l17650p20749j266174q05855j1368j93176
$$ 501581268 501390648 501358948 501312790 501341362 501023712 500302963 499036789 498230934 498219566 498026390
1361.7D98026390K73972m64173n6381j97067q84094n36232j203576r72519l93371J68114
$$ 498026390 498300362 497836189 497779808 497582741 496698647 496162415 494958839 493986320 493592949 493761063
1371.4D93761063J41182K35519M24461l48625q9226n93719l98750k30179P4920o3057
$$ 493761063 493902245 494137764 494562225 494213600 494124374 493530655 493131905 492901726 492976646 492913589
1381D92913589p56416j092377j768722r77440o46477p14988k583771j834641k47688
$$ 492913589 492157173 491064796 489296074 488318634 487672157 486957169 484373398 482538757 482291069
1389.7D82291069j463814j461296j412659j011505k221527l694992j866798j991501
$$ 482291069 480827255 479365959 477953300 476941795 474720268 471025276 469158478 467166977
1397.4D67166977j285439k458267k340698j232452j737061j779594k095986l107719
$$ 467166977 465881538 463423271 461082573 459850121 458113060 456333466 454237480 451129761
1405.1D51129761l143425j355896r54590j321488j251106j817512j608048j572380
$$ 451129761 447986336 446630440 445675850 444354362 443103256 441285744 439677696 438105316
1412.8D38105316j445770j418572r11369K3728m06800N21469j620559j170617P79152
$$ 438105316 436659546 435240974 434329605 434353333 433946533 434468002 432847443 431676826 432455978
1421.5D32455978j7852P73811J1597J39122O93473N09377J304321J235123J210060
$$ 432455978 432438126 433211937 433223534 433362656 434056129 434565506 435869827 437104950 438315010
1430.2D38315010M79469J507836J473808J115341K014389J869583J938782J144676
$$ 438315010 438794479 440302315 441776123 442891464 444905853 446775436 448714218 449858894
1437.9D49858894K083016J472435J474685J527253Q77227J316987Q85391J841202J891517
$$ 449858894 451941910 453414345 454889030 456416283 457293510 458610497 459495888 461337090 463228607
1446.6D63228607K178726J259957N22613J254387J007080J776963O60667J803055K409477
$$ 463228607 465407333 466667290 467189903 468444290 469451370 471228333 471889000 473692055 476101532
1455.3D76101532J471825R99717O55785L801651Q77228J670150J304055J460457L066444
$$ 476101532 477573357 478573074 479228859 483030510 483907738 485577888 486881943 488342400 491408844
1464D91408844J512985K280731K214356K350922J847610K487106L339997K503166K753982
$$ 491408844 492921829 495202560 497416916 499767838 501615448 504102554 507442551 509945717 512699699
1472.6E12699699J862641L799286L552894K969971J913643J613006J374474J394768
$$ 512699699 514562340 518361626 521914520 524884491 526798134 528411140 529785614 531180382
1480.3E31180382K122116J562843J981392K052498J352615J619416O52771o7177J219558
$$ 531180382 533302498 534865341 536846733 538899231 540251846 541871262 542524033 542456856 543676414
1489E43676414m75692k057610P4425P83501O8245m55056k52380m440651p99675j294975
$$ 543676414 543200722 541143112 541217537 542001038 542069283 541614227 541361847 536921196 536121521 534826546
1498.7E34826546l834801p86133j014900j137085q07991Q53729P21627l393784l683395
$$ 534826546 530991745 530205612 529190712 528053627 527245636 528099365 528820992 525427208 521743813
1507.3E21743813n47677O36673j453628J80588j72501j017075l44467j480713r05990
$$ 521743813 521196136 521832809 520379181 520559769 520387268 519370193 519025726 517545013 516639023
1516E16639023j623154k176208O55288J640625N33371j404190l85627K19879J667518
$$ 516639023 515015869 512839661 513494949 515135574 515668945 514264755 513879128 514099007 515766525
1524.7E15766525q28438k86788J095352K07710R07593J219787J667252J427040O98128
$$ 515766525 514938087 514651299 515746651 515954361 516861954 518081741 519748993 521176033 521874161
1533.4E21874161j277924P09000O94237Q59336K509880M17481j369324J081696J024551
$$ 521874161 520596237 521305237 521999474 522858810 525368690 525786171 524416847 525498543 526523094
1542.1E26523094j2474Q39234M68559j905632J096153Q98323J317520Q94623o27098
$$ 526523094 526510620 527349854 527818413 525912781 527008934 527907257 529224777 530119400 529492302
1550.7E29492302O84967O48003J894760j623307j432228J345826J712379J576538o466980
$$ 529492302 530177269 530825272 532720032 531096725 529664497 531010323 532722702 534299240 527832260
1559.4E27832260j818886l17955j55945j524200o49300k114715k621422j026382j617279
$$ 527832260 526013374 525695419 525539474 524015274 523365974 521251259 518629837 517603455 515986176
1568.1E15986176j68534p700081k729683k347793l792725k443313k741280q23517j0295448
$$ 515986176 515817642 508117561 505387878 503040085 499247360 496804047 494062767 493239250 482943802
1576.8D82943802k101975l269310m503288m117546n793228l952446n913773l663406
$$ 482943802 480841827 477572517 473069229 468951683 463158455 459206009 453292236 449628830
1584.5D49628830m986992m261436m092636n034905l360443o025963l581695o252137
$$ 449628830 444641838 440380402 436287766 431252861 427892418 421866455 418284760 412032623
1592.2D12032623m212990m237937n064164k556305m723701k559891n299530k722130
$$ 412032623 407819633 403581696 398517532 395961227 391237526 388677635 383378105 380655975
1599.9C80655975l980865l920250k371674m706764j435585l615608j035233l313026
$$ 380655975 376675110 372754860 370383186 365676422 364240837 360625229 359589996 356276970
1607.6C56276970k102470j693841l803558n20363k974128J24092j876984M73213L77503
$$ 356276970 354174500 352480659 348677101 348156738 345182610 345306702 343429718 343902931 344280434
1616.3C44280434n710869J608047j752166N70602j594849J207161Q7967k421493J480789
$$ 344280434 338569565 340177612 338425446 338996048 337401199 338608360 338696327 336274834 337755623
1625C37755623l85246K277183j640816O77185J92147M83284J220016o4811K820663
$$ 337755623 337370377 339647560 338006744 338683929 338876076 339359360 340579376 340514565 343335228
1633.7C43335228N10330K722016j563225K440681J082764P83615L071594O51055L055839
$$ 343335228 343845558 346567574 345004349 347445030 348527794 349311409 352383003 353034058 356089897
1642.4C56089897Q60977K801094L006478L07617K384415j324540K732888O24160L140793
$$ 356089897 356950874 359751968 362758446 363066063 365450478 364125938 366858826 367482986 370623779
1651C70623779K498513j636200O27670O73141M518891R25178J804009P63626J845894
$$ 370623779 373122292 371486092 372113762 372786903 377305794 378230972 380034981 380798607 382644501
1659.7C82644501K583542J950454L464585J099662L840714K071419K834320K874794
$$ 382644501 385228043 387178497 390643082 391742744 395583458 397654877 400489197 403363991
1667.4D03363991K808876M473686J743660N105705K722702M516869M193725L634072
$$ 403363991 406172867 410646553 412390213 417495918 420218620 424735489 428929214 432563286
1675.1D32563286K936897K617874M564934L369865N491562L737793M267502N765381
$$ 432563286 435500183 438118057 442682991 446052856 451544418 455282211 459549713 465315094
1682.9D65315094M716644O843262l34740N117760M462967M503822N170822M532090
$$ 465315094 470031738 476875000 476540260 481658020 486120987 490624809 495795631 500327721
1690.6E00327721N083885M684601N142326M776154N085754L311996N613556N585709
$$ 500327721 505411606 510096207 515238533 520014687 525100441 528412437 534025993 539611702
1698.3E39611702N657654O067619k77443O447334M905930L814697K865906M003677
$$ 539611702 545269356 551336975 551059532 557506866 562412796 566227493 569093399 573097076
1706E73097076L552781K455940M028930L086281K469101K390709K735329L155098Q71162
$$ 573097076 576649857 579105797 583134727 586221008 588690109 591080818 593816147 596971245 597842407
1714.7E97842407N35279L272743L335075j865349K722283L105812J672058J488228
$$ 597842407 598377686 601650429 604985504 603120155 605842438 608948250 610620308 612108536
1722.4F12108536R62524P46041J395263J688652J451340J885300K415275N47066M24843
$$ 612108536 613071060 613817101 615212364 616901016 618352356 620237656 622652931 623199997 623624840
1731.1F23624840L184738L461914q82149l344192L585052L606148K127037L287430
$$ 623624840 626809578 630271492 629389343 626045151 629630203 633236351 635363388 638650818
1738.8F38650818J692200j644822L201676K975998J491623J981887L163224L533706
$$ 638650818 640343018 638698196 641899872 644875870 646367493 648349380 651512604 655046310
1746.5F55046310K970963K988892J959457M323120K310104n9967L681412L068161L495941
$$ 655046310 658017273 661006165 662965622 667288742 669598846 669538879 673220291 676288452 679784393
1755.2F79784393L738480R20715J764984K821579K156372K982941M21677O11801L348312
$$ 679784393 683522873 684443588 686208572 689030151 691186523 694169464 694591141 695202942 698551254
1763.9F98551254K127533K011185K185287K038880j541367J148300M045334J616287
$$ 698551254 700678787 702689972 704875259 706914139 705372772 706521072 710566406 712182693
1771.6G12182693O9733j401062L089829K215652p1335K085037L04566R25293P48672
$$ 712182693 712252426 710851364 713941193 716156845 716085510 718170547 718475113 719400406 720149078
1780.3G20149078l54843J054306K038651K384949j91880L5553J190109N75867L52783
$$ 720149078 719794235 720848541 722887192 725272141 725080261 725115814 726305923 726881790 727234573
1788.9G27234573J241455J325379J609344o11648p58209L179626J319428m86222K04239
$$ 727234573 728476028 729801407 731410751 730799103 730040894 733220520 734539948 734053726 734257965
1797.6G34257965J182709N80215o01883K501908Q46481Q67081J499939L67202M10233
$$ 734257965 735440674 736020889 735419006 737920914 738767395 739634476 741134415 741501617 741911850
1806.3G41911850j36642J25427M89883J718369L60107P98493J559753J33820M17709
$$ 741911850 741775208 741900635 742390518 744108887 744468994 745267487 746827240 746961060 747378769
1815G47378769l39356O04248j02539J51902J147308M55933J378402M43344J300889
$$ 747378769 747039413 747643661 747541122 747693024 748840332 749296265 750674667 751118011 752418900
1823.7G52418900J296539k403488j041565J284408K150040J555786j647262J6403J929321
$$ 752418900 753715439 751311951 750270386 751554794 753704834 755260620 753613358 753629761 755559082
1832.3G55559082P0114k27585j74255J99738O44149k34909J193772P57293J050034
$$ 755559082 755629196 755401611 755227356 755427094 756071243 755836334 757030106 757787399 758837433
1841G58837433Q73413J423874N94177n119781J452102J629639M65012M33502P81402
$$ 758837433 759710846 761134720 761728897 756609116 758061218 759690857 760155869 760589371 761370773
1849.7G61370773J002045m25568K81906l76358m2800k84729J14898J337357N50842
$$ 761370773 762372818 761947250 762229156 761852798 761809998 761525269 761640167 762977524 763528366
1858.4G63528366Q73871K74963O42548n82581o53915j1749j54877J287460L42408J179580
$$ 763528366 764402237 764677200 765319748 764737167 764083252 764071503 763916626 765204086 765546494 766726074
1868G66726074K9221j025009M09393L9520J78452l57208K02636O1493J003723R93271
$$ 766726074 766755295 765730286 766139679 766179199 766357651 766000443 766203079 766264572 767268295 768261566
1877.7G68261566K47955M05121l20129M8828q56857j12763J67160J76239P61185L28674
$$ 768261566 768509521 768914642 768594513 768643341 767786484 767673721 767840881 768017120 768778305 769106979
1887.3G69106979J506806K59628j405792o05850J34124o713L07235Q12989k34528R00955
$$ 769106979 770613785 770873413 769467621 768861771 768995895 768989182 769296417 770109406 769874878 770775833
1896.9G70775833M11606n6839k83814n12313J9531m30985O66962M54331O05621P90176
$$ 770775833 771187439 771130600 770846786 770334473 770354004 769923019 770589981 771044312 771649933 772440109
1906.6G72440109K38571k51770o19812l18832q51517M92783L20587N81360R82895L29666
$$ 772440109 772678680 772426910 771807098 771488266 770636749 771129532 771450119 772031479 773014374 773344040
1916.2G73344040J007309j924591j402970O02112L27606O87638N25360N4474m9134
$$ 773344040 774351349 772426758 771023788 771625900 771953506 772641144 773166504 773220978 773171844
1924.9G73171844K76108m16183Q7967k55204n41915K33841l5401N30625K87628M61502
$$ 773171844 773447952 773031769 773119736 772864532 772322617 772556458 772521057 773051682 773339310 773800812
1934.6G73800812l8300l09906l20587p02743j97297k93579J397782R13925o69251K95105
$$ 773800812 773762512 773452606 773132019 772429276 772231979 771938400 773336182 774250107 773580856 773875961
1944.2G73875961J99280k80304j182785q19168k30331P54089P17697L80631M04815
$$ 773875961 774075241 773794937 772612152 771792984 771562653 772316742 773034439 773415070 773819885
1952.9G73819885k13928l9444p29141j96915l15399p45163l4485M70658R19494M8218
$$ 773819885 773605957 773566513 772837372 772640457 772325058 771579895 771545410 772016068 772935562 772983780
1962.5G72983780K77100j83030m27398l94364j005020j82419N23529J209641K77862
$$ 772983780 773260880 773077850 772650452 772256088 771251068 771068649 771592178 772801819 773079681
1971.2G73079681J57013l1738m01382j51596q34961m51355m53568P41501Q59833K36129
$$ 773079681 773236694 773204956 772803574 772651978 771817017 771365662 770912094 771653595 772513428 772749557
1980.8G72749557L62092m41666l68805r00574k63595p1793k78625J91726N17121J300277
$$ 772749557 773111649 772669983 772301178 771400604 771137009 771065216 770786591 770978317 771495438 772795715
1990.5G72795715K99149o94199r75723l42026m44107m68750M34113K4109O90841O88935
$$ 772795715 773094864 772400665 771424942 771082916 770638809 770170059 770604172 770628281 771319122 772008057
2000.1G72008057M12674m90265j281128p33719n64194K49100J47781O01197O65359
$$ 772008057 772420731 771930466 770649338 769915619 769351425 769600525 769748306 770349503 771014862
2008.8G71014862L24173k975p54395n21011j203766n52826J69067J11313M96063O33850
$$ 771014862 771339035 771336060 770581665 770060654 768856888 768304062 768473129 768584442 769080505 769714355
2018.5G69714355M22745k17056N4932r29413j074982m42734n28412J71357P46688Q56095
$$ 769714355 770137100 769920044 769974976 769045563 767970581 767527847 766999435 767170792 767917480 768773575
2028.1G68773575J92261R3994o71921j112747p79190l47443M22058K44522O78406L14102
$$ 768773575 768965836 769059830 768387909 767275162 766495972 766148529 766570587 766815109 767493515 767807617
2037.7G67807617M46396J55335j038819q89206j003647m78363j59988P04498P73392
$$ 767807617 768254013 768409348 767370529 766481323 765477676 764999313 764839325 765543823 766317215
2046.4G66317215K77863K42996m28086k15911p63627m55856k15912J08185R47723M94767
$$ 766317215 766595078 766838074 766409988 766194077 765430450 764974594 764758682 764866867 765814590 766309357
2056.1G66309357M16183k55813l28064n20249m81109k75040l03803M39835K99759N01633
$$ 766309357 766725540 766469727 766141663 765621414 765140305 764865265 764561462 765001297 765301056 765802689
2065.7G65802689n8747k64129l44315n73120k09427m93698M6081R8496M77447K75116
$$ 765802689 765743942 765479813 765135498 764562378 764352951 763859253 763905334 764003830 764481277 764756393
2075.4G64756393r8495K48566k20642m73557o56967L44009J25885k9297L04947r8343
$$ 764756393 764657898 764906464 764685822 764212265 763555298 763899307 764025192 763995895 764300842 764202499
2085G64202499M67606l06168o73370n66940l30735r6740J88904N06897K6321M74930
$$ 764202499 764670105 764363937 763690567 763123627 762792892 762696152 762885056 763391953 763418274 763893204
2094.6G63893204j22681l47519o12259o58493P9880j30768M80499J2894J58463L31573
$$ 763893204 763770523 763423004 762810745 762152252 762232132 762101364 762581863 762594757 762753220 763084793
2104.3G63084793l55072m93774o50864k38571k41318L44238K05078L45231M23736k15607
$$ 763084793 762729721 762235947 761585083 761346512 761105194 761449432 761654510 761999741 762423477 762207870
2113.9G62207870j21383q63114m34265j32446M8218J74331K05155M44565l76587j41526
$$ 762207870 762086487 761223373 760789108 760656662 760704880 760879211 761084366 761528931 761152344 761010818
2123.6G61010818l82003l43170k12021o6681M15649o5536L20434K57492J31836l76968
$$ 761010818 760628815 760285645 760073624 760006943 760422592 760357056 760677490 760934982 761066818 760689850
2133.2G60689850n57022j64871k69547K13470J21003J80816K51313M70962R613l58047
$$ 760689850 760132828 759967957 759698410 759911880 760032883 760213699 760465012 760935974 760945587 760587540
2142.9G60587540j97602l61786K48414l06778N4168M45557K77710L53088j91192l128
$$ 760587540 760389938 760028152 760276566 759969788 760023956 760469513 760747223 761100311 760909119 760905991
2152.5G60905991o85349l97568l3645k1439K34985K54059O91986P019L510m88510l18222
$$ 760905991 760220642 759823074 759789429 759767990 760002975 760257034 760949020 760956039 760959549 760471039 760152817
2163.1G60152817J80206k61154K79846K38953P28302K35977l67661k13852l59726j19323
$$ 760152817 760333023 760071869 760351715 760590668 761318970 761554947 761187286 760973434 760613708 760494385
2172.8G60494385j39008K70691M1809K47727N16433L80860L1280j88751k9907p32269
$$ 760494385 760355377 760626068 760667877 760915604 761432037 761812897 761844177 761655426 761625519 760893250
2182.4G60893250j78299j59378K27203O68106K13394K54517n65033J90887K16446l58734
$$ 760893250 760714951 760555573 760782776 761450882 761664276 761918793 761353760 761544647 761761093 761402359
2192G61402359j73721m4709K83738J97067O48575r003N2719k66876o92825Q5144J8005
$$ 761402359 761228638 761183929 761467667 761664734 762313309 762304306 762357025 762090149 761397324 761482468 761500473
2202.6G61500473M08859r9640K81144L53698M425K14157n02014j85394m39224k4719
$$ 761500473 761909332 761809692 762090836 762444534 762448959 762663116 762161102 761975708 761536484 761511765
2212.3G61511765M48608L73840L20740n0659R8572n09873o0730M1580k47879K42310
$$ 761511765 761960373 762334213 762654953 762604294 762702866 762192993 762132263 762173843 761925964 762168274
2221.9G62168274N81665O14929j6250k69928o62461o4544J13754k85874k58636j28632
$$ 762168274 762749939 763364868 763348618 763078690 762416229 762351685 762465439 762179565 761920929 761792297
2231.6G61792297N20707K50854L83072q3618k71454j75705n33829j61972k58789L25775
$$ 761792297 762313004 762563858 762946930 762863312 762591858 762416153 761882324 761720352 761461563 761787338
2241.2G61787338K60620O35529O28891l15476k39639m60892l40499o57807J86539O65359
$$ 761787338 762047958 762683487 763312378 762996902 762757263 762296371 761955872 761298065 761484604 762149963
2250.9G62149963M06952M31443j83793O0959o90994m83398j04676o6299M42505K39792
$$ 762149963 762556915 762988358 762804565 762865524 762174530 761691132 761586456 761520157 761962662 762202454
2260.5G62202454M81491J23443K67716l65601o53305k28958m09546N7221k9221L01437
$$ 762202454 762683945 762807388 763075104 762709503 762056198 761827240 761417694 761474915 761445694 761747131
2270.2G61747131K24152M68750L24707p4921k36892r99070l16238m22211Q4610P15714
$$ 761747131 761971283 762440033 762764740 762689819 762452927 761453857 761137619 760715408 760800018 761515732
2279.8G61515732P60650J74485p49817L5858n57938k63137p5989k66266J83945K24685
$$ 761515732 762276382 762450867 761701050 761736908 761178970 760915833 760839844 760573578 760757523 760982208
2289.4G60982208P55234j96533j5869n51529q13141j4115l89480L69415r003M43650
$$ 760982208 761737442 761540909 761525040 760973511 760160370 760146255 759756775 760126190 760117187 760560837
2299.1G60560837Q05054K89688r1095n80750k61688o43768q6747k32315J49536P24411
$$ 760560837 761365891 761655579 761564484 760983734 760722046 760078278 759991531 759759216 759908752 760633163
2308.7G60633163L77961N22384n04684j12915k54288o83060k71301J54953O01730K10648
$$ 760633163 761011124 761533508 761028824 760915909 760661621 759978561 759707260 759862213 760463943 760674591
2318.4G60674591O36673K99454j07346r08127l96728K76413n10559L82080M88434N59463
$$ 760674591 761311264 761610718 761503372 760595245 760198517 760474930 759964371 760346451 760834885 761394348
2328G61394348j30539J42365N19867m35944p53403p88879N05295M53872K2202j302261
$$ 761394348 761263809 761406174 761926041 761490097 760736694 759947815 760453110 760906982 760929184 759626923
2337.7G59626923n02930P82318k6627N92270l27453m17404m32435J9913J24512p14874
$$ 759626923 759123993 759906311 759879684 760471954 760144501 759727097 759294662 759314575 759439087 758724213
2347.3G58724213r46350p9499J298523l37372m30297Q01315J389923P78580j054840
$$ 758724213 757777863 757698364 758996887 758659515 758229218 759030533 760420456 761199036 760144196
2356G60144196N43441j583404k56348n55496J07269J725846k379456l2806J473770
$$ 760144196 760687637 759104233 758847885 758292389 758399658 760125504 757746048 757713242 759187012
2364.7G59187012Q85620j614838m52575n59235k204743Q48084m77371m90418p42035
$$ 759187012 760072632 758457794 758005219 757445984 755241241 756089325 755611954 755121536 754379501
2373.3G54379501o48040Q239m20761O8054j076355p18231k14996J55792k62985n77774
$$ 754379501 753731461 753739700 753318939 753386993 752310638 751592407 751377411 751533203 751270218 750692444
2383G50692444J18255m17327j92490p94373o34384J08414n7983j17264m90647J25580
$$ 750692444 750810699 750393372 750200882 749406509 748772125 748880539 748822556 748705292 748214645 748340225
2392.6G48340225K5330N188k28272m34723k16674q71048n06363J12838M47617k52075
$$ 748340225 748365555 748370743 748142471 747707748 747491074 746620026 746113663 746226501 746674118 746422043
2402.3G46422043k99072J63269k41166l79867r00574m75387N4245L09295l3340k84653
$$ 746422043 746122971 746286240 746045074 745665207 744764633 744289246 744343491 744652786 744619446 744334793
2411.9G44334793J95923l0060l84750j127320o87332k06222L8376J42822l03497J18942
$$ 744334793 744530716 744500656 744115906 742988586 742301254 742095032 742133408 742276230 741972733 742091675
2421.6G42091675k58255k93808m09622m28467l85590o59027L1586J7013k3422k49176
$$ 742091675 741833420 741539612 741129990 740701523 740315933 739656906 739688492 739705505 739682083 739432907
2431.2G39432907r0103l75977q93249m08630m79355k518m5700k88391n29862j69830
$$ 739432907 739342804 738966827 738073578 737664948 737185593 737183075 737137375 736848984 736319122 736149292
2440.8G36149292K79999o17981m71039l48282k04010l87115m35181k58331l76969L93143
$$ 736149292 736429291 735811310 735340271 734991989 734787979 734400864 733965683 733707352 733330383 733723526
2450.5G33723526q7662m57763m83857n08270l31268l86810j97526m75235O3248K64588
$$ 733723526 733635864 733178101 732694244 732185974 731854706 731467896 731270370 730795135 730858383 731122971
2460.1G31122971l32413j116791r73282j77459k89841R155o4697K3651m75845p94449
$$ 731122971 730790558 729673767 728700485 728523026 728233185 728242340 728177643 728201294 727725449 726931000
2469.8G26931000j68305k06527j20240p22885n17883m05731o77338j0376j755k75268
$$ 726931000 726762695 726556168 726435928 725713043 725195160 724789429 724112091 724101715 724099960 723824692
2479.4G23824692n48935n08042p12127l44849K7161m38080n56259l99018m9057m87823
$$ 723824692 723275757 722767715 722055588 721710739 721737900 721299820 720743561 720344543 720295486 719807663
2489.1G19807663j84174J55487n38787r43833p72705j67160j89209j50299p42493p05261
$$ 719807663 719623489 719778976 719240189 718296356 717523651 717356491 717167282 717016983 716274490 715569229
2498.7G15569229j70746m40521j02081l49579m75922m80194k54288N5695p6218k07977
$$ 715569229 715398483 714957962 714855881 714506302 714030380 713550186 713295898 713351593 713275375 713067398
2508.3G13067398r01794q63495o12107m57382n28335k66419N1041k94724n9890l65448
$$ 713067398 712165604 711302109 710690002 710232620 709704285 709437866 709488907 709194183 709134293 708768845
2518G08768845m13666n35813o37207m54330m60892K21253j55030o66732n35965J907
$$ 708768845 708355179 707819366 707182159 706727829 706266937 706488190 706333160 705666428 705130463 705132370
2527.6G05132370j60980p87735m28314n73502l16696j13373j53503j51291l94287m31061
$$ 705132370 704971390 704183655 703755341 703181839 702865143 702751770 702598267 702446976 702052689 701621628
2537.3G01621628l90015k50931o93359l59344j61515k89383k28119n92498m34876n47943
$$ 701621628 701231613 700980682 700287323 699927979 699766464 699477081 699248962 698656464 698221588 697673645
2546.9F97673645j96304n6763k83737l88184n76477m52881o11877j60446O5613k0371
$$ 697673645 697477341 697420578 697136841 696748657 696172180 695719299 695107422 694946976 695012589 694992218
2556.6F94992218o94275j045227k84424j22223J17035j87149m17709n98297n15290
$$ 694992218 694297943 693252716 692968292 692846069 692963104 692775955 692358246 691759949 691244659
2565.2F91244659k52227o04554l17382n11475m32358l59497j47095J70212k63443k42157
$$ 691244659 690992432 690387878 690070496 689559021 689126663 688767166 688620071 688790283 688526840 688284683
2574.9F88284683p15942o50788k96020k88544l89862k26364j45340q22296l17459k69013
$$ 688284683 687568741 686917953 686621933 686333389 685943527 685717163 685571823 684749527 684432068 684163055
2584.5F84163055n19027n13840m62265j14899k04391K09274k34909n80139m04205l57666
$$ 684163055 683644028 683130188 682667923 682553024 682348633 682557907 682322998 681742859 681338654 680980988
2594.2F80980988p30515q69598J42593m12064n33981k34985m41666k41012n18494l63846
$$ 680980988 680250473 679380875 679523468 679111404 678577423 678342438 677900772 677659760 677141266 676777420
2603.8F76777420m77829o33087o60248l32336k39945k32773N4169n04913m40216o37894
$$ 676777420 676299591 675666504 675006256 674673920 674433975 674201202 674255371 673750458 673310242 672672348
2613.5F72672348n09262m38690n84030j35193o72608k47116j05285o17829n44586m33121
$$ 672672348 672163086 671724396 671140366 671005173 670332565 670085449 669980164 669362335 668817749 668384628
2623.1F68384628k00576j85929l50876j140442o91375j80435m89808j57470k74201
$$ 668384628 668184052 667998123 667647247 666506805 665815430 665634995 665145187 664987717 664713516
2631.8F64713516n54504p36618o40717p74994m85992R384j65176l02201q07037m50668
$$ 664713516 664159012 663422394 662781677 662006683 661520691 661530075 661364899 661062698 660255661 659804993
2641.4F59804993j62735p52945m55933p5912n69306o05240m57992o05927k83966l82538
$$ 659804993 659642258 658889313 658433380 658357468 657788162 657182922 656724930 656119003 655835037 655452499
2651.1F55452499l3493j83105o46820l22037n81207q8196j69449o30569m20227k04392
$$ 655452499 655419006 655235901 654589081 654267044 653685837 653597641 653428192 652797623 652377396 652173004
2660.7F52173004j79062p80716n72357n34057n00565j29776P7362m9667n21698k89307
$$ 652173004 651993942 651213226 650640869 650106812 649606247 649476471 649553833 649504166 648982468 648693161
2670.4F48693161m65088n08652n90515l36609j06125n92346O1188L88031R3689p78046
$$ 648693161 648228073 647719421 647128906 646792297 646686172 646093826 646155014 646543045 646636734 645858688
2680F45858688r01565k81677o82526o08444l28369j1673l18222m10538J33743l05j87378
$$ 645858688 644957123 644675446 643992920 643384476 643056107 643044434 642726212 642315674 642449417 642449112 642261734
2690.6F42261734o17523q38318p74384l51753k5711j72195m49486m75235o9885N5885
$$ 642261734 641644211 640805893 640031509 639679756 639654045 639481850 639032364 638557129 638487244 638543129
2700.3F38543129P1564p95784q58765o1874j11733l16620n04913J40686j44119o14319
$$ 638543129 638614693 637818909 636960144 636898270 636786537 636469917 635965004 636105690 635961571 635347252
2709.9F35347252j78757l18870o34575q11844j74141m387l89214l84407P7668n112
$$ 635347252 635168495 634849625 634215050 633403206 633229065 633224678 632835464 632451057 632528725 632523613
2719.5F32523613n81894l50723o37474j62239J47781m03748r2048k09389l94974k95181
$$ 632523613 631941719 631590996 630953522 630791283 630939064 630535316 630443268 630233879 629838905 629543724
2729.2F29543724k73247m22973k32811l87650o77528j37635J90583J58844l53775j07575
$$ 629543724 629270477 628847504 628614693 628227043 627549515 627411880 627602463 627761307 627407532 627299957
2738.8F27299957n5237m27322m18281m29497K45361k99683m11033L50456l5210n88684
$$ 627299957 627244720 626817398 626399117 625969620 626214981 625915298 625504265 625854721 625819511 625230827
2748.5F25230827n16128L7269l52974l89900l09181l93791n9052k20604k22206l44391
$$ 625230827 624714699 624751968 624398994 624009094 623699913 623306122 623247070 623026466 622804260 622459869
2758.1F22459869l66172m43459k09427j8654k37159k34414o29997l66897r5978l88184
$$ 622459869 622093697 621650238 621440811 621422157 621184998 620950584 620320587 619953690 619857712 619469528
2767.8F19469528k26784L13302j65482p67326l00408k48260M4059l67126o49567k86178
$$ 619469528 619242744 619556046 619390564 618623238 618322830 618074570 618118629 617751503 617101936 616815758
2777.4F16815758n23567l44925l50762l63807p05834m42886k78664o03943k44560m34113
$$ 616815758 616292191 615947266 615596504 615232697 614526863 614083977 613805313 613201370 612956810 612522697
2787F12522697j20277l70331p01332n40771n51033l96309o51589k84233l63273j29395
$$ 612522697 612402420 612032089 611330757 610789986 610238953 609842644 609191055 608906822 608543549 608414154
2796.7F08414154k21939j041031j027412r65500m99687q16956o06995l50570o60973
$$ 608414154 608192215 607151184 606123772 605158272 604658585 603841629 603234634 602884064 602223091
2805.4F02223091j49574m35524n81474m57001m93355q54034r55239o97441p52296o76804
$$ 602223091 602073517 601637993 601056519 600599518 600106163 599252129 598296890 597599449 596847153 596170349
2815E96170349q17337l09677m27208q47702p74345q05817o01425j034584r23004p42302
$$ 596170349 595353012 595043335 594616127 593768425 592994080 592188263 591586838 590552254 589629250 588886948
2824.7E88886948p88842o64596p00798m81529o77376j035691j143913q65707j009064
$$ 588886948 588098106 587433510 586732712 586251183 585573807 584538116 583394203 582528496 581519432
2833.3E81519432r56650p86934q77342m84543q78791j332779j670990j583558j579589
$$ 581519432 580562782 579775848 578898506 578413963 577535172 576202393 574531403 572947845 571368256
2842E71368256j908760j692887j929016j473503j428452j849403k084503k237129j654206
$$ 571368256 569459496 567766609 565837593 564364090 562935638 561086235 559001732 556764603 555110397
2850.7E55110397j681213j264954j047516q09707k41127n17349j06392K31132k39525
$$ 555110397 553429184 552164230 551116714 550307007 550065880 549548531 549442139 549673271 549433746
2859.4E49433746m46815P3356l47480p33490j25542n04532o41250r00078j418190r75228
$$ 549433746 548986931 549060287 548712807 547979317 547853775 547349243 546707993 545807915 544389725 543414497
2869E43414497p99331p65686j02272k77634r48982q19168j028977r04121p76253p15179
$$ 543414497 542615166 541849480 541747208 541469574 540520592 539701424 538672447 537768326 536992073 536276894
2878.7E36276894k17095n49812j008301j097717o32324o21911p33337n02815j069565
$$ 536276894 536059799 535509987 534501686 533403969 532771645 532149734 531416397 530913582 529844017
2887.3E29844017j055145p82356q49419j000176j068763p26891o63032r56421q13446
$$ 529844017 528788872 528006516 527157097 526156921 525088158 524361267 523698235 522741814 521928368
2896E21928368n36232r76639q90618q59489r95255r60769j171150m94919o63376p73430
$$ 521928368 521392136 520415497 519524879 518665390 517670135 516709366 515538216 515043297 514379921 513606491
2905.7E13606491l35159j005593r23729o24427j051216j321946j099090r23157j398392
$$ 513606491 513271332 512265739 511342010 510717583 509666367 508344421 507245331 506322174 504923782
2914.3E04923782j756363j341476j143074j190987j116829j465606j228829p70530
$$ 504923782 503167419 501825943 500682869 499491882 498375053 496909447 495680618 494910088
2922.1D94910088o23360p69920o63643l35007o03180K99568N91126Q2931K28615j02348
$$ 494910088 494286728 493516808 492853165 492518158 491914978 492214546 492805672 492888603 493117218 493014870
2931.7D93014870j23444J38741M35714K98500N36309P06939M53263P89451N65873N03540
$$ 493014870 492891426 493030167 493465881 493764381 494300690 495007629 495460892 496250343 496816216 497319756
2941.3D97319756L42865O26869J116333N77049K79121k9487L58848J123505J096458
$$ 497319756 497662621 498289490 499405823 499982872 500261993 500232506 500591354 501714859 502811317
2950E02811317N08233K56500L27110K73972M01764K94456O40831P00188O26487P00150
$$ 502811317 503319550 503576050 503903160 504177132 504578896 504873352 505514183 506214371 506840858 507541008
2959.7E07541008P44019M43496m44526N27229R98344N29023M88243N06019R60160L78036
$$ 507541008 508285027 508728523 508283997 508811226 509809570 510338593 510826836 511332855 512293015 512671051
2969.3E12671051L50418Q48198J012573O10237J07842M22668K67525P11556R19303
$$ 512671051 513021469 513869667 514882240 515492477 515600319 516022987 516290512 517002068 517921371
2978E17921371N06821K5063K1476P05338L02315m9668j19934K17972M10423L18756
$$ 517921371 518428192 518453255 518474731 519180069 519482384 519432716 519312782 519530754 519941177 520259933
2987.6E20259933P65877K44942m73595k79960K1362l34740j72806J26267K14729K27242
$$ 520259933 521025810 521270752 520797157 520517197 520538559 520203819 520031013 520157280 520372009 520599251
2997.3E20599251o58303n76019k33764k81525l70636m28543n21012q41827l04680m68101
$$ 520599251 519940948 519364929 519131165 518849640 518479004 518050461 517529449 516687622 516382942 515914841
3006.9E15914841m47045l3569n32837p91740m79393l77541p63130m11301p15828n81016
$$ 515914841 515467796 515434227 514901390 514109650 513630257 513252716 512489586 512078285 511362457 510781441
3016.6E10781441l4485n44586m70772q72612p88002q15354r99870n77698q64639q31375
$$ 510781441 510746956 510202370 509731598 508858986 508070984 507255630 506255760 505678062 504813423 503982048
3026.2E03982048j008606q53004m09737l82538p95288j081009o42013n62478m70733
$$ 503982048 502973442 502120438 501710701 501328163 500532875 499451866 498809853 498247375 497776642
3034.9D97776642r57527j108742p36237n76706n45539q94471q42399q93746n83801
$$ 497776642 496819115 495710373 494974136 494397430 493851891 492957420 492115021 491221275 490637474
3043.6D90637474r49821j326905q30917p89490n87845j005668q16117o72035r30137
$$ 490637474 489687653 488360748 487529831 486740341 486152496 485146828 484330711 483658676 482728539
3052.2D82728539m72832n76248n54886p03125q90770j044045j058159p31201o50940
$$ 482728539 482255707 481679459 481124573 480421448 479530678 478486633 477428474 476697273 476046333
3060.9D76046333q74252r94377k12021l05824o29463q66662j452407q45032n65338
$$ 476046333 475172081 474177704 473965683 473659859 473030396 472163734 470711327 469866295 469300957
3069.6D69300957p05109p36313n61447k82631m01382r90715j266823q75740n63164
$$ 469300957 468595848 467859535 467298088 467015457 466614075 465623360 464356537 463480797 462917633
3078.3D62917633O3896l42788p39937p79801j144294o47431p79800n18570l80478q22334
$$ 462917633 462981529 462638741 461898804 461119003 459974709 459327278 458547478 458028908 457648430 456826096
3087.9D56826096p68738n68772o5994p65724j199341p10029l86544m90417j032334
$$ 456826096 456057358 455488586 455422592 454656868 453457527 452747498 452360954 451870537 450838203
3096.6D50838203r30786r69162m62761M4632q66966j279106p81822p39937o21872j74522
$$ 450838203 449907417 448938255 448475494 448520126 447653160 446374054 445592232 444852295 444230423 444055901
3106.2D44055901n52140j036148r76906o57806p44705p80182m58717n57137o16417
$$ 444055901 443503761 442467613 441490707 440832901 440088196 439308014 438849297 438292160 437675743
3114.9D37675743j105003q57010p3509k78550j006813j624031q82110m35066r95560
$$ 437675743 436570740 435713730 435640221 435361671 434354858 432730827 431848717 431413651 430418091
3123.6D30418091p93610m70848q34885j005477q83713p86095m20189o84051p22008
$$ 430418091 429624481 429153633 428318748 427313271 426429558 425643463 425223274 424539223 423817215
3132.3D23817215r21822j117210n91507q94203p38678p19566p99828n69534p12204
$$ 423817215 422895393 421778183 421186676 420292473 419553795 418834229 418034401 417464867 416752663
3141D16752663p69539r49631m27360q43659j104164l66554o10504p27311q43162p71179
$$ 416752663 415983124 415033493 414606133 413762474 412658310 412291756 411681252 410953941 410110779 409339600
3150.6D09339600r65386j188278p27348o56891q90618r26437p21512j121025q73337
$$ 409339600 408374214 407185936 406458588 405801697 404911079 403984642 403263130 402142105 401268768
3159.3D01268768k95334p13195p89414p80830r16786q08449o44798q19588j008911
$$ 401268768 400973434 400260239 399470825 398689995 397773209 396964760 396319962 395500374 394491463
3168C94491463q01964n73082p37114q68683q83255j112556q00858j061630j054154
$$ 394491463 393689499 393116417 392379303 391510620 390627365 389514809 388713951 387652321 386598167
3176.6C86598167k93274n56564r30939j007537o61965p55043q10585n86548q56895
$$ 386598167 386304893 385748329 384817390 383809853 383147888 382392845 381582260 380995712 380138817
3185.3C80138817o33660p59925r56078j072044p79076o04362p96624l99551n66292
$$ 380138817 379505157 378745232 377789154 376717110 375938034 375333672 374537048 374137497 373571205
3194C73571205n00221r18160p96280m09889j291389m96750k06184r31817j030845j053887
$$ 373571205 373070984 372152824 371356544 370946655 369655266 369158516 368952332 368020515 366989670 365935783
3203.6C65935783p31773k03018j106j004525j477165o84357j02348n60417p10220J144
$$ 365935783 365204010 365000992 364999886 363995361 362518196 361833839 361731491 361171074 360460854 360461998
3213.3C60461998l62396j166230j158790l14598q8730n96428r99374j173516k70195
$$ 360461998 360099602 358933372 357774582 357459984 357371254 356774826 355775452 354601936 354331741
3222C54331741m2190o47621j075478p87277k32201r14078r44328J5602M3526q89282
$$ 354331741 354289551 353641930 352566452 351779175 351546974 350632896 349688568 349704170 349747696 348858414
3231.6C48858414q01583l31535j085854j158103l74375l46336n48363j38435o15082
$$ 348858414 348056831 347725296 346639442 345481339 345106964 344760628 344212265 344073830 343458748
3240.3C43458748r11942m17633p02209n33753l92875k48604j82572n55915n17350n52101
$$ 343458748 342546806 342129173 341426964 340893211 340500336 340251732 340069160 339513245 338995895 338443794
3249.9C38443794m13170o66885q29849o04630o63643m43649k73819m69131o86608m80270
$$ 338443794 338030624 337363739 336533890 335929260 335265617 334821968 334548149 334079018 333392410 332912140
3259.6C32912140m32778n15785o11381n60112m01688l96347o8207m90570m53262p019
$$ 332912140 332479362 331963577 331352196 330792084 330390396 329994049 329925842 329435272 328982010 328974991
3269.2C28974991l95699m85420o13670n16854m66232n51147o11954n46036j66206l25318
$$ 328974991 328579292 328093872 327480202 326963348 326497116 325945969 325334015 324787979 324621773 324296455
3278.9C24296455k84919j77575k68287m65851p35512m83703M1122J1368o00243o07147
$$ 324296455 324011536 323833961 323565674 323099823 322364311 321880608 321921730 321933098 321332855 320725708
3288.5C20725708k74010N2376m06418p16648k0332n16815o22807l41930o04630l57475
$$ 320725708 320451698 320504074 320097656 319381008 319360676 318843861 318221054 317879124 317274494 316917019
3298.2C16917019l68424m02259n58129n33867j20945k42920l65238j71356j35822r1171
$$ 316917019 316548595 316146336 315588207 315054340 314933395 314690475 314325237 314153881 314018059 313926888
3307.8C13926888m73843p34444j69468o88247r00250l54671o20766k69775k03591m78134
$$ 313926888 313453045 312718601 312549133 311860886 310960636 310605965 309985199 309715424 309511833 309033699
3317.4C09033699l49255o61621p54127m54846n32245o24886k36320l86124q02269m22821
$$ 309033699 308684444 308022823 307268696 306813850 306281605 305656719 305420399 305034275 304232006 303809185
3327.1C03809185o5708q37059j287995q99715j066399o49261j81923l59077m10634
$$ 303809185 303743477 302906418 301618423 300718708 299652309 299003048 298821125 298462048 298051414
3335.8B98051414m34761m76398p28226n90534n39398k40040m43897j249981o68068
$$ 298051414 297616653 297140255 296412029 295821495 295282097 295042057 294598160 293348179 292680111
3344.4B92680111k61574m29554o86493m86297l26672m96578k5101k22187l00770n70087
$$ 292680111 292418537 291988983 291302490 290816193 290489521 289992943 289967842 289745655 289444885 288874798
3354.1B88874798o05011k69432p14913k34680l28922o13194m53510n65433j49765k6379
$$ 288874798 288269787 288000355 287285442 287050762 286721840 286108646 285655136 285089703 284939938 284913559
3363.7B84913559Q0070m17079p22905j87530l62225n70163n34726n21297n3063M14334
$$ 284913559 284993629 284576550 283853645 283666115 283303890 282733727 282199001 281677704 281624641 282038975
3373.4B82038975k61288m56142M2686n33218o64025j95407M8007j26190n75371k12554
$$ 282038975 281777687 281321545 281364231 280831013 280166988 279971581 280019588 279893398 279318027 279105473
3383B79105473J24607k05231k77939q6594l32431k44465L22628j03817k39659J50338
$$ 279105473 279230080 279024849 278746910 278660316 278327885 278083420 278406048 278302231 278062572 278212910
3392.7B78212910m65393n03731k27833j25694K19917J37520M2705o01387m64019K35214
$$ 278212910 277747517 277243786 277015953 276890259 277110176 277247696 277290401 276689014 276224995 276460209
3402.3B76460209l24745p7248L01170M6711k80418l43876L44658K13623j0948K96173
$$ 276460209 276135464 276058216 276359386 276406097 276125679 275781803 276126461 276340084 276329136 276625309
3412B76625309J08776j38111J08891j73092o18668M04034Q23555L80439L03326j51062
$$ 276625309 276734085 276595974 276704865 276531773 275913105 276317139 277140694 277521133 277824459 277673397
3421.6B77673397m3621M02279L12080J7395p1430M03385Q97446N33218L5897l3093
$$ 277673397 277629776 278032055 278344135 278361530 278290100 278693485 279590931 280124149 280160046 280126953
3431.2B80126953Q221K19993L39508J39790K33593Q60138M48437K289L27625M26597
$$ 280126953 280135174 280355167 280694675 280834465 281068058 281928196 282376633 282378922 282706547 283133144
3440.9B83133144Q72593K09866K3613N45540N29098J183720K15969N4970Q49971J47782
$$ 283133144 284005737 284215603 284239216 284784756 285313854 286497574 286713543 286768513 287618484 287766266
3450.5B87766266N70640J284314M66575J28613J166668R53521K18869K23980M06799
$$ 287766266 288336906 289621220 290087795 290216408 291383076 292336597 292555466 292779446 293186245
3459.2B93186245P86076N32360M83360M00600P39346Q81748N84030R27620O99177R89666
$$ 293186245 293972321 294504681 294988041 295388641 296127987 297009735 297593765 298521385 299220562 300210228
3468.8C00210228J017494O37169L5725j27068J521530J630059N86013M0837M58374
$$ 300210228 301227722 301864891 301900616 301773548 303295078 304925137 305511150 305551987 306010361
3477.5C06010361J390495J214981Q24432N36347M55818O46095J436997R85851R9278
$$ 306010361 307400856 308615837 309440269 309976616 310432434 311078529 312515526 313501377 313600655
3486.2C13600655R29355J148129J071701Q90503Q69636Q69999N50728R19781J185112
$$ 313600655 314530010 315678139 316749840 317640343 318509979 319379978 319930706 320850487 322035599
3494.9C22035599J226158P20749Q11386J190414P56379M79354N47409J283837J659775
$$ 322035599 323261757 323982506 324793892 325984306 326740685 327220039 327767448 329051285 330711060
3503.6C30711060R52301M65164Q83713J377258J542702R50660M04702J080169P07436
$$ 330711060 331663361 332128525 333012238 334389496 335932198 336882858 337287560 338367729 339075165
3512.2C39075165Q77800J216316J192017J652488Q37174O64215J138725J018715J179657
$$ 339075165 339952965 341169281 342361298 344013786 344850960 345515175 346653900 347672615 348852272
3520.9C48852272K040825J832962K51045P49474J484184J409149J067620J271781J124573
$$ 348852272 350893097 352726059 352977104 353726578 355210762 356619911 357687531 358959312 360083885
3529.6C60083885P69081R35631P52487J391945J543884K173005J700363L60412J390152
$$ 360083885 360852966 361788597 362541084 363933029 365476913 367649918 369350281 369710693 371100845
3538.3C71100845J155243J117630J406288J921425J810799J267548J481628O80084
$$ 371100845 372256088 373373718 374780006 376701431 378512230 379779778 381261406 381941490
3546C81941490J407547J212387J961060J730385J123733K646485J225318J268044R86443
$$ 381941490 383349037 384561424 386522484 388252869 389376602 392023087 393248405 394516449 395502892
3554.7C95502892J049957J899986J427727K600517K347336J684303O75888K332611
$$ 395502892 396552849 398452835 399880562 402481079 404828415 406512718 407188606 409521217
3562.4D09521217K825623J027183L027306O76346P07893J220398N44472L477516J942024
$$ 409521217 412346840 413374023 416401329 417077675 417785568 419005966 419550438 423027954 424969978
3571.1D24969978J856766K223320K339935K127114J471481J928597R97085K244110
$$ 424969978 426826744 429050064 431389999 433517113 434988594 436917191 437914276 440158386
3578.8D40158386K494164J620865J694603K195854K011070J469345M193382K613869
$$ 440158386 442652550 444273415 445968018 448163872 450174942 451644287 455837669 458451538
3586.5D58451538L14980J874199l39852K804527L946419L730278J961632R99069L235169
$$ 458451538 458766518 460640717 460300865 463105392 467051811 470782089 472743721 473742790 476977959
3595.2D76977959N03235K199440L717041J850547L057747J651192J097336K436638
$$ 476977959 477481194 479680634 483397675 485248222 488305969 489957161 491054497 493491135
3602.9D93491135K269592K281456L241272L287964N46875L237953J147766N73845O676407
$$ 493491135 495760727 498042183 501283455 504571419 505118294 508356247 509504013 510077858 516754265
3611.6E16754265K806854R2812L624725M88358M484214N028763J056976K367707O44188
$$ 516754265 519561119 519653931 523278656 523767014 528251228 533279991 534336967 536704674 537348862
3620.3E37348862Q14819L130837L288345K841797L491401L353920L111954O732369
$$ 537348862 538163681 541294518 544582863 547424660 550916061 554269981 557381935 564114304
3628E64114304L480529p281189K004967L831482N325050L033028k19421K550468L638497
$$ 564114304 567594833 560313644 562318611 566150093 571475143 574508171 574288750 576839218 580477715
3636.6E80477715L455467J695289K382088L576775K580299J820793J930809L077011
$$ 580477715 583933182 585628471 588010559 591587334 594167633 595988426 597919235 600996246
3644.4F00996246M220848O170311Q64792j771927O320191K605247j742935j694870
$$ 600996246 605217094 611387405 612252197 610480270 616800461 619405708 617662773 615967903
3652.1F15967903M560890M663964M421348N994339o074447J067504N047074J591492
$$ 615967903 620528793 625192757 629614105 635608444 629533997 630601501 635648575 637240067
3659.8F37240067K213821J642914K729110J322709J954803K362900Q68683M029998
$$ 637240067 639453888 641096802 643825912 645148621 647103424 649466324 650335007 654365005
3667.5F54365005K972947K644043J966705p235718J439896P736664R032135K524871
$$ 654365005 657337952 659981995 661948700 654712982 656152878 663889542 672921677 675446548
3675.2F75446548j4142303n98450O001129M297333o61468J022720K161102J596527
$$ 675446548 661304245 660705795 666706924 671004257 670342789 671365509 673526611 675123138
3682.9F75123138J556244Q02460Q06503L789826O735763n858383l497162Q235474m602738
$$ 675123138 676679382 677481842 678288345 682078171 688813934 682955551 679458389 687693863 683091125
3691.6F83091125k495651M825974J052246P45468L60184N24521J923446Q45337K908020
$$ 683091125 680595474 685421448 686473694 687219162 687579346 688103867 690027313 690872650 693780670
3700.3F93780670L355560n008621k891006M242553J964417K47040L21731K368164M319611
$$ 693780670 697136230 692127609 689236603 693479156 695443573 695690613 696012344 698380508 702700119
3709G02700119n027390L337784M836121j1641922L014908L919372K33078K24381J865082
$$ 702700119 697672729 701010513 705846634 694204712 697219620 701138992 701372070 701596451 703461533
3717.7G03461533J992187k842178L78113N113678j704331l638763L948516J446457
$$ 703461533 705453720 702611542 702989655 708103333 706399002 702760239 706708755 708155212
3725.4G08155212j62811k832565j130982K972641J309433N887070j008835o414490
$$ 708155212 707992401 705159836 704028854 707001495 708310928 714197998 713189163 706774673
3733.1G06774673Q815918K011719q196029j660691J049423Q1864J621475L885803k471618
$$ 706774673 715590591 717602310 709406281 707745590 708795013 708876877 710498352 714384155 711912537
3741.8G11912537K029113J0829697n901794j6188050O897278M548416O069947m98047
$$ 711912537 713941650 724771347 718869553 702681503 709578781 714127197 720197144 719699097
3749.5G19699097r433976R669724l468475q427506M157791K993088K584686l653717
$$ 719699097 710265121 719934845 716466370 708038864 712196655 715189743 717774429 714120712
3757.2G14120712K606201N506745o715470k062683L575364Q20236m86145L499908j459198
$$ 714120712 716726913 722233658 715518188 713455505 717030869 717851105 717364960 720864868 719405670
3765.9G19405670m453430L246460M677963M23279p445908J568299K716980l95203K31552
$$ 719405670 714952240 718198700 722876663 723299942 715854034 717422333 720139313 719744110 719975662
3774.5G19975662k35367J105271P6K220078J27334p031250K491303K722168J134643
$$ 719975662 719740295 720845566 720845642 723065720 723193054 716161804 718653107 721375275 722509918
3783.2G22509918J524658k860412j031647J147766J115189O78177r79309n30472K22702
$$ 722509918 724034576 721174164 720142517 721290283 722405472 723083649 722104340 721573868 721796570
3791.9G21796570J127930K16827L94134K956620k722626m159012J967011M068374O801148
$$ 721796570 722924500 723141327 723535461 726492081 723769455 719610443 721577454 725645828 732446976
3800.6G32446976m714814j0954132L355866K293091L970718N222244p505111m506836
$$ 732446976 727732162 716778030 720133896 722426987 726397705 731619949 724114838 719608002
3808.3G19608002L388977Q87069J4039J395034K67411J210937N678711j115723j2876129
$$ 719608002 722996979 723884048 723898087 725293121 725560532 726771469 732450180 731334457 718458328
3817G18458328M347840N366745M017715L176575j5163956j375198M288864K313614
$$ 718458328 722806168 728172913 732190628 735367203 720203247 718828049 723116913 725430527
3824.7G25430527K550277j14746l232727k21176J233215K942429J733551p132721K191162
$$ 725430527 727980804 727866058 724633331 724412155 725645370 728587799 730321350 723188629 725379791
3833.4G25379791P006455m690705q51822P299424o269532m117431O807556m382401
$$ 725379791 732386246 727695541 726843719 734143143 727873611 723756180 730563736 726181335
3841.1G26181335k313232M930725j253509k549897J824494N03464j65635J784363m90036
$$ 726181335 723868103 728798828 727545319 724995422 726819916 727323380 727157745 728942108 728452072
3849.8G28452072J254196M673310l637467L819885j3157348k191544R437180r41239
$$ 728452072 729706268 734379578 730742111 734561996 721404648 719213104 728650284 727709045
3857.5G27709045k800903J312637K532502L276443m449005j19247N456314n616837
$$ 727709045 724908142 726220779 728753281 732029724 727580719 727461472 732917786 727300949
3865.2G27300949n556641L440705M816360N801010n440445r188385L025284N837860
$$ 727300949 721744308 725185013 730001373 735802383 730361938 721173553 724198837 730036697
3872.9G30036697M543534q390198j755524L250199L53317K245407L662109m899215
$$ 730036697 734580231 726190033 724434509 727684708 728038025 730283432 733945541 729046326
3880.6G29046326o791230M499512J012421R57336N203858j0066605l82309K967377
$$ 729046326 722255096 726754608 727767029 728724365 733928223 723861618 723479309 726446686
3888.3G26446686P73773M547424K68555o431808O36291K813416j424637K82974J177750
$$ 726446686 727220459 731767883 732036438 725604630 726240921 729054337 727629700 727912674 729090424
3897G29090424K553329J970444q838806L484726J069259m878006M445572k811661j477737
$$ 729090424 731643753 733614197 724775391 728260117 729329376 724451370 728896942 726085281 724607544
3905.7G24607544O98547Q45261J681213l37219K75116j69830J41220m1123j30310J215439
$$ 724607544 725306091 726151352 727832565 727495346 727770462 727600632 727741852 727700729 727570419 728785858
3915.3G28785858J899185k536697l563232L862152L1356l501434J752319J181565K124328
$$ 728785858 730685043 728148346 724585114 728447266 728478622 724977188 726729507 727911072 730035400
3924G30035400j82724l862152K33307J544647P76291m02527K89765J052246k631455
$$ 730035400 729852676 725990524 726223831 727768478 728544769 728142242 728432007 729484253 726852798
3932.7G26852798j388626J434708L57208J16196J70441l46833p94830m11835J708374
$$ 726852798 725464172 726898880 727256088 727372284 727542725 727195892 726401062 725989227 727697601
3941.4G27697601J627961k402192p29980J067734M9667P02972j165313p3319L18604
$$ 727697601 729325562 726923370 726193390 727261124 727310791 728013763 726848450 726775131 727093735
3950.1G27093735j569519J599426M02298p76215J06278o15540P8430L76130N61981
$$ 727093735 725524216 727123642 727525940 726749725 726856003 726240463 726318893 726695023 727257004
3958.7G27257004p95593j46637J269683q8119l59039l43476j69754k18277N07889O94122
$$ 727257004 726461411 726314774 727584457 727496338 727137299 726793823 726624069 726405792 726913681 727607803
3968.4G27607803p50503j051407O9961R02710j91040j68991K47727j51749l17535L0288
$$ 727607803 726857300 725805893 725875854 726778564 726587524 726418533 726666260 726514511 726196976 726227264
3978G26227264N27955m27857O7291M79126m01916K87933O08215l57208n52902j72119
$$ 726227264 726755219 726327362 726394653 726873779 726471863 726759796 727368011 727010803 726457901 726285782
3987.7G26285782L6316Q09555J03607n16968K1897L62014L83683q69446j50757O30798
$$ 726285782 726322098 727131653 727235260 726718292 726740189 727102203 727485886 726616440 726465683 727096481
3997.3G27096481M731J21765M6768
$$ 727096481 727101212 727222977 727269745
4000.2G27269745
$$ 727269745
##END=$$ End of the data block
