##TITLE=$$ Begin of the data block
##JCAMP-DX=5.00 $$ ACD/SpecManager v 10.08
##SPECTROMETER/DATA SYSTEM=Varian
##DATE=15 Jan 2013 09:44:08
##DATA TYPE=INFRARED SPECTRUM
##DATA CLASS=XYDATA
##ORIGIN=
##OWNER=
##NPOINTS=3735
##FIRSTX=399.26403809
##LASTX=4000.35498047
##MAXX=4000.35498047
##MINX=399.26403809
##MAXY=76.71050262
##MINY=27.27932167
##XFACTOR=1.0000000000
##YFACTOR=0.000000100000000
##FIRSTY=49.91967392
##DELTAX=0.96440572
##XUNITS=1/CM
##YUNITS=TRANSMITTANCE
##XYDATA=(X++(Y..Y))
399.3D99196739M317703o572456l448372l087845J677285J0921173r18885j1372184
407D90713158K570915J809082n090752J280327L740273j287079n101052N483551P383767
415.7E01502190L054504M767380j2193413j9107590j441498N104485P738075L95775
423.4D89819908p46765K503052J40915K48260n67627l014335j171227p26814Q63914
432.1D87349281J005631m877053l155326K823257R89418j985321K243729K530632j448746
440.7D85475502k247009k501107O606980P577362m076920n440139O72454L932343R21440
449.4D90920906l563995k406197J382523K796325j96952l958283j719932K928772K317237
458.1D88500404J672249l048820l147660K224808n222282l876038O100159O562500
$$ plain form
399.3 499196739 503514442 496941986 493493614 490405769 492083054 503004227 502085342 490713158
407 490713158 493284073 495093155 490002403 491282730 495023003 493735924 488634872 494118423 501502190
415.7 501502190 504556694 509324074 497130661 478023071 476581573 481686058 489424133 489819908
423.4 489819908 489073143 491576195 491717110 491965370 491397743 488383408 487212181 486485367 487349281
432.1 487349281 488354912 483477859 480322533 483145790 484135208 482149887 484393616 486924248 485475502
440.7 485475502 483228493 480727386 487334366 494911728 490834808 485394669 486067123 489999466 490920906
449.4 490920906 487356911 484950714 486333237 489129562 488932610 484974327 483254395 486183167 488500404
458.1 488500404 490172653 487123833 483976173 486200981 480978699 477102661 483202820 489765320
465.8D89765320m43001m808502j547547k767448m547462o27327J435394j843529j177788
474.5D73438110J928139K349320l034249m593925j64566o60973Q55408J800194l038865
483.2D68878593j441803L008919M551583J647453l873901j011086O23512O37398L32642
491.8D73353310l852044J9532J344070j093368J138801l71437q66928k64740q44879
500.5D68562317O40411j46675k595863k679978r79538r34791Q05969K382088M1351
509.2D65095291j235771j836777J307717K402496J0796j613961l961792l038254J086731
517.9D58216476J646767k71835P14569J216240k39563k99301j231957j326217J8272
526.6D58443451P99904j8883k098198j560135R91020M93203j890068P7438J322021
$$ plain form
465.8 489765320 489322319 484513817 482966270 480198822 475651360 475024033 476459427 474615898 473438110
474.5 473438110 475366249 477715569 474681320 470087395 469922829 469261856 470117264 471917458 468878593
483.2 468878593 467436790 470445709 474997292 476644745 472770844 471759758 472383270 473020668 473353310
491.8 473353310 469501266 469520798 470864868 469771500 470910301 470538864 469671936 469407196 468562317
500.5 468562317 469202728 469056053 466460190 463780212 462800674 461865883 462671852 465053940 465095291
509.2 465095291 463859520 462022743 463330460 465732956 465743752 464129791 460167999 457129745 458216476
517.9 458216476 459863243 459591408 460305977 461522217 461282654 460983353 459751396 458425179 458443451
526.6 458443451 459243355 459224472 457126274 455566139 456557159 457050362 455160294 455237732 456559753
535.2D56559753o77757j496620m70238m38385n26542K017288j06545k008056K89192
543.9D53142090l6049j616364k103843O38084M03633j713524N95856O31905j518059
552.6D48423729j122589j093979r82552J184616n93681j538582J15624j8196K62565
561.3D44636955j170501K84423J658898J48353J42022q96569l48167Q47206J04637
570D45407257o25229J66130J017304Q14819J001091P63092n55878j538658p35092l70865
579.6D45343971p39135r21669n32723J171532R08775M71840m80766p95632J084557
588.3D45510750P82928k37159m34647Q24509N10482j057167j31225J105270J89400
597D47063141j123047L77235L23792j058579k03361n2033K18049M80041L4599p49473
$$ plain form
535.2 456559753 455881996 454385376 453915138 453476753 452950211 454967499 454860954 452852898 453142090
543.9 453142090 453106041 451489677 449385834 450023918 450427551 448714027 449309883 449941788 448423729
552.6 448423729 447301140 446207161 445224609 446409225 445815544 444276962 444392586 444374390 444636955
561.3 444636955 443466454 443750877 445409775 445558128 445700150 444803581 444455414 445302620 445407257
570 445407257 444782028 444948158 445965462 446780281 447781372 448544464 447988586 446449928 445714836 445343971
579.6 445343971 444604836 443683167 443150444 444321976 445230751 445702591 445221825 444426193 445510750
588.3 445510750 446293678 446056519 445621872 446446381 446956863 445899696 445768471 446873741 447063141
597 447063141 445940094 446317329 446641121 445582542 445379181 445327148 445545197 446025238 446059837 445310364
606.6D45310364j121636o87332K53906O89240r68475j685601j59645n3711k015533
615.3D39561577j431770P52372J389580J143227j19171R0484L96652P5074K53791k34222
624.9D41877594K1820J316834J945533J115876j45836L84674L043899K012558r81254
633.6D50591698l30353J051521L054352K945137O83975l69606O7902J518669J786537
642.3D60999832J513062J027832O40144O15616N11246R13849N35011j08223K69279
651D66917648R86176Q85315R5176K74773Q34618O46324k6627m50668N5466K91443P7209
661.6D70586853j01776n09949l68995J62429J275177M2649q070374K700234L299522
670.3D69015770J104584L29971M71802J601066J000862P39480J267471L23143j52168
$$ plain form
606.6 445310364 444188728 443501396 443755302 444444542 443476067 441790466 441630821 441577110 439561577
615.3 439561577 438129807 438882179 440271759 441414986 441295815 441386299 441782951 441858025 442111816 441877594
624.9 441877594 441899414 443216248 445161781 446277657 446131821 446516495 449560394 451572952 450591698
633.6 450591698 450261345 451312866 454367218 457312355 457996330 457626724 457694626 459213295 460999832
642.3 460999832 462512894 463540726 464180870 464796486 465307732 466221581 466756592 466648369 466917648
651 466917648 467903824 468789139 468884315 469159088 469993706 470640030 470613403 470162735 470218201 470509644 470586853
661.6 470586853 470485077 469975128 469606133 469768562 471043739 471086388 463016014 465716248 469015770
670.3 469015770 470120354 470450325 470922127 472523193 473524055 474263535 475531006 475854149 475701981
678.9D75701981O11877J423874J109619J005936J545868J882591P98340O04973J485900
687.6D86170959m0168L90167J883011J186638K33917k17934K03324L2196P90634J593742
697.3D92226486P03354K1210l33061P11593J225472N62629Q59108R49555N48706j02730
706.9D97372322K80151Q29201N9357R23386J740951J032181O50368K45781Q16116J041298
716.6E04991112M25148K77061K28195J45226q0986Q68797J592407J402169J196785
725.2E11045914O59523N19066j72921j55944J531639K092170R09806O52313J211815
733.9E18293381R47227P31964J29280j53884j19744Q09174J582794K77748L18756O81534
743.6E23498230J207809J592560J01052L5667L29437Q0872P63626J823883J450005
$$ plain form
678.9 475701981 476313858 477737732 478847351 479853287 481399155 483281746 484080086 484685059 486170959
687.6 486170959 486130791 486520958 488403969 489590607 489824524 489606590 489809914 489842110 490632744 492226486
697.3 492226486 492929840 492951050 492617989 493329582 494555054 495117683 495976791 496926346 497475052 497372322
706.9 497372322 497652473 498481674 498541031 499464417 501205368 502237549 502887917 503133698 503949814 504991112
716.6 504991112 505416260 505693321 505921516 506066742 505985756 506854553 508446960 509849129 511045914
725.2 511045914 511705437 512224503 512051582 511895638 513427277 515519447 516429253 517081566 518293381
733.9 518293381 519240608 519972572 520101852 519947968 519828224 520637398 522220192 522497940 522816696 523498230
743.6 523498230 524706039 526298599 526399651 526435318 526764755 526845627 527609253 529433136 530883141
752.2E30883141q3352K26517R51882J209068J714172R65958Q41102J477166Q41827
760.9E39027481N96733O73256Q94013N14717P3814J027184Q42552O20842N00641L21006
770.6E45092239l43704j005936M76914O96945M71611k21214Q3008J365814J58539p6180
780.2E46698036K709N62133J02616p55654O97289J032371J404267Q13751L24821J080933
789.9E51963272Q05855J06697r84306q43964K79655P16477M31023M49142K9488p6142
799.5E52877197J27030n60990p43026j680985j761818j227569j202279j041488q42133
808.2E43943939q63762j517372o58417l90319p50580j183472j954040k025300j559638
816.9E33041039K52571k41471l58581R29336N01747L95089N27267K256203K628135
$$ plain form
752.2 530883141 530799789 531026306 531978188 533187256 534901428 535867386 536708488 538185654 539027481
760.9 539027481 539624214 540297470 541191483 541706200 541780014 542807198 543649750 544270592 544771233 545092239
770.6 545092239 544748535 543742599 544219513 544916458 545388069 545166855 545249863 546615677 546774216 546698036
780.2 546698036 546700745 547262878 547365494 546609840 547307129 548339500 549743767 550557518 550882339 551963272
789.9 551963272 552769127 552875824 551891518 551047554 551327209 552043686 552474709 552923851 552953339 552877197
799.5 552877197 553004227 552443237 551700211 550019226 548257408 547029839 545827560 544786072 543943939
808.2 543943939 543080177 541562805 540904388 540514069 539763489 538580017 536625977 534600677 533041039
816.9 533041039 533293610 533052139 532693558 533622894 534124641 534519730 535046997 537303200 539931335
825.5E39931335K066803K492638K233658L412895L295860K096749K202263L496360
833.3E61228561L726082K629662J914711P93381Q44306K233925L223954J124420J254272
841.9E78973274K857056J504898J654587J458435J330833O82526L02467M75235Q69751
850.6E90109062K248917Q21571P99408J782494J868133J463738J205215J688957O62003
859.3F02649498P70187J102066R77250J72271R94911K061997P92847l91465j976280
868F07153282o81648m97055j485214j753464j734886m21715j221581m14772j22833
876.7E98820114j340027j920814j933289n71251q77113j365700j248703q02612o40564
885.3E88120041o3477K47269j87492j28060q53615j77955m67606m64172M86336K50740
$$ plain form
825.5 539931335 541998138 544490776 546724434 550137329 553433189 555529938 557732201 561228561
833.3 561228561 564954643 567584305 569499016 570292397 571136703 573370628 576594582 577719002 578973274
841.9 578973274 581830330 583335228 584989815 586448250 587779083 588461609 588764076 589239311 590109062
850.6 590109062 592357979 593179550 593978958 595761452 597629585 599093323 600298538 601987495 602649498
859.3 602649498 603419685 604521751 605499001 605671272 606666183 608728180 609521027 609129562 607153282
868 607153282 606471634 605974579 604489365 602735901 601001015 600579300 599357719 598942947 598820114
876.7 598820114 597480087 595559273 593625984 593054733 592177620 590811920 589563217 588760605 588120041
885.3 588120041 588056564 588303833 588116341 587988281 587134666 586956711 586489105 586024933 586511269 586762009
895E86762009Q22868P47490R88121O62460P6676n20096k19269k50015j919060k34566
904.6E86916618J248246K506065L650093L376160K987251K022858J976814n2948r39255
913.3F03691902j013145j052666l80096j611901j526298r12857p06673k266808l193435
922E91028023k348747k843476l431740m099731l941422l408966l165550k895050k221489
930.7E62671852k236099k292748j684951k259865k243881j949959j192017j027107
938.4E47785225j294670l46031p54471j213303j155929k03972q7853j118316p01371
947.1E40909309l77121M32930Q27179J220665J158066O19011Q97789l05901r33189
955.7E44448738j489220k154731k415619k493782k027588k028313j347923q35114l58200
$$ plain form
895 586762009 587584877 588332367 589320488 589982948 590059624 589539528 589320259 589070244 587151184 586916618
904.6 586916618 588164864 590670929 594321022 597697182 600684433 602707291 604684105 604631157 603691902
913.3 603691902 602678757 601626091 601245995 599634094 598107796 597194939 596488266 594221458 591028023
922 591028023 588679276 585835800 582404060 578304329 574362907 570953941 567788391 564893341 562671852
930.7 562671852 560435753 558143005 556458054 554198189 551954308 550004349 548812332 547785225
938.4 547785225 546490555 546144524 545390053 544176750 543020821 542816849 542728996 541610680 540909309
947.1 540909309 540532188 540965118 541792297 543012962 544171028 544790039 545687828 545381927 544448738
955.7 544448738 542959518 540804787 538389168 535895386 533867798 531839485 530491562 529656448 529298248
964.4E29298248q47816k293854k041130j407051j807404k914695k641831k081299k322693
973.1E10940475k124176k704849l063316k448769l184891m312133l703118l530807
980.8D85868416m915505n043945l900223m340515n067634m755364m053078m026336
988.5D49765816m463349l925323l857536l903199l801803l296700k744102k865677
996.2D20908127l109665k995491k342415k906151l212051l492623k781791j790428
1004C98277512k433968k214165k609520k096939j729278j655655j318245k031555j918717
1012.6C80269470k414741k382851k397881k019004j641541k003975j820183k166214
1020.3C63423080k028732k572059k665062k859841j324043j26495k057267k105255
$$ plain form
964.4 529298248 528450432 526156578 524115448 522708397 520900993 517986298 515344467 513263168 510940475
973.1 510940475 508816299 506111450 503048134 500599365 497414474 493102341 489399223 485868416
980.8 485868416 480952911 475908966 472008743 467668228 462600594 457845230 453792152 449765816
988.5 449765816 445302467 441377144 437519608 433616409 429814606 426517906 423773804 420908127
996.2 420908127 417798462 414802971 412460556 409554405 406342354 402849731 400067940 398277512
1004 398277512 395843544 393629379 391019859 388922920 387193642 385537987 384219742 382188187 380269470
1012.6 380269470 377854729 375471878 373073997 371054993 369413452 367409477 365589294 363423080
1020.3 363423080 361394348 358822289 356157227 353297386 351973343 351846848 349789581 347684326
1028.1C47684326j834640p08123q38890o1798J30959j872940n64728K97203J601753
1036.7C43833122J523628K155190K349396J264343K821426J971436J106491L57895
1044.5C57382927L1815o30532r86328l16086r21249m80843k873039k744675l21121
1053.1C48140869o13670j080475j182785j144638k389183o23284J74790R58366K254563
1061.8C44494553K013359K880821J846504K260933J766663Q62999J198768J521111
1069.5C58845711J024399P1373J036644K29415P24678K36321n2452O07262m81644M96940
1079.2C62738647m272M87442K60544P33490J960487P12013J202012P53479J215553
1087.9C70059395J714668J939850J335068O21795J456452R10034J502495J192474J694145
$$ plain form
1028.1 347684326 345849686 345141563 344302673 344240875 344371834 342498894 341934166 342231369 343833122
1036.7 343833122 345356750 347511940 349861336 351125679 353947105 355918541 357025032 357382927
1044.5 357382927 357414742 356784210 355797882 355481796 354560547 354079704 351206665 348461990 348140869
1053.1 348140869 347527199 346446724 345263939 344119301 341730118 341106834 341281624 342239990 344494553
1061.8 344494553 346507912 349388733 351235237 353496170 355262833 356125832 357324600 358845711
1069.5 358845711 359870110 359941483 360978127 361207542 361932220 362168541 362116089 362723351 362241707 362738647
1079.2 362738647 362734375 363221817 363482361 364215851 366176338 366888351 368090363 368843842 370059395
1087.9 370059395 371774063 373713913 375048981 375670776 377127228 378037262 379539757 380732231 382426376
1096.5C82426376K456169J615525P71560M31405J760597J504745J437760J107254J031646
1105.2C94543037J742669J537513J424675P01981J033249M40902K14654J213569J344986
1113.9D04197235J141548O88210Q80203O28471O83823m7302p15141l74642n6648J59569
1123.5D07185326m64859K42004N01060R83239J295318J762581K847214K288437K652740
1132.2D19293060J709595K269363L443337K663307K707405K334786K628021K268257
1139.9D39317131J710663K104416K222900J358032O93589Q44879J77040L45116Q95576
1148.6D49669342R70688M24309l5630m5051k00691L56521n98717p99026l66440j506386
1158.3D47868919j536598q32100J65940m06685n25856Q17985J285324J841545J898575
$$ plain form
1096.5 382426376 384882545 386498070 387269630 387701035 389461632 390966377 392404137 393511391 394543037
1105.2 394543037 396285706 397823219 399247894 399949875 400983124 401424026 401638680 402852249 404197235
1113.9 404197235 405338783 406026993 406907196 407535667 408219490 408172188 407457047 407082405 407025757 407185326
1123.5 407185326 406720467 406962471 407463531 408446770 409742088 411504669 414351883 416640320 419293060
1132.2 419293060 421002655 423272018 426715355 429378662 432086067 434420853 437048874 439317131
1139.9 439317131 441027794 443132210 445355110 446713142 447406731 448251610 448428650 448773766 449669342
1148.6 449669342 450640030 451064339 451028709 450983658 450782967 451139488 450540771 449741745 449375305 447868919
1158.3 447868919 446332321 445500221 445666161 445259476 444733620 445551605 446836929 448678474 450577049
1166.9D50577049K224503K479248K516022K753372K759933K788658L082047L504372
1174.6D72685204L277053K397309K611160L183212K479859K234649J683960J454621
1182.4D92007027J651420J534500J912308J470566P93800J045456J550179L69148o03333
1191E01731071j2016P4425m09889n27726j72729r23653j409950o74286k16369q52089
1200.7D96606789j742516j080246n56908j075363j400795j065712k43225J21689p2098
1209.4D89491615n15022n95169r7809r5634n03350j88560j41716o95458m82254l18374
1219D85858269m29878m48647l12691k91862o21872l00942l78227j044693j108971q57200
1228.6D80063286o85654n76210m22134p15027q44879n21088j71928L8n57862n00488
$$ plain form
1166.9 450577049 452801552 455280800 457796822 460550194 463310127 466098785 469180832 472685204
1174.6 472685204 475962257 478359566 480970726 484153938 486633797 488868446 490552406 492007027
1182.4 492007027 493658447 495192947 497105255 498575821 499369621 500415077 501965256 502334404 501731071
1191 501731071 501719055 501793480 501383591 500855865 500683136 499759483 498349533 497675247 497458878 496606789
1200.7 496606789 494864273 493784027 493227119 492151756 490750961 489685249 489442024 489563713 489491615
1209.4 489491615 488976593 488381424 488283615 488187981 487684631 487496071 487354355 486658897 486176643 485858269
1219 485858269 485428391 484979744 484667053 484375191 483753319 483452377 483074150 482029457 480920486 480063286
1228.6 480063286 479377632 478801422 478379288 477664261 476819382 476298294 476126366 476126404 475568542 475068054
1238.3D75068054l01552m80651m3869l5706j67465l18833o32972o83213l88946m5319
1247.9D71969528l85971n15671l74069k00424k41585n72929q4992L54424o0005m31900
1257.6D69456406p8736N036r9678J53198J02501K63290L29094L55721N98869N51071
1267.2D71636772M04663O95153J017951R21708R11865R14001R15871O97708P27730
1275.9D78843422P02820N09338P25098R20181J040306R93080J163979J172027J270447
1284.6D87340698J322518R79347Q09326Q48351J184501R38416R03816O92978N40886
1293.3D95560837P51266N22347K38495M9476O70624O7444o7558O40754J78452J98440
1302.9D98810577o3858l91426m73633o3972m83284j083183n41916n13344m16718r71946
$$ plain form
1238.3 475068054 474766502 474285851 474241982 474206276 474038811 473719978 473087006 472403793 472014847 471969528
1247.9 471969528 471583557 471067886 470693817 470493393 470251808 469678879 469593887 469948311 469888306 469456406
1257.6 469456406 469377670 469382706 469283028 469436226 469538727 469802017 470131111 470486832 471085701 471636772
1267.2 471636772 472041435 472736588 473754539 474676247 475588112 476502113 477417984 478115692 478843422
1275.9 478843422 479546242 480055580 480780678 481700859 482741165 483734245 484898224 486070251 487340698
1284.6 487340698 488663216 489642563 490451889 491300240 492484741 493423157 494326973 495019951 495560837
1293.3 495560837 496312103 496834450 497072945 497122421 497793045 497860489 497792931 498433685 498612137 498810577
1302.9 498810577 498746719 498355293 497881660 497817688 497334404 496251221 495709305 495195961 494779243 493807297
1312.5D93807297o83098l19786o84662l1433R5215P8239J16692J053581J220894P64885
1322.2D95417824J085586N84183P60346O27861P60498Q88137j36108l75290k67067
1330.9D99345970n19333q88138l25355O0692k24037j06087L26500J30424k95562Q12301
1340.5D98317375Q61054Q25042Q67272P97081J179237O77414P71866P98607P10220
1349.2E05805168J60675m4899k49023p79419l52974q39043k68631K75650J29357O0348
1358.8E03897209k44827n23605j283722o44875n37414P6408R4032n25589l30620p13729
1368.5D99263268j61438k96937l83415k22664o32400n13649l23563N4207k60658J59302
1378.1D96682053L32718K86712j99013j130828j240845j859169j438637j391335j486320
$$ plain form
1312.5 493807297 493124199 492804413 492119751 492088318 492183533 492261772 492378464 493432045 494652939 495417824
1322.2 495417824 496503410 497087593 497847939 498475800 499236298 500124435 499988327 499613037 499345970
1330.9 499345970 498826637 497938499 497613144 497673836 497449799 497343712 497670212 497800636 497505074 498317375
1340.5 498317375 499178429 500003471 500870743 501667824 502847061 503524475 504296341 505094948 505805168
1349.2 505805168 505965843 505920944 505671921 504892502 504539528 503700485 503431854 503707504 503836861 503897209
1358.8 503897209 503652382 503128777 501845055 501200180 500662766 500739174 500833206 500307617 499976997 499263268
1368.5 499263268 499101830 498804893 498421478 498198814 497566414 497052765 496729202 496783409 496522751 496682053
1378.1 496682053 497014771 497301483 497102470 495971642 494730797 492871628 491432991 490041656 488555336
1386.8D88555336j709518q69408k63825j564102j501693j444054j408959l030624m096184
1395.5D72666969j288070j876679k080116k808266k230758j291199j647530j252746
1403.2D58191605j785508l017921k389412j171532j950874k434273j680374k075691
1410.9D41686020j328888q44765r22508q27942j145172j046982j347236k81105k677880
1419.6D31263542o06346J519775M57993N39818n80559J134033J442681O35070J116143
1428.3D36922150M10003J117287O47545J597481J564560J440048K499313J146240J140786
1437D48485413K651214L404656J830177J606026K137031J118431J954308J157341J804390
1445.6D66148987J979179K275048J827735J291199K032814Q76122K087555J336364
$$ plain form
1386.8 488555336 486845818 485976410 485712585 484148483 482646790 481202736 479793777 476763153 472666969
1395.5 472666969 471378899 469502220 467422104 464613838 462383080 461091881 459444351 458191605
1403.2 458191605 456406097 453388176 450998764 449827232 447876358 445442085 443761711 441686020
1410.9 441686020 440357132 439512367 438589859 437761917 436616745 435569763 434222527 433941422 431263542
1419.6 431263542 430657196 432176971 432634964 433174782 432594223 433728256 435170937 435806007 436922150
1428.3 436922150 437332153 438449440 439096985 440694466 442259026 443699074 446198387 447344627 448485413
1437 448485413 451136627 454541283 456371460 457977486 460114517 461232948 463187256 464344597 466148987
1445.6 466148987 468128166 470403214 472230949 473522148 475554962 476431084 478518639 479855003
1453.3D79855003J582108J795463M33960J107369O57577M330864K313424K835998K105064
1462D97016830J649628K306519m28391K457581K207679K444916K107163K188873L449745
1470.7E15400543J724205K249909J966247L319588K647667J270294L013153K823906
1478.4E34415512K186050J891556K604142J895332J986046J762085M87327J029930
1486.1E48257980Q27561J186676J842079o4735k15111J832886J591110r4986m11377
1494.8E54752083k70271m075013l37181j158027k297554O7176q95080r92317p36504
1503.5E44057312J18370n88837m973602m408913R38988J025429j97372J320381j169587
1512.2E36122169j842727K35138r67827j078568l096885k207756J461334J090126k460518
$$ plain form
1453.3 479855003 481437111 483232574 483666534 484773903 485431480 489762344 492075768 494911766 497016830
1462 497016830 498666458 500972977 500544586 503002167 505209846 507654762 509761925 511950798 515400543
1470.7 515400543 517124748 519374657 521340904 524660492 527308159 528578453 531591606 534415512
1478.4 534415512 536601562 538493118 541097260 542992592 544978638 546740723 547228050 548257980
1486.1 548257980 549085541 550272217 552114296 552049561 551834450 553667336 555258446 555163460 554752083
1494.8 554752083 554481812 550406799 550069618 548911591 546614037 546681213 545786133 544793816 544057312
1503.5 544057312 544175682 543586845 538613243 534204330 535143318 536168747 535971375 537291756 536122169
1512.2 536122169 534279442 534514580 533546753 532468185 529371300 527163544 528624878 529715004 527254486
1520.8E27254486k654037J305503J137810J135330r87396R31893R46426p3624P92618
1529.5E29789009O97937K77252p39402j365052n70144K234497J016388O79092K142296
1538.2E34161873r98345m283828K65007R74540q03375J297493J047554p18689J939659
1546.9E32881889M76914M48150j065864j311264J276207J66893M87480k743683J66855
1555.6E30783577J335411N38826m097824j2627792O373596K207451R95636j533089
1563.3E23975792j516304l016205k721558p12394k237435j669731p922058r42802j032639
1572E02204666l143310k520943k797966j663056j2733421j262855k396622l850861
1579.7D71835632l502159m828567l291664n951004l829689m941979l839912l708573
$$ plain form
1520.8 527254486 524600449 525905952 527043762 528179092 527191696 528123589 529070015 528996391 529789009
1529.5 529789009 530486946 530764198 530024796 528659744 528089600 530324097 531340485 532019577 534161873
1538.2 534161873 533163528 528879700 529144707 530119247 529315872 530613365 531660919 530942230 532881889
1546.9 532881889 533358803 533806953 532741089 531429825 532706032 532872925 533360405 530616722 530783577
1555.6 530783577 532118988 532657814 528559990 515932198 522305794 524513245 525508881 523975792
1563.3 523975792 522459488 519443283 516721725 516009331 513771896 512102165 504180107 503237305 502204666
1572 502204666 499061356 496540413 493742447 492079391 479345970 478083115 475686493 471835632
1579.7 471835632 468333473 463504906 460213242 454262238 450432549 445490570 441650658 437942085
1587.4D37942085n041961l263474n539741l172341n531807l259201l596000m847527
1595.1D03690033k739182m995842k356376m265938k275734l823357l031997j698761
1602.8C78502846m308357j136818l210183j319618l552055j407623j009064k885590
1610.5C59673538P7286k806969j20659k100601M82369j47171n814095K491608q79746
1619.2C50855560J240006j515465Q04138k97127j837654J897507l87726J904755j808777
1627.9C50855217J483040O94275M77981J187592j30005K476768r2430J931839p92808
1636.6C58091469K831383J724357Q62923K451210K67067L090057R86748K112923J811294
1645.3C74229431k4757K937126j221962L455009J274414L061295J649017k145462L502426
$$ plain form
1587.4 437942085 432900124 429636650 424096909 420924568 415392761 412133560 408537560 403690033
1595.1 403690033 400950851 395955009 393598633 389332695 387056961 383233604 380201607 378502846
1602.8 378502846 374194489 373057671 369847488 368527870 364975815 363568192 362559128 359673538
1610.5 359673538 359750824 356943855 356823196 354722595 355204964 355057793 349243698 351735306 350855560
1619.2 350855560 352095566 350580101 351384239 351087112 349249458 351146965 350759239 352663994 350855217
1627.9 350855217 352338257 353032532 353510513 354698105 354568100 357044868 356952438 358884277 358091469
1636.6 358091469 360922852 362647209 363510132 365961342 366228409 369318466 370305214 372418137 374229431
1645.3 374229431 374204674 377141800 375919838 379374847 380649261 383710556 385359573 383214111 386716537
1653.9C86716537n58700M335518J595306K392273J373711J796570J697616J661987
1661.6D01010818L529511O90079L450660K229920L099556L059807K625503L035698
1669.4D22731552J978493N369491K195969L833504L420334K809372L678283L308754
1677.1D49325752M624939L041306M363518K808418M166794M989967J484375K408180
1684.8D77213249L543625O868553M388924L908195M188271L810654M906921M174080
1692.5E13002472M793510M295121M364776K054672M965249N900917N786132N262299
1700.2E50425148k674866O161690M619179L787041L249893K817001K635307L040123
1707.9E74060516M019165K358857J985931K505760K826119L046226l471K94189L536339
$$ plain form
1653.9 386716537 386157837 390493355 392088661 394480934 395854645 397651215 399348831 401010818
1661.6 401010818 404540329 405230408 408681068 410910988 414010544 417070351 419695854 422731552
1669.4 422731552 424710045 430079536 432275505 436109009 439529343 442338715 446016998 449325752
1677.1 449325752 453950691 456991997 461355515 464163933 468330727 473320694 474805069 477213249
1684.8 477213249 480756874 487625427 492014351 495922546 500110817 503921471 508828392 513002472
1692.5 513002472 517795982 522091103 526455879 528510551 533475800 539376717 545162849 550425148
1700.2 550425148 547750282 553911972 558531151 562318192 565568085 568385086 571020393 574060516
1707.9 574060516 578079681 580438538 582424469 584930229 587756348 590802574 590799103 591093292 594629631
1716.6E94629631J746216l325958L886909L708038J884995J199188N58777J383667
1724.3F05671463K000847J409302J063079J484375J554566j19400J069488L125229
1732F17258949K991333j081123k834129N027275M098167J911316K364960O73599l9139
1740.7F30371208M033699K623978P99904K650032L916397L127899K539291K688370
1748.4F52750778J955414M590912J923904J504288M985275L036270L011399K950897
1756.2F76709137J102600K817307L105621K382049K807618l74527N21621L490296J918182
1764.8F94479904J807404K158966J695099q41370J966553L589477l93142k250061K95639
1773.5G02508469M408264J915588l18374K414321J001358J679535N72358o69785J335678
$$ plain form
1716.6 594629631 596375847 593049889 596936798 600644836 602529831 603729019 604287796 605671463
1724.3 605671463 607672310 609081612 610144691 611629066 613183632 613064232 614133720 617258949
1732 617258949 620250282 619169159 616335030 621362305 625460472 627371788 629736748 630410347 630371208
1740.7 630371208 634404907 637028885 637828789 640478821 644395218 647523117 650062408 652750778
1748.4 652750778 654706192 659297104 661221008 662725296 667710571 670746841 673758240 676709137
1756.2 676709137 677811737 680629044 683734665 686116714 688924332 688549805 689071426 692561722 694479904
1764.8 694479904 696287308 698446274 700141373 699300003 701266556 704856033 704462891 702212830 702508469
1773.5 702508469 706916733 708832321 708513947 710928268 711929626 713609161 714181519 713511734 714847412
1782.2G14847412J667557J594696l14560M23279J449966J172409R76258J388702P60803
1790.9G23966522r308j905594j86843L611984J089859o8817J452560J668167P85294
1799.5G30403824o95114J714554J09252P78656J645279M75464J051636K55966M43497
1808.2G36183014J023788R52759n77698O23780J368713M82483R70917P0572M52423
1816.9G41550751j99280P14264J480102L61252O79474l07693J320800R96247j592331
1825.6G45003586Q15658J392670Q37402r23156j907807J710434K129288L40195O80236
1834.3G50078506M47770J23443K29950n49240J089783N07736M08478J65329Q67691
1842.9G53369446O92444l815842K572708K022171k01111J23978N38025O37894l62626
$$ plain form
1782.2 714847412 716514969 718109665 717795105 718218384 719668350 720840759 721817017 723205719 723966522
1790.9 723966522 723957214 722051620 721864777 725476761 726566620 726497803 727950363 729618530 730403824
1799.5 730403824 729708710 731423264 731532516 732311172 733956451 734431915 735483551 735739517 736183014
1808.2 736183014 737206802 738159561 737581863 738205643 739574356 740056839 741027756 741098328 741550751
1816.9 741550751 741351471 742065735 743545837 743907089 744586563 744278870 745599670 746595917 745003586
1825.6 745003586 745819244 747211914 748049316 747126160 745218353 746928787 749058075 749398270 750078506
1834.3 750078506 750526276 750649719 750879669 750330429 751420212 751927948 752336426 752501755 753369446
1842.9 753369446 754061890 750246048 752818756 754840927 754639816 754763794 755301819 755939713 755577087
1851.6G55577087N70908J13220N71137M59823l7307O79473Q2245K70920n77392J84097
1861.3G57894211K77786J05209O43998L88565N89370p46765J55640o75964o83976J283951
1870.9G59232025J014939Q41903k47040L08381K30560K87475K27280Q1787N56565j47172
1880.6G62386703K21711j87760J92566j99966k69852N75791N722J056900j07880j226502
1890.2G62447433O94962R22775J3275q5525N493o20651N84793M32358J87607P6370
1899.8G64658890M0741L94973j00631J64566l24326K4414J05515J96838L57895l12576
1909.5G65206299j4191M5090N68924k41547K36893L31802j91879O66275j749344l34396
1919.1G64523926J310119N87998K3269j199722K5864J007461M36402m15497m6845Q5297
$$ plain form
1851.6 755577087 756147995 756261215 756832352 757292175 757254868 757934341 758016586 758287506 757710114 757894211
1861.3 757894211 758171997 758277206 758921204 759309769 759899139 759152374 759308014 758632050 757948074 759232025
1870.9 759232025 760246964 761088867 760841827 761150208 761380768 761668243 761895523 761977310 762533875 762386703
1880.6 762386703 762608414 762420654 762613220 762413254 762143402 762719193 762724915 763781815 763673935 762447433
1890.2 762447433 763142395 764065170 764078445 763992920 763998413 763377762 763962555 764394913 764582520 764658890
1899.8 764658890 764699631 765094604 764993973 765158539 764834213 764858627 764964142 765160980 765518875 765206299
1909.5 765206299 765192108 765237198 765806122 765564575 765801468 766133270 765941391 766607666 764858322 764523926
1919.1 764523926 765834045 766422043 766445312 765245590 765271454 766278915 766715317 766299820 766252975 766338272
1928.8G66338272K49024J38092m50669M3488O8512K09579j60370K77710k21328l31879
1938.4G66160431R44595o6147M4709r98993j131363R44137N80979j91498l27530O75125
1948.1G66634445K4872l38364k46963p2098J32523k44828K04163p4844Q3923o10657
1957.7G65492172l65143K63596k73666R4146k91061M41742L14636j37482k21481n86243
1967.3G64731216N9357P095M26484k4033j12152l05176l97568L82615L17688K87628
1977G65373154l64685J64260r1323m27170k03247l79486L63464j70975K78931L46909
1986.6G64889832j84174n82428n24445N97077l31040q26492k25449M27933R9488k38877
1996.3G63101425J40152j82724J65863l61328j74408k02637j40075K39486l89556o4927
$$ plain form
1928.8 766338272 766587296 766725388 766274719 766318207 766386719 766596298 766435928 766713638 766492310 766160431
1938.4 766160431 767105026 767038879 767083588 766084595 764953232 765897369 766478348 766286850 765959320 766634445
1948.1 766634445 766659317 766320953 766073990 766001892 766134415 765889587 766093750 766018906 766102829 765492172
1957.7 765492172 765127029 765390625 765116959 765211105 764920044 765361786 765676422 765538940 765317459 764731216
1967.3 764731216 764790573 764797668 765224152 765200119 765087967 764782791 764385223 764767838 765085526 765373154
1977 765373154 765008469 765172729 765081406 764654236 764450989 764071503 764434967 764263992 764542923 764889832
1986.6 764889832 764705658 764123230 763598785 764195862 763864822 763038330 762812881 763240814 763340302 763101425
1996.3 763101425 763241577 763058853 763224716 762863388 762688980 762486343 762346268 762585754 762196198 762131271
2005.9G62131271k91671J12762o0348M653K14768n65872k57721l96576J21612q4381
2015.6G60928497k84271j36261l09219J65558o1570J4725m66843q3999J45416k51007
2025.2G59661026k43301l51181J80206r9640N5161l67966k43149j50146m92630M03823
2034.9G58352203m85458l57971r3918k60620m6616k77633K19421J99585j9302o82526
2044.5G56547165p9422J25961k04315o7291p30973m2877K24686L30048j69831m19616
2054.1G55513535J56631j55411k51083o24466j3046J31607J38473j12991l61176K55509
2063.8G54677582l34473j3656k12937j4801K76413k26898j71356m31519J43204o7673
2073.4G53623886R4528j49841k99225L77121j51596L1128l45688k46658o1112R4071
$$ plain form
2005.9 762131271 761839600 761952362 761892014 761896667 762111435 761545563 761287842 760891266 761012878 760928497
2015.6 760928497 760644226 760507965 760198746 760364304 760302734 760317459 759850616 759766617 759912033 759661026
2025.2 759661026 759417725 759066544 759246750 759147110 759202271 758834305 758591156 758441010 757948380 758352203
2034.9 758352203 757866745 757508774 757414856 757154236 757107620 756829987 757049408 757248993 757229691 756547165
2044.5 756547165 756467743 756593704 756389389 756322098 755591125 755548248 755772934 756102982 755933151 755513535
2054.1 755513535 755670166 755514755 755263672 754639206 754626160 754757767 754896240 754783249 754422073 754677582
2063.8 754677582 754343109 754329453 754116516 754101715 754378128 754151230 753979874 753548355 753691559 753623886
2073.4 753623886 753718414 753568573 753269348 753646469 753494873 753526001 753180313 752933655 752872543 752966614
2083.1G52966614K62985l11203k23846n09339J40763K24075k213j24206n64804l03421
2092.7G51555405j92566K14004m35333l27148j52741j50757L50113j27106Q4458k12250
2102.4G50606079l73993m89578p706L52021k42768j51672j75705M96216k04392k11487
2112G49597015R2087m77295J16501m76074k52915k99148k30179M10156L7537j79062
2121.6G48338623k04849J96152m36173j34201K11411j14975q4839k27890P2860l01056
2131.3G47315063Q0262R7885J81885m0436o00357Q8348R766L49655o7062p325J19248
2141.9G47526932Q0948M23278l54385L10669j38855l07388M4174l8071P6447m17023
2151.5G47206726L70636k45132M4632L71933k43454K50091k41165j450m2114Q7204
$$ plain form
2083.1 752966614 753229599 752918396 752694550 752185211 752325974 752550049 752547836 752423630 751858826 751555405
2092.7 751555405 751362839 751576843 751141510 750814362 750661621 750510864 750860977 750733871 750818329 750606079
2102.4 750606079 750232086 749742508 749734802 750086823 749844055 749692383 749516678 750012894 749808502 749597015
2112 749597015 749689102 749211807 749328308 748852234 748599319 748300171 748069992 748480148 748517685 748338623
2121.6 748338623 748133774 748329926 747893753 747759552 747970963 747855988 747771149 747543259 747616119 747315063
2131.3 747315063 747395325 747493210 747675095 747634659 747034302 747122650 747132416 747482071 747415009 747407684 747526932
2141.9 747526932 747607880 748031158 747676773 747987442 747848587 747541199 747585373 747547302 747623749 747206726
2151.5 747206726 747577362 747332230 747376862 747748795 747505341 747755432 747514267 747512817 747470703 747557907
2161.2G47557907q4076k84347J64871J4496J46866q2627M79050P2784k19040M58j77460
2171.8G47588882L33481k79464R7274K05994j57776J7471P2785K90451R3307M92325
2181.4G48754730r2697n02167r765L58658K18582k67868m2496j42670K72522K44675
2191.1G48791504M2343p3929j59149K29950J59454L95813m37698n49545K9144K24838
2200.7G48652725N00641K04392K32620l60871j45111J19782P4005Q3923k43530J74866
2210.4G49293442K9983J60218k7390J5945L4409l9978L82690k35290m3869K746O0730
2221G49633636m5928K5253J79748k55890O17829l0289m73709k54898j48087K44904
2230.6G49492569k29797K97927L97721O2866m23965k90451N6304J4039K34298l25317
$$ plain form
2161.2 747557907 747473831 747189484 747354355 747368851 747515717 747433090 747912140 747984924 747765884 747766342 747588882
2171.8 747588882 747922363 747642899 747740173 747946167 747788391 747805862 747878647 748169098 748262405 748754730
2181.4 748754730 748662033 748159866 748150101 748508759 748727341 748459473 748416977 748274307 748546829 748791504
2191.1 748791504 748833847 748759918 748600769 748830719 748990173 749385986 748948288 748398743 748427887 748652725
2200.7 748652725 749153366 749357758 749590378 749229507 749084396 749204178 749278183 749362106 749118576 749293442
2210.4 749293442 749323425 749483643 749456253 749472198 749506607 749466629 749849319 749614029 749570160 749572906 749633636
2221 749633636 749587708 749612961 749792709 749536819 750154648 750124359 749650650 749395752 749247665 749492569
2230.6 749492569 749262772 749560699 749958420 750021286 749597321 749306870 749363174 749377213 749611511 749286194
2240.3G49286194J07269N3635k8458k7008n5695M21982o3247L34854j21689m70886
2249.9G49436951k18735j06354K46048k17819j84250J0223N02091l82M4098L46222
2259.5G49858093j08566J75629o00205k85644n7602m3640J39694o3019L8071l65754
2269.2G48687057M53339K60849o0043m59671p08771J51443m5471L45688J11923L07694
2278.8G49044037J51596j76239J02539l84827j8234l90930j7014p1487k69318O1875
2288.5G48031998k25296K07290k22625J03912l62244l38440N1651p86590m08631k77938
2298.1G45773087L62854k01188P3014K71759n57938K38190j41068m52270r54590j24512
2307.8G44287338R308n56793M3106l58658K99759n52521L0594K25830q25500o80847
$$ plain form
2240.3 749286194 749393463 749447098 749418640 749391632 749335937 749757919 749694672 750029526 749907837 749436951
2249.9 749436951 749218216 749111862 749357910 749140091 748955841 748966064 749468155 749467773 749511871 749858093
2259.5 749858093 749749527 749925156 749324951 749039307 748981705 748938065 749077759 749014740 749052811 748687057
2269.2 748687057 749140396 749401245 749341202 748881531 748172760 748324203 748278732 748624420 748736343 749044037
2278.8 749044037 749195633 749019394 749121933 748737106 748718872 748327942 748310928 748239441 747970123 748031998
2288.5 748031998 747806702 748013992 747791367 747895279 747533035 747194595 747246246 746459656 746051025 745773087
2298.1 745773087 746135941 745934753 746007767 746279526 745721588 745959778 745818710 745366440 744411850 744287338
2307.8 744287338 744296646 743739853 743782959 743424301 743724060 743171539 743202133 743427963 742602463 741921616
2317.4G41921616j230698n7907o62460m50898m77905n48477K20337q94089J24664j69601
2327.1G37774582R3460l42178r41010o40259J80970R48944r09882M24347l36380j66168
2336.7G36086426L07388o98624j47171j629562J90430L58505N89447K40402p27081
2345.4G34570160O55670O01273J529159P13349p91779k397308j324692P34100k11715
2354.1G34078217p30362j834641O62079j096420k983399J74332O67496J238021j262435
2362.7G28912888r89914J31073O28280J191941O39038O89163K70691J34887K9145J360168
2372.4G32997360Q22830M05884J47095k58637Q24585N65491N33753J82495L35846K13394
2382G36770096j1597K63901k93121K46124J26724J06964J53122j44119k58942m09241
$$ plain form
2317.4 741921616 740690918 740633011 739970551 739519653 739041748 738493271 738713608 737819519 737944183 737774582
2327.1 737774582 737868042 737525864 736584854 735944595 736125565 737074509 736164627 736588974 736252594 736086426
2336.7 736086426 736393814 735695190 735548019 733918457 734108887 734467392 735056839 735297241 734570160
2345.4 734570160 735225830 735827103 737356262 738069611 737277832 734880524 733555832 734289932 734078217
2354.1 734078217 733347855 731513214 732175293 731078873 728095474 728269806 728937302 730175323 728912888
2362.7 728912888 727922974 728054047 728682327 729874268 730513306 731202469 731473160 731608047 731637192 732997360
2372.4 732997360 733820190 734226074 734373169 734114532 734939117 735504608 736038361 736220856 736556702 736770096
2382 736770096 736758499 737022400 736729279 736975403 737102127 737209091 737362213 737218094 736959152 736549911
2391.7G36549911K88697m85916m63868l17230n24521J3733k87094K85187K69165k49176
2401.3G35078888p68356m68445L586m78363m26484o41708L7003J58310r5597N1956
2410.9G32450790o6604q3924o81457m32053m52804l49884r4757N111p5912o57501j46943
2421.6G29414062k20031q8654l52554n83801K7084l27225n28183q45871k42233K76718
2431.2G26529312K95105O9275m24576k75574p53707m55170l71628m33731l11661m69436
2440.8G23398209r6054j93100J04217M9896L3417l78418q55942n01785n98831m4556
2450.5G20917053l58963o67419k70004j66703N0736q4610J39465j59836q83255r25903
2460.1G17590561j59226q1100m08478k3575k56805m14887k75192K6474k30560o15540
$$ plain form
2391.7 736549911 736838608 736352692 735888824 735571594 735047073 735060806 734773712 735058899 735328064 735078888
2401.3 735078888 734310532 733842087 733845673 733367310 732940826 732299118 732336121 732494431 732398834 732450790
2410.9 732450790 732384186 732300262 731618805 731186752 730733948 730384064 730289307 730294418 730218506 729561005 729414062
2421.6 729414062 729194031 729105377 728752823 728169022 728196106 727868881 727340698 726494827 726252594 726529312
2431.2 726529312 726824417 726893692 726469116 726193542 725439835 724984665 724613037 724179306 723867645 723398209
2440.8 723398209 723302155 723109055 723213272 723263168 723296585 722918167 722062225 721560440 720961609 720917053
2450.5 720917053 720558090 719890671 719620667 719453964 719504700 719420090 719559555 719399719 718516464 717590561
2460.1 717590561 717431335 717350235 716941757 716918182 716661377 716246490 715971298 715997772 715767212 715151672
2469.8G15151672m93164m73327n98374q42972m730j04522m15040J20316J0452o6986
2479.4G12283325o27975q29392r02939n37262j31378j28936M2037m78515k79083l69797
2489.1G08040085m23889k68784o14471n18036n99823n74341r54361n59616K04697L03649
2498.7G04035110K8153n68085l60870n84488n78232o44607q50144k77939k50168k77175
2508.3F99671555l43399k67029j83640j43127k22016o07528q36487o85349j49612j53656
2518F96079712j60065l96347k47269n3558n63660l90319n82657n69535n05065n42603
2527.6F92068634k89917n01556m87595j99966K42691P9803O943k46277q18558q24356
2537.3F89029846q41980m22363l98865n05752m39225J15128L80859m03137l15323n91583
$$ plain form
2469.8 715151672 714658508 714185181 713586807 712743835 712739105 712634583 712219543 712339859 712350311 712283325
2479.4 712283325 711655350 710825958 709923019 709385757 709254379 709125443 709167480 708688965 708409882 708040085
2489.1 708040085 707616196 707347412 706732941 706214905 705615082 705040741 704086380 703526764 703731461 704035110
2498.7 704035110 704063263 703495178 703134308 702549820 701971588 701326981 700476837 700198898 699948730 699671555
2508.3 699671555 699328156 699061127 698877487 698734360 698512344 697904816 697068329 696382980 696233368 696079712
2518 696079712 695919647 695523300 695276031 695222473 694658813 694268494 693685837 693116302 692611237 692068634
2527.6 692068634 691778717 691277161 690789566 690589600 690832291 690912094 690919037 690672760 689854202 689029846
2537.3 689029846 688187866 687765503 687366638 686860886 686421661 686536789 686917648 686514511 686199188 685607605
2546.9F85607605r10034o21109k77863o4544n53818o98700l05329J30768O1417Q6975
2556.6F82455368j36490p30667r61151p94449n11780o02493K04315K47727k25525j96228
2566.2F78748627m22516k16370n07202k84500p04651j314239m54941K74963J29166
2574.9F75248337p39899q2397M8828o87790m18778m51431p12051o09055M1504l55148
2584.5F71282120n42832k88696k16141j74408o00128j0910k93655o19507n33371p87048
2594.2F67215424m01764k51694j05286n79757k75803R460l30352K5100m32968j114807
2603.8F63757553j186523l41874j06124k75803k73666n68009l18680l11889l61634
2612.5F60013351r54589p60880k24914o13709m33121m22058j66549j88675l51410m71878
$$ plain form
2546.9 685607605 684697571 684076462 683798599 683734055 683180237 682481537 682176208 682306976 682368393 682455368
2556.6 682455368 682318878 681588211 680627060 679832611 679320831 678718338 678922653 679170380 678944855 678748627
2566.2 678748627 678326111 678109741 677602539 677318039 676613388 675299149 674844208 675119171 675248337
2574.9 675248337 674508438 674426041 674474869 673787079 673368301 672916870 672204819 671595764 671637268 671282120
2584.5 671282120 670739288 670450592 670234451 670060043 669459915 669449005 669155350 668535843 668002472 667215424
2594.2 667215424 666813660 666561966 666456680 665876923 665601120 665610580 665280228 665305328 664872360 663757553
2603.8 663757553 662571030 662229156 662123032 661847229 661573563 661005554 660686874 660374985 660013351
2612.5 660013351 659058762 658297882 658072968 657459259 657026138 656604080 656437531 656248856 655897446 655425568
2622.1F55425568m84085l59574r97925q61892n94101k78092m92477p71179J7776j69372
2631.8F50434647m72718l41262k25754o79245p41883k21939p57675r80301p17926l58581
2641.4F44937363p2174k7924k49939o15463p17087p32269n59082o11878l55377l86658
2651.1F40609512n52063j89132l49465l83034l17077o32057n55077J75438m10194j028023
2660.7F36368828l23372n65643m70276P4196N0315l11279m70886m87442o52771l67165
2670.4F32844505m53605j82686m58069q41293k08130j90506p0153l38783m82864j21956
2680F29496460k68860q64258p29980J51634l23830n12619j46141o5307j61972n56107
2689.6F26019020o75354q58726m09279k93083k62642l4676m87366m88510q4267J87035
$$ plain form
2622.1 655425568 654941483 654581909 653583984 652722092 652127991 651849899 651357422 650586243 650604019 650434647
2631.8 650434647 649961929 649620667 649394913 648715668 647973785 647751846 646994171 646013870 645295944 644937363
2641.4 644937363 644865189 644837265 644587326 643971863 643254776 642522507 641963425 641351547 640996170 640609512
2651.1 640609512 640057449 639868317 639518852 639135818 638818741 638186684 637631607 637807045 637396851 636368828
2660.7 636368828 636045456 635479813 635009537 635083733 635134048 634822769 634351883 633864441 633211670 632844505
2670.4 632844505 632390900 632208214 631750145 630908852 630700722 630510216 630440063 630101280 629618416 629496460
2680 629496460 629227600 628363342 627633362 627784996 627461166 626948547 626802406 626737099 626575127 626019020
2689.6 626019020 625343666 624484940 624075661 623782578 623519936 623485260 622997894 622509384 622425117 622612152
2699.3F22612152k91138n16548m89349n49240l92075o33545m24003k61879l01743j98212
2708.9F18554420j75247m68139k77672L16047m82521p95784m08096m37622l44963q2397
2718.6F15398026P7629l76587m12255j20277p3738o5956j17302o47431o98738q9225
2728.2F12874146l53394j38512q4495k04582J58081k63634m45099k32887k56920p41997
2737.9F10310707l03116K93350j34925o3248j60561m41742n42373k67334j59912j41869
2747.5F08388977K88353J7357n08423q39272l46794L2540k7924j40457o70700l27072
2757.2F05866585j06888q2092P362k31361j61362k21138k98157k90260m86717p76291
2766.8F03219681l39890l16925o04820J52664K01874l84827k68402J91002m13856r69315
$$ plain form
2699.3 622612152 622321014 621804466 621315117 620765877 620373802 619740257 619316254 619054375 618752632 618554420
2708.9 618554420 618379173 617911034 617633362 617949409 617466888 616671104 616263008 615825386 615480423 615398026
2718.6 615398026 615475655 615099068 614686813 614566536 614492798 614426842 614309540 613662109 612963371 612874146
2728.2 612874146 612520752 612382240 612297745 612093163 612251244 611987610 611542511 611309624 611052704 610310707
2737.9 610310707 610007591 610300941 610166016 610102768 609942207 609500465 608958092 608690758 608530846 608388977
2747.5 608388977 608677330 608694687 608186264 607346992 607000198 607032738 607004814 606864357 606193657 605866585
2757.2 605866585 605759697 605677605 605684967 605453606 605292244 605071106 604772949 604482689 603995972 603219681
2766.8 603219681 602879791 602562866 601958046 602110710 602312584 601927757 601659355 601850357 601436501 600467186
2776.4F00467186n24292m72565l94935k16256m9400l74107p90291l61557M654k06680
2786.1E97081757m46167l87497n47943l48206m13284p01752o19202o90918k78587m29192
2795.7E92219009o35032m39072n19180m07524m74511p11288r88541o84623l20549m47655
2805.4E86591034n29442l75595l27950m94079p55653j174508n72204o68831j239281
2814E80453491p30095n55153l53279m62494m08516o40487q54569o37169r79957o01807
2823.7E74229965q41522j139984j064682j022568l59421n34744o30379n15594o52390
2832.4E67468681q90884j249847j384354j049652q33245j205406p59086r85070j573410
2841.1E57537727j343917j564789j718407j708603j514130j541404j755257k080154
$$ plain form
2776.4 600467186 599942894 599470329 599075394 598859138 598809738 598435631 597645340 597283783 597288437 597081757
2786.1 597081757 596635590 596248093 595700150 595351944 594938660 594236908 593617706 592926788 592648201 592219009
2795.7 592219009 591583977 591144905 590625725 590218201 589743690 589032402 588043861 587359238 587038689 586591034
2805.4 586591034 586061592 585685997 585358047 584863968 584108315 582933807 582361603 581692772 580453491
2814 580453491 579723396 579168243 578814964 578352470 577943954 577303467 576448898 575811729 574831772 574229965
2823.7 574229965 573388443 572248459 571183777 570161209 569801788 569267044 568636665 568121071 567468681
2832.4 567468681 566577797 565327950 563943596 562893944 562060699 560855293 560096207 559111137 557537727
2841.1 557537727 556193810 554629021 552910614 551202011 549687881 548146477 546391220 544311066
2848.8E44311066k004547j515427j375389q22792o32248m20990j06735l27187o51169
2857.4E36454582n20439j27945m90456l86886j06392o10m13857r35249n85365o99158
2867.1E32188225o99120p24563m30947n34019j035195o03866o74553n45044n21660
2875.8E26419258m01153l56904q84857q87756q84857p77855p28493k86331o61964j176301
2885.4E19372787n87081m87595m63982j174354j402855j079788q86727n54466q98018
2894.1E11837921m50172m90876j288719j204300n99136m50516o80809o67114o22597
2902.8E05383682n9395o68907j218376m68407n03997q04329j192627j022225p36961
2911.4D98708458j132965j414566j087914q94813j210175j296539j671524j186409
$$ plain form
2848.8 544311066 542306519 540791092 539415703 538592911 537960663 537539673 537432938 537105751 536454582
2857.4 536454582 535934143 535806198 535315742 534928856 534822464 534821854 534407997 533472748 532887383 532188225
2867.1 532188225 531489105 530764542 530333595 529799576 528764381 528160515 527485962 526940918 526419258
2875.8 526419258 526018105 525661201 524776344 523888588 523003731 522225876 521497383 521211052 520549088 519372787
2885.4 519372787 518785706 518298111 517834129 516659775 515256920 514177132 513290405 512735939 511837921
2894.1 511837921 511387749 510896873 509608154 508403854 507804718 507354202 506673393 506006279 505383682
2902.8 505383682 505324287 504655380 503437004 502968597 502464600 501660271 500467644 499445419 498708458
2911.4 498708458 497575493 496160927 495073013 494178200 492968025 491671486 489999962 488813553
2919.2D88813553p25784q62313p37495j074257n85671k97927m24080k79503j44730
2927.8D83681793J18027K25525M67720J67847J17836K74810J13144m0207o2523M43993
2937.5D85507965O64635P47604M95987L25203N67398O65016R39369Q35763O10771M11987
2947.1D91771698J87836L01513M59404L94249O51818R63325M02298q888J36108L55912
2956.8D95615273L47862M81567O55937O47850O27556P2289K41203O69708O50368O23932
2966.4E00633545N86929P07245K36092K16560O54030Q65059R75303J066132P85294
2975.1E06726189R2048M96750M99611M22211Q95004K56958k48680k2774L06359J76467
2984.7E09600143J40992K09312j77727j72271M24461M18358j43318n0431l34358n90362
$$ plain form
2919.2 488813553 488087769 487225456 486487961 485413704 484828033 484530106 484106026 483826523 483681793
2927.8 483681793 483799820 484025345 484493065 484660912 484778748 485053558 485166702 485126495 485063972 485507965
2937.5 485507965 486172600 486920204 487416191 487741394 488308792 488973808 489913177 490748940 491359711 491771698
2947.1 491771698 491959534 492261047 492720451 493114700 493766518 494729843 495132141 495123253 495259361 495615273
2956.8 495615273 495963135 496444702 497100639 497748489 498376045 498448334 498689537 499359245 500009613 500633545
2966.4 500633545 501220474 501927719 502163811 502380371 503034401 503899460 504874763 505940895 506726189
2975.1 506726189 506818237 507314987 507814598 508236809 509131813 509388771 509140091 509117317 509423676 509600143
2984.7 509600143 509741135 509950447 509772720 509600449 510024910 510443268 510299950 510249519 509915161 509324799
2994.4E09324799m24767Q7166L09677o36292l50341j41144m86069l43513n92957p50046
3004E05996513p06977k41395n35163q43010n94788l30429P896m29916n36766p42722
3013.7E01043243q18748n18074n36652p53669r28727k14271k19460p30591p04422m34455
3023.3D95184174o26526j425438j089440n86967o46591o24848m34189p40165r24073
3032D88085937k93350n34477q04710r25980j018333o78559m96177m84696q26301r99718
3041.6D81023636r20830o56357o27365p16667p73926o04019m14810j274758j335487
3050.3D73699417j007995p27616j92184o67115r10682p18003p46574q43620o67000
3059D67218628q31566q34427o89125j183472p09075o28243p88078l94593n40657o05888
$$ plain form
2994.4 509324799 508900032 508987198 509296875 508660583 508310242 508169098 507683029 507339516 506746559 505996513
3004 505996513 505289536 505048141 504512978 503669968 503075180 502744751 502752647 502322731 501785965 501043243
3013.7 501043243 500224495 499706421 499169769 498416100 497487373 497273102 497053642 496323051 495618629 495184174
3023.3 495184174 494557648 493132210 492042770 491455803 490809212 490184364 489750175 489010010 488085937
3032 488085937 487792587 487258110 486453400 485527420 484509087 483830528 483334351 482849655 482023354 481023636
3041.6 481023636 480102806 479446449 478819084 478102417 477328491 476724472 476309662 475034904 473699417
3050.3 473699417 472691422 471963806 471771622 471104507 470193825 469475822 468729248 467885628 467218628
3059 467218628 466387062 465552635 464863510 463680038 462970963 462342720 461554642 461160049 460619392 460013504
3068.6D60013504p52830o46401p05681r68742r84383n44967n5275m52385q84285r73587
3078.3D53044968o96717p62062o35261m03252p33108p15294q50487p02400o69060o29959
3087.9D46247368n83763q71811o90460p79419m85726n57365p93953n85289j226425
3096.6D39673157r16252p8202l64647o75506q85811j273880o29654l54271p71599l12729
3106.2D33410606n09643j006699p76405m77028p68089p88689l66974o88972q31490
3114.9D27196617q96873n31807m47960q69637p19223p92312o16227p45353q43430q46596
3124.6D19887199q53767o40373j054421q63418p62596r35326q12531n19866n50118
3133.3D12894783p96738k18506n91964r22776n70487p14379q72726q19207o43997r19723
$$ plain form
3068.6 460013504 459260674 458614273 457908592 456939850 455955467 455410500 455355225 454902840 454018555 453044968
3078.3 453044968 452348251 451586189 450950928 450547676 449814568 449099274 448248787 447546387 446877327 446247368
3087.9 446247368 445663605 444791794 444101334 443321915 442836189 442278824 441484871 440899582 439673157
3096.6 439673157 438756905 438678703 438314056 437638550 436752739 435478859 434849205 434494934 433723335 433410606
3106.2 433410606 432900963 431894264 431117859 430640831 429872742 429084053 428717079 428028107 427196617
3114.9 427196617 426299744 425767937 425319977 424450340 423731117 422938805 422322578 421577225 420733795 419887199
3124.6 419887199 419033432 418393059 417338638 416475220 415712624 414777298 413964767 413444901 412894783
3133.3 412894783 412098045 411879539 411287575 410364799 409794312 409079933 408207207 407388000 406744003 405824280
3142.9D05824280q87490j014251p58858k52914p41234p53479p97997q98208o64711
3151.6C99055138n12581o81687r20715r23042r62258n14335m55513p51686j001816
3160.3C92331505r05914m93165o79512q98284j076584o20575k63062p75604j099815
3168.9C85518990p58057l14751o93321j025505j058922q57849p06825n76439m30145
3177.6C79097176o99082j009292j137276m12560o97937r97734k76680p84454j027527
3186.3C72054634r76562p54280l38212m19044q13942q85963o50559q42895n75142r94454
3195.9C64803581r32617n64918o48766j87874r85985p69920k84500m88548n73235p82928
3205.6C58584290k65694q42514j017151o40030m24080n05524q22601l01132p88307
$$ plain form
3142.9 405824280 404936790 403922539 403163681 402910767 402169533 401416054 400618057 399719849 399055138
3151.6 399055138 398542557 397860870 396940155 396017113 395054855 394540520 394085007 393333321 392331505
3160.3 392331505 391425591 390932426 390252914 389354630 388278046 387657471 387394409 386618805 385518990
3168.9 385518990 384760933 384446182 383752861 382727356 381668434 380810585 380103760 379527321 379097176
3177.6 379097176 378398094 377388802 376251526 375838966 375141029 374143295 373866615 373082161 372054634
3186.3 372054634 371078072 370323792 369985580 369566536 368752594 367866631 367216072 366373177 365798035 364803581
3195.9 364803581 363870964 363306046 362657280 362469406 361483421 360713501 360429001 359940453 359367218 358584290
3205.6 358584290 358318596 357476082 356458931 355818901 355394821 354889297 354066696 353765564 352977257
3214.3C52977257o82411m02184o29616m86831p30019q04253j212768p60346k41966
3222.9C47026863n31502m50630m03633r38339p78847K20795n37949q44612n90477o76918
3232.6C41494751k68860n07431k96059p95402j003342k18963o06156j014442l68157
3241.3C36415939P3166o31141o32706o91757o12603j22947o07186o45637n69687n47485
3250.9C31427956p51686k99988K47993j47705j24245q13446q78257m93164q18787q26492
3260.5C26522179m74129L37257n2032q41904o88972l99132p4043J30615l68843j059456
3270.2C23031540r00307n58624j79405k81639n71251m91143n26599l35312m61331l85341
3279.8C18340588j75362P8831J31740o79092q05779m85077k37236N6229j92585n13382
$$ plain form
3214.3 352977257 352294846 351892662 351263046 350776215 350046196 349241943 348029175 347268829 347026863
3222.9 347026863 346495361 346044731 345641098 344702759 343923912 344144707 343606758 342762146 342171669 341494751
3232.6 341494751 341225891 340718460 340422401 339626999 338623657 338404694 337798538 336784096 336415939
3241.3 336415939 336489105 335857964 335225258 334533501 333920898 333797951 333190765 332545128 331975441 331427956
3250.9 331427956 330676270 330376282 330624275 330476570 330352325 329538879 328660622 328167458 327348671 326522179
3260.5 326522179 326048050 326385307 326333275 325491371 324802399 324403267 324329224 324459839 324090996 323031540
3270.2 323031540 322131233 321572609 321393204 321111565 320540314 320049171 319522572 319187260 318725929 318340588
3279.8 318340588 318165226 318244057 318375797 317696705 316890926 316405849 316168613 316224842 316032257 315518875
3289.5C15518875k02045j16120n08461l84197j92223k76889q49972r39102j99795j09329
3299.1C11740742l03879n52254m81930P5627O5212m67873n33981m45328n65357n47600
3308.8C07983379n73978j89362j03836o29730q93803n43994r7352l19423l49598m48704
3318.4C03833599o50501q44364p76043l29857n53455l05481k25430m11510m41018r04846
3328.1B98391094q35266n78689j92662l15418n09319o39363j145877p87106m58908
3336.7B92928486k83890n91717r68837l89309k63787n44414m21887n01041p04060l96785
3346.4B87862759o92177n39932q9589p92408o59828n41134n45921l8166m4479j13411
3356B83805714k31171j75381k37446n60970o69975m15516N0163K0809p03392o85482
$$ plain form
3289.5 315518875 315316830 315200710 314692249 314308052 314115829 313838940 312988968 312049866 311850071 311740742
3299.1 311740742 311436863 310884609 310402679 310478306 310543518 310075645 309541664 309096336 308530979 307983379
3308.8 307983379 307409401 307220039 307116203 306486473 305592670 305048676 304951324 304631901 304282303 303833599
3318.4 303833599 303183098 302338734 301562691 301232834 300679379 300373898 300148468 299736958 299295940 298391094
3328.1 298391094 297555828 296977139 296784477 296469059 295959740 295320377 294174500 293387394 292928486
3336.7 292928486 292644596 292052879 291084042 290694733 290430946 289886532 289464645 288963604 288259544 287862759
3346.4 287862759 287170582 286630650 286541061 285748653 285088825 284547691 284001770 283963604 283919125 283805714
3356 283805714 283574543 283399162 283161716 282600746 281930771 281515255 281565418 281586227 280882835 280197353
3365.7B80197353O9161k00997P2518L90396m73290r21154q30726m77791m50916l16811
3375.3B77057743N1136K03762J89285k25563m74929n24598j95827j22433l60946r537
3384.9B75588093K86312Q0547r2907j10035n11856j88064J67408p35321o90155O19030
3394.6B74413052Q25882l3017l72600o34308k98290J41906l96652m33082j12591K20470
3404.2B73320770K10400K13795K20680l40042n60189k72197M25777J74008l49350j03913
3413.9B72939739O6681L68481K99282j75324k62603N04036N05504j87225q3141J44615
3423.5B74120045K10418j1653O01711N68275j78795P7687K93502M30661M0207L4294
3433.2B76186352J76849K88963Q28782N34172j72520n82657J22757O62975J009751
$$ plain form
3365.7 280197353 280266514 280065517 280138035 280528431 280055141 279133987 278303261 277825470 277374554 277057743
3375.3 277057743 277108879 277312641 277501926 277276363 276801434 276276836 276081009 275958576 275597630 275588093
3384.9 275588093 275874405 275954952 275862045 275752010 275240154 275052090 275219498 274484177 273794022 274413052
3394.6 274413052 275238934 275205917 274833317 274199009 273900719 274042625 273645973 273212891 273100300 273320770
3404.2 273320770 273531170 273744965 273965645 273625603 273065414 272793217 273218994 273393002 273043652 272939739
3413.9 272939739 273006420 273374901 273674183 273498859 273236256 273740292 274245796 274058571 273975430 274120045
3423.5 274120045 274330463 274318810 274920521 275488796 275310001 275387688 275681190 276111851 276152058 276186352
3433.2 276186352 276363201 276652164 277480946 278015118 277842598 277259941 277382698 278045673 279055424
3441.8B79055424Q33187n20210P4672R40705L14750k09579M47540N59712L23963R65652
3451.5B82785816R00116M32282J41201L81927L56007m3087M17499O34327P44248N59425
3461.1B87309761N57804O74706P76291Q83808L60527M79107K59704M53606R54075O51588
3470.8B93360977N52712K46353O91013Q80776P14969R91936M82044K16999N43061P51533
3480.4B99432373Q42133P22103M34551Q15372N80292k05440Q07361J667195P49530
3489.1C05845470L60947P94468N65929P05624R33723N77279O53114L72715P48749J460552
3498.7C13018570R95636L31421O62689J019535M36401N98279O73809R45205J620503
3507.4C20302048J282768L69873M72145J028099K38915Q66890J624107J104355J038132
$$ plain form
3441.8 279055424 279888611 279368401 279443073 280383778 280698528 280488949 280936489 281496201 281820164 282785816
3451.5 282785816 283685932 284118214 284259415 284641342 284997349 284954262 285371761 286006088 286750336 287309761
3461.1 287309761 287867565 288542271 289318562 290202370 290562897 291042004 291301708 291755314 292709389 293360977
3470.8 293360977 293913689 294160042 294851055 295731831 296446800 297438736 297920780 298137779 298680840 299432373
3480.4 299432373 300274506 300996609 301431160 302246532 302826824 302621384 303428745 305095940 305845470
3489.1 305845470 306206417 307000885 307566814 308272438 309206161 309783440 310436554 310809269 311558018 313018570
3498.7 313018570 314014206 314345627 315008316 316027851 316464252 317062531 317736340 318681545 320302048
3507.4 320302048 321584816 321954689 322426834 323454933 323693848 324560738 326184845 327289200 328327332
3516.1C28327332N99327N55000N48172J047401J311226Q02651Q86726P31087Q96911
3524.8C35705833J085053J013641N03617N51490J399422J731987J254196N96962R77745
3533.5C44819946R62067J374130P59812J51252J816712J662826R94683P14531J472740
3542.1C54728699J335869M39262J298714J194000J331138N56717J036072J926346K108841
3550.8C65955658J510849m08211J874619J896057J298904J723137R58290J365586P10678
3559.5C76885567J297912J512108K335663J828423N68962L239669J420556J024780
3567.2C90113640J103935M3945K548714J929207K207146J850967J328430Q80280J177559
3575.9D03183823K166824J383285K143899J134262J388549K559090K032166J586875
$$ plain form
3516.1 328327332 328926659 329481659 330029831 331077232 332388458 333191109 334077835 334808922 335705833
3524.8 335705833 336790886 337804527 338308144 338859634 340259056 341991043 343245239 343842201 344819946
3533.5 344819946 345782013 347156143 347915955 348067207 349883919 351546745 352541428 353255959 354728699
3542.1 354728699 356064568 356503830 357802544 358996544 360327682 360884399 361920471 363846817 365955658
3550.8 365955658 367466507 367058296 368932915 370828972 372127876 373851013 374809303 376174889 376885567
3559.5 376885567 378183479 379695587 382031250 383859673 384428635 387668304 389088860 390113640
3567.2 390113640 391217575 391261520 393810234 395739441 397946587 399797554 401125984 402006264 403183823
3575.9 403183823 405350647 406733932 408877831 410012093 411400642 413959732 415991898 417578773
3583.6D17578773J245652L845520J648979j324768J912269R72863K862816K997322
3591.3D31739426L148956J934700N56831K752571P08809K343140L121376J156845K800675
3600D50263329J565704J559830K511215J310768J794357L363037L345719J266403L287430
3608.7D70267792K97165L59802N654182J389428M44030M096146J384811L914223L060989
3617.4D90868568N47448K405967P29218K290459L629875K473716K806015L487473K158813
3626E11397552L096238O261825P10869n260277L989373M860115M894218J793900J92222
3634.7E31936035L328285L518639K354050J768646K992020L215789K701149J665993
3642.4E53480606J556130L016243L435478N164146J123810j241722M093666M50363
$$ plain form
3583.6 417578773 418824425 422669945 424318924 422994156 424906425 425879288 428742104 431739426
3591.3 431739426 434888382 436823082 437379913 440132484 440841293 443184433 446305809 447462654 450263329
3600 450263329 451829033 453388863 455900078 457210846 459005203 462368240 465713959 466980362 470267792
3608.7 470267792 470564957 470924759 476578941 477968369 478412399 482508545 483893356 487807579 490868568
3617.4 490868568 491416016 493821983 494551201 496841660 500471535 502945251 505751266 509238739 511397552
3626 511397552 514493790 520755615 521466484 516206207 520195580 525055695 529949913 531743813 531936035
3634.7 531936035 535264320 538782959 541137009 542905655 545897675 549113464 551814613 553480606
3642.4 553480606 555036736 558052979 561488457 566652603 567776413 566534691 570628357 571078720
3650.1E71078720M85268J638412N717011M634552L825149M448395m864883L332672
3657.9E90295296N110016J878204K562485J330337K655449J503563K136650J625252
3665.6F09097252P30324N261192K800560J4458P6751m913330M107590Q518219P660828
3674.3F33353844k095070j2326470L027993P587318M496460j800194Q84476K733917
3682F35862274K127571J527672O05850N04685L678131N953369q252792k233467P163047
3690.6F46936340m046936J500626M923477J107254J990891K91900m32739R94492P81402
3699.3F54046707K876663K566300m112091j220932M267730J694184N2185L18298K179947
3708F62668991K530060n535812L789978K686691r749680M998627L748398L69568J604080
$$ plain form
3650.1 571078720 571563988 573202400 578919411 583553963 587379112 591827507 586962624 590295296
3657.9 590295296 595405312 597283516 599846001 601176338 603831787 605335350 607472000 609097252
3665.6 609097252 609827576 615088768 617889328 617903786 617980537 613067207 617174797 625693016 633353844
3674.3 633353844 631258774 618932304 621960297 629547615 634044075 632243881 633128357 635862274
3682 635862274 637989845 639517517 640123367 640628052 644306183 650259552 642006760 639773293 646936340
3690.6 646936340 642889404 644390030 649313507 650420761 652411652 652703552 652270813 653265305 654046707
3699.3 654046707 656923370 659489670 655377579 654156647 658424377 660118561 660170746 660489044 662668991
3708 662668991 665199051 659663239 663453217 666139908 656390228 661388855 665137253 665506821 667110901
3716.7F67110901K483215J99280l421478J783371M687347l504944l299789M301376
3724.4F70339279R80606j58157r38263N74875K478714Q86001N315781k926483n783157
3733.1F70769196Q161468j425934r063034J530304L687134J109314K309265L194580
3740.8F80272293k887726K268753Q561173j0647660j2656021R011689N780563M460907
3748.5F84163971n097885o220017J0410157o080246m695816O045913M530030L692474
3756.2F86748581m744797J412354L894195p033005n35964M102249R95788l15780K864151
3764.9F87387772k363739l253861L883133M487915n62668p909851K735748L030625
3772.6F87435074O4697P06864k24534J551209M06647J889953p77130o525879K634888
$$ plain form
3716.7 667110901 669594116 669793396 666371918 668155289 672842636 669337692 666037903 670339279
3724.4 670339279 671319885 671161728 670223465 670798340 673277054 674163055 679478836 676552353 670769196
3733.1 670769196 678930664 677504730 668441696 669972000 673659134 674768448 677077713 680272293
3740.8 680272293 677384567 679653320 688214493 677566833 664910812 673922501 679703064 684163971
3748.5 684163971 679066086 672846069 683256226 677175980 672480164 678526077 683056107 686748581
3756.2 686748581 682003784 683416138 687310333 680277328 679741364 683843613 684839401 684523621 687387772
3764.9 687387772 685024033 681770172 685653305 690141220 689578552 681668701 684404449 687435074
3772.6 687435074 687499771 688206635 687982101 689533310 689939957 691829910 691052780 684526901 687161789
3781.3F87161789J664123N88456J499176k376786n48477J400147P05719M19693L26004
3790F90839844j87378l70026R68399N20020J161651K044373l921509k968216K436447
3798.7F90523605L425293L894120p780686p716522M854965L356552M540711L342132
3806.4F98440170r227447j781311M578094J292725J99890O72226n2109J331635M192276
3815.1F99646149m574509j0755234O041641M711075L489609Q57849j5470962L083114
3822.8F87028732N961991J743850J641083m90417k805558P49283J696015K031631k84271
3831.4F97272339o192703L204879N003281n456085J709747P744293r789886m291000
3839.2F89204865O481399m851303R97772O111756j956101k336121K244492Q91876L8071
$$ plain form
3781.3 687161789 688825912 689414368 690913544 688536758 687988281 689388428 690094147 690513840 690839844
3790 690839844 690652466 690282440 691250839 691770859 692932510 694976883 691055374 688087158 690523605
3798.7 690523605 693948898 697843018 690062332 682345810 687200775 690557327 695098038 698440170
3806.4 698440170 689212723 687431412 692009506 693302231 693502121 694174347 694122238 695453873 699646149
3815.1 699646149 695071640 684316406 690358047 695069122 698558731 699416580 683945618 687028732
3822.8 687028732 692990723 694734573 696375656 695885239 693079681 693828964 695524979 697556610 697272339
3831.4 697272339 691079636 694284515 699287796 693831711 695541458 703285751 693495865 689204865
3839.2 689204865 695686264 690834961 691832733 697944489 695988388 693652267 695896759 696788635 696826706
3847.8F96826706J261902j486969J360779L303375p057114J130142j2208557L881226
3855.6F87011490R992676q09250j393357J153565J565933J956406m128647Q87756M640961
3864.2G00877533o587982l823853M718628M598541L872223p870865o500473M530335
3871.9F93814087N141678J228943q864746J848373L774948J88370K785263L600769
3879.7G03517685n325089n982971M745255P84836J307220K529678j0850677L246307
3887.4F93972244L910675O49491K660980k684326n896912J742096K638931j342010
3895.1F95651169J203232R31320J512451J318283p388153N231171J691894n544281
3902.8F94607086L099747k697830r07669N66482P83158J438674q239P47451m3945m7836
$$ plain form
3847.8 696826706 698088608 696601639 697962418 701265793 694208679 695338821 683130264 687011490
3855.6 687011490 697004166 696194916 694801559 695955124 697521057 699477463 695348816 696236572 700877533
3864.2 700877533 694289551 690465698 695184326 699782867 703655090 695784225 689283752 693814087
3871.9 693814087 698955765 700184708 691319962 693168335 696943283 697131653 699916916 703517685
3879.7 703517685 698192596 692209625 696954880 697739716 699046936 701576614 690725937 693972244
3887.4 693972244 697882919 698532410 701193390 698509064 692612152 694354248 696993179 695651169
3895.1 695651169 696854401 697785721 699298172 700616455 693228302 698459473 700151367 694607086
3902.8 694607086 697706833 695009003 694101334 694667816 695450974 696889648 696881409 697628860 697584915 697537079
3912.5F97537079k52381l69262O89392J272888j796417j874237K557907j586380k083359
3921.1F94095230K270203N74035O10962j186599j756897J377716J029815O04706q10394
3929.8F96808777k36817J349106k115173n44739J957855r1705l09219K48184J34354
3938.5F97200623k81296k32163J375046L61786k948380j37023J384429O54679L43094
3947.2F97720795j344300L86429n80368j493606J694030M22593j24894J09558k07138
3955.8F96583099j09329l0060Q71125l23792Q7433J67389j119690p2098J29624l51639
3965.5F95832062P705P28913K04849m48303k02713N49164k70310q06198Q70438K46658
3975.1F96712265k61383l52554j85929M21906k4872J37253K18277O35452J34049j0987
$$ plain form
3912.5 697537079 697284698 696915436 697604828 698877716 697081299 695207062 697764969 696178589 694095230
3921.1 694095230 696365433 696939468 697550430 696363831 694606934 695984650 697014465 697619171 696808777
3929.8 696808777 696571960 697921066 695805893 695261154 697219009 697127304 696818085 697066269 697200623
3938.5 697200623 696919327 696687164 698062210 698423996 695475616 695338593 696723022 697377701 697720795
3947.2 697720795 696376495 696762924 696182556 694688950 696382980 696805573 696680679 696790237 696583099
3955.8 696583099 696473770 696443710 697314835 696991043 697078476 697245865 696126175 696054077 696183701 695832062
3965.5 695832062 695839767 696568680 696773529 696325226 696122513 696671677 696401367 695595169 696465607 696712265
3975.1 696712265 696450882 696098328 695912399 696334305 696309433 696446686 696664963 697300415 697434464 697423477
3984.8F97423477l95889q27408K70538j81350M2114l79334k89535P60422K22244N569
3994.4F96650848j80435J99509k28958J43280K09961k92588
4000.2F96501617
$$ plain form
3984.8 697423477 697027588 696200180 696470718 696289368 696331482 695952148 695662613 696423035 696645279 696650848
3994.4 696650848 696470413 696669922 696440964 696584244 696794205 696501617
4000.2 696501617
##END=$$ End of the data block
