##TITLE=$$ Begin of the data block
##JCAMP-DX=5.00 $$ ACD/SpecManager v 10.08
##SPECTROMETER/DATA SYSTEM=Varian
##DATE=14 Jan 2013 10:41:12
##DATA TYPE=INFRARED SPECTRUM
##DATA CLASS=XYDATA
##ORIGIN=
##OWNER=
##NPOINTS=3735
##FIRSTX=399.26403809
##LASTX=4000.35498047
##MAXX=4000.35498047
##MINX=399.26403809
##MAXY=71.36970520
##MINY=30.78410149
##XFACTOR=1.0000000000
##YFACTOR=0.000000100000000
##FIRSTY=50.84298325
##DELTAX=0.96440572
##XUNITS=1/CM
##YUNITS=TRANSMITTANCE
##XYDATA=(X++(Y..Y))
399.3E08429832j6979866j0545539j98136K322579p48330K849579L613701l78723J0681
407.9D88375778K825623N710411L543587m191132m520760L057366N549698o023865
415.7D94326706q756142j089744o403351m058762R702950R083214L279075m766006
423.4D91317940j534539K193146K967873k588043q41637K018661k861442o40602J04446
432.1D90135803k711792L70865L200111J7853J898613K445221n885391m454117L190613
440.7D88207779O031494L215256p48635k281761l077926l768959m987603k61802J495895
449.4D83823738o15692J587372M732208Q54111l642845K656746M567909k2240o207580
458.1D87733727n714493o69022N39513L603019J799088m501953l349953K344322L112984
$$ plain form
399.3 508429832 491449966 480904427 480706291 483028870 482280540 485130119 488743820 488365097 488375778
407.9 488375778 491201401 496911812 500455399 496264267 491743507 494800873 500350571 494326706
415.7 494326706 485570564 484480820 478077469 474018707 483721657 492804871 496083946 491317940
423.4 491317940 489783401 491976547 494944420 492356377 491514740 493533401 490671959 490031357 490135803
432.1 490135803 487424011 487794876 490994987 491012840 492911453 495356674 489471283 485017166 488207779
440.7 488207779 494239273 497454529 496705894 494424133 491346207 487577248 482589645 482327843 483823738
449.4 483823738 483208046 484795418 489527626 490381737 486738892 489395638 493963547 493941307 487733727
458.1 487733727 482019234 481350212 481889725 485492744 487291832 482789879 479439926 481784248 484897232
466.8D84897232l015785j052666M784508J863098o42052m04586l0900l314170n234871
475.5D77849808r64813K213096R58252J746521p6446k565194J54457k321090j900063
484.1D75094528l28750r78394N826454K08130l209877J863976l461800k395401J403618
492.8D74022484j979180j344070J649742L176270K065963k57263k822418j866570j441955
501.5D71203003o4392M071808o24924k526321j00632o65779r12743K1019K011910P71789
511.1D73184738p21817n69992j275330o51092j077690l373261j836929J765480o04668
519.8D64839439m289817k244797K187805K907181L1776J53351N72205L82652p61490
528.5D63778305j703453l94669j071243M89235J163597j827583q85582R38225O40564
$$ plain form
466.8 484897232 481881447 480828781 485613289 487476387 486834335 486429749 486398849 483084679 477849808
475.5 477849808 476884995 479098091 480056343 481802864 481726418 479161224 479315681 476994591 475094528
484.1 475094528 474765778 473787384 479613838 479821968 476612091 478476067 475014267 472618866 474022484
492.8 474022484 472043304 470699234 472348976 475525246 477591209 477333946 474511528 472644958 471203003
501.5 471203003 471138611 475210419 474585495 472059174 471958542 471292763 470380020 470401039 472412949 473184738
511.1 473184738 472462921 471892929 470617599 469966507 468888817 465515556 463678627 465444107 464839439
519.8 464839439 460549622 458304825 460492630 463399811 463431587 463584938 464157143 464539795 463778305
528.5 463778305 462074852 461680183 460608940 461098175 462261772 460434189 459548607 460486832 461127396
537.2D61127396J029853J64795o61926J49574j352310j194191M23851k589035l005142
545.9D54092865L68614J40190q0719J38245j943932p56340J009903J092301J208992
554.5D55270119k88468j87607j047859j266975J53732k12631O94733j88179j076126
563.2D51850739p10640J03035J981887O24543o79093j88942r93423l02773J478005
571.9D53163338k56729r27315J150932j58081j236687M0398M23546p30934j333123
580.6D50135345N93071J326905K91519j474800l28827K107315Q23097j193733o56319
589.3D51623573J039849P71827J44196P74917Q16651J80359M45022Q52318j65443r87358
598.9D55495911q95501P16324J181107p73468j678505q23402K34985K18849j66473
$$ plain form
537.2 461127396 462157249 462322044 461660118 461809692 460457382 459263191 459687042 457098007 454092865
545.9 454092865 454461479 454601669 454520950 454659195 452715263 451958923 452968826 454061127 455270119
554.5 455270119 454981651 454794044 453746185 452479210 452632942 452420311 453115044 452926865 451850739
563.2 451850739 451140099 451243134 453225021 453849564 453170471 452981529 451988106 451685333 453163338
571.9 453163338 452906609 451979294 453130226 452972145 451735458 451775856 452199402 451468468 450135345
580.6 450135345 450728416 452055321 452346840 450872040 450543213 452650528 453473625 452279892 451623573
589.3 451623573 452663422 453435249 453579445 454354362 455171013 455351372 455796394 456648712 456483269 455495911
598.9 455495911 454600410 455316734 456497841 455724373 454045868 453222466 453457451 453676300 453509827
607.6D53509827j130715r83543J34582o39991r55048n29213J793l96500j024475N7717
617.2D48044434J018371R29909N7220L45726J037064J129036N62477l6468P50618K72865
626.9D54111252o03905P65648K400093J855469J041794R10453R43871K091064J469460
635.5D64985199m55017k20909J710396K785911P24945O3820J757279J461715L57018
644.2D73170357n55115K8992J567917J507263Q51364k96822q4915P52068J56822N27191
653.9D77625122J271172R17549j59073n43938L20282R30786P1564q74405l27911j9531
663.5D79211617j48659K55241N36614j046601k557564K989960K36702j16882Q05702
672.2D80166130R65195J905784J399002M1466L27759J522408J356811j42288n45235
$$ plain form
607.6 453509827 452379112 451395569 451530151 450890160 449935112 449405899 449407692 449011192 447986717 448044434
617.2 448044434 449062805 449992714 450049934 450395660 451432724 452561760 453124237 453087769 453838387 454111252
626.9 454111252 453507347 454272995 456673088 458528557 459570351 460480804 461424675 463515739 464985199
635.5 464985199 464530182 464309273 466019669 468805580 469530525 469594345 471351624 472813339 473170357
644.2 473170357 472615242 472644234 474212151 475719414 476570778 476273956 476189041 476941109 477097931 477625122
653.9 477625122 478896294 479813843 479654770 479110832 479431114 480361900 480433464 479559059 479231148 479211617
663.5 479211617 479062958 479318199 479854813 478808212 476250648 479240608 479477310 479360428 480166130
672.2 480166130 481131325 483037109 484436111 484477577 484805336 486327744 487684555 487542267 486997032
680.9D86997032N96275K185669J669617L63922J036682J848679J307564N31616J28136
689.6D96665192K65083N00183j20811N13610J206856j7166K16675J530304J248207
698.2E02008133n875j46560p0687m89807O95229J396599P96852J366615R70192L61252
707.9E06881943J291694R01757K3994l83720l13072M22096M13818O55403J250382J308441
717.5E12452736O63299N35660N70793l73001m50821n31349K62070J521301J307907
726.2E15958595P24030N03540J391716J516914P33757P37763R14192L32489n96733
734.9E22216263m98390n7679M58374J214219J680831Q04329P3395N4245k20833O20842
744.5E26345596L66364p14798n61829J051483J913071Q02269J233368R67216j44615
$$ plain form
680.9 486997032 487593307 489778976 491448593 491812515 492849197 494697876 496005440 496537056 496665192
689.6 496665192 496930275 497430458 497309647 497823257 499030113 499012947 499229622 500759926 502008133
698.2 502008133 502002258 501855698 501785011 501295204 501990433 503387032 504183884 505550499 506520691 506881943
707.9 506881943 508173637 509075394 509099388 508715668 508402596 508824692 509238510 509893913 511144295 512452736
717.5 512452736 513116035 513651695 514222488 513849487 513398666 512867317 513129387 514650688 515958595
726.2 515958595 516682625 517186165 518577881 520094795 520828552 521566315 522480507 522812996 522216263
734.9 522216263 521717873 521660194 522118568 523332787 525013618 525817947 525891342 525945587 525724754 526345596
744.5 526345596 526711960 525997162 525435333 526486816 528399887 529202156 530435524 531402740 531258125
753.2E31258125J1368M35295O15158j85318k06260O20918J876793K043915J161727
761.9E37631721J499863J067543M66652J127701N33142j044846q12339m88663K00195
770.6E40180969R30367K80075M61807N92308Q79555L10860r07975j272049r40666K22283
780.2E40737534j21079L41606J300888J153679Q50029J1902N11436P88918j20010m54026
789.9E45000877k11067k88505L71551L65448j83105O96640J50604m0474k49329p31048
799.5E44881592r24683j592979r68094j612206j090774P46574O0463j639061j343422
808.2E36517410o34842j778984j574096j302338j371918r97925l32374l14980j165886
816.9E27044067m94346j60065M39606l2921j54991J769485J073151N24025J830177
$$ plain form
753.2 531258125 531269493 531704788 532319946 532134628 531928368 532549286 534426079 536469994 537631721
761.9 537631721 539131584 540199127 540665779 541793480 542326622 541281776 540469437 539980774 540180969
770.6 540180969 541111336 541391411 541853218 542445526 543325081 543635941 542727966 541455917 540515251 540737534
780.2 540737534 540616455 540958061 542258949 543412628 544262657 544274559 544785995 545574913 545454903 545000877
789.9 545000877 544789810 544501305 544872856 545238304 545055199 545751839 545902443 545861969 545612640 544881592
799.5 544881592 543956909 542363930 541395836 539783630 538692856 539439430 539499893 537860832 536517410
808.2 536517410 535882568 534103584 532529488 531227150 529855232 528857307 528524933 528209953 527044067
816.9 527044067 526549721 526389656 526829262 526796341 526641350 528410835 529483986 530008011 531838188
825.5E31838188K782784K355995K643089L377419K584915J902351J128082J734391
833.3E50347214J612892J620331K392273K680092K627067Q23326J553192K043724J570893
841.9E67271004N43937J6671R67292K44828J594505N15213N74646K773514J731376
850.6E76232986J129113j57585j33477o39038k64625J365585J796455J853562J176109
859.3E82359085K057076J033973K23847Q0833J87378O06117r99756p36160l23753K61803
868.9E84750443m540p23457p00035o77109K24762r42459k335053j685943M8942q63952
878.6E77091599j321717J12534j02310K69355n40542r12133r27467r05113p35397j077309
888.2E70951500l48511r90486k04735J263504J052628J81274K31896L15857j369248
$$ plain form
825.5 531838188 534620972 536976967 539620056 542997475 545582390 547484741 548612823 550347214
833.3 550347214 551960106 553580437 555972710 558652802 561279869 562103195 563656387 565700111 567271004
841.9 567271004 567814941 567831612 568798904 569043732 570638237 571153450 571728096 574501610 576232986
850.6 576232986 577362099 577204514 577071037 576431999 576167374 577532959 579329414 581182976 582359085
859.3 582359085 584416161 585450134 585673981 585754814 585942192 586548309 585548553 584812393 584488640 584750443
868.9 584750443 584745903 584022446 583322411 582645302 582870064 581927605 579592552 577906609 577955551 577091599
878.6 577091599 575769882 575882416 575780106 576049461 575508919 574596786 573669319 572764206 572028809 570951500
888.2 570951500 570602989 569612503 569407768 570671272 571723900 571905174 572137070 572452927 571083679
896.9E71083679j408272j035728l49655n35393m47235k12479n25322J347885J472321
905.6E69389801K266235K299157J475830O48384j051903J023140R21211n5542O6223
914.3E76982536n8593p01447j952972j582718k581101j864624j760101k607460k315254
922.9E61558266k717362j946945j970749j752243k447014l201751k442246k161064
930.7E42918892j922722k365417j848946j182098p93686o38199j020203o74667n44586
939.3E31928368j029282j837616r41925j19362n68313o94886p87391r8305L44429J8577
949E26214294J641Q42247M37851q24433j058654p97425k47001j207238j350479j312904
958.6E20697899k072106j823959k263679j868134j250267j643028j865082j550407
$$ plain form
896.9 571083679 569675407 568639679 568290024 567754631 567307396 567094917 566569595 567917480 569389801
905.6 569389801 571656036 573955193 575431023 576079407 575027504 576050644 576971855 576916313 576982536
914.3 576982536 576923943 576222496 574269524 572686806 570105705 568241081 566480980 563873520 561558266
922.9 561558266 558840904 556893959 554923210 553170967 550723953 547522202 545079956 542918892
930.7 542918892 540996170 538630753 536781807 535599709 534806023 534167824 533147621 532472954 531928368
939.3 531928368 530899086 529061470 528119545 528000183 527431870 526736984 525949593 525851288 526195717 526214294
949 526214294 526215935 527058182 527496033 526671600 525612946 524815521 524568520 523361282 522010803 520697899
958.6 520697899 518625793 516801834 514538155 512670021 511419754 509776726 507911644 506361237
966.3E06361237j213341j080055j043015j884041k112808k536545k765922k116166
974.1D91609344k674789k983398l210335l019524k336883l194847l628846l569221
981.8D66991501l884010l849488l889313l686141m086533m436112l529891k315827
989.5D37314186k453079l103829k643470k619171j671601j754379k909126k469406
997.2D17690125k184372k195473k698326j748581j375847k082520j922950j736222
1004.9D01745834j292419k066536j337891l42559q37632j620254k223816j744995j223221
1013.6C89056511n21126k088508k626381j604157j667786j432189j586800q31261j612854
1022.3C75085449k389564k564926k205735p20749q39729r66720j509514m64669j70021
$$ plain form
966.3 506361237 505147896 504067841 503024826 501140785 499027977 496491432 493725510 491609344
974.1 491609344 488934555 485951157 482740822 479721298 477384415 474189568 470560722 466991501
981.8 466991501 463107491 459258003 455368690 451682549 447596016 443159904 439630013 437314186
989.5 437314186 434861107 431757278 429113808 426494637 424823036 423068657 420159531 417690125
997.2 417690125 415505753 413310280 410611954 408863373 407487526 405405006 403482056 401745834
1004.9 401745834 400453415 398386879 397048988 396706429 395868797 394248543 392024727 390279732 389056511
1013.6 389056511 388535385 386446877 383820496 382216339 380548553 379116364 377529564 376698303 375085449
1022.3 375085449 372695885 370130959 367925224 367204475 366364746 365398026 363888512 363423843 363253822
1031C63253822o50673o41784j224022K35748P05376N78995k785Q82149K273941J763000
1040.6C67173767J421928R68285J184120Q7776L6774j13449r57107q67157j820679
1049.3C67114258q83560l94593q07800j293449o24276q239r80645n77011p22580j14669
1058.9C60707436L81393J067390J015816J527977K874871J535797J821403J795769
1066.6C72727852J677475N35889O1836J361542Q39729Q84247j93901N25550O85387
1075.3C79105606J7166R07059O02570N59844r28306l89862N05676O70128J241226R92470
1085C83283577J507149Q00438J386184J577111J266861J223182P43523Q14476J69563
1093.6C92772064Q31871J023064J361923J275444O47698J673545J231499M58031P07359
$$ plain form
1031 363253822 362603149 361961365 360737343 360973091 361678467 362257462 362254677 363136826 365410767 367173767
1040.6 367173767 368595695 369563980 370748100 370835876 370872650 370759201 369802094 368934937 367114258
1049.3 367114258 366230698 365836105 365028305 363734856 363110580 363102341 362121696 361544685 360822105 360707436
1058.9 360707436 361088829 362156219 363172035 364700012 367574883 369110680 370932083 372727852
1066.6 372727852 374405327 374941216 375003052 376364594 377204323 378088570 377894669 378420219 379105606
1075.3 379105606 379122772 380029831 380632401 381192245 380263939 379874077 380379753 381049881 382291107 383283577
1085 383283577 384790726 385591164 386977348 388554459 389821320 391044502 391788025 392602501 392772064
1093.6 392772064 393603935 394626999 395988922 397264366 397912064 399585609 400817108 401275139 401982498
1102.3D01982498J035156J212731J668625Q78715K16751Q81806Q99086J129226R80645
1111D10885239J097221P53517O18630N81131o6834R1400n79414K43072Q70781Q6174
1120.6D14580917k35939l89290J75057o33354o57997Q39195J243706N68199J427498
1129.3D16917992J871147P44667K141075K524033K315406J934052O25839J018829J799584
1138D31892624J994057J469116J605720J433106J142044J217308Q15506K87666l4523
1146.7D41822624R74198N66749l74985j2359N10444O82755j31302J31836j27869o99195
1156.3D43342896m10500p62825j060295j038895p0495K98881L64647R62601J381721
1165D43007736J286164J042518J668053J867294K045136J744918K035447K522430J969223
$$ plain form
1102.3 401982498 403017654 404230385 405899010 406777725 406994476 407876282 408775368 409904594 410885239
1111 410885239 411982460 412735977 413354607 413935738 413868904 413960304 413380890 413623962 414494743 414580917
1120.6 414580917 414344978 413955688 414130745 413497391 412839394 413678589 414922295 415490494 416917992
1129.3 416917992 418789139 419533806 421674881 424198914 426514320 428448372 429074211 430093040 431892624
1138 431892624 433886681 435355797 436961517 438394623 439536667 440753975 441569481 441857147 441822624
1146.7 441822624 442796822 443363571 442988586 442976227 443486671 444169426 444038124 444169960 444042091 443342896
1156.3 443342896 442932396 442169571 441109276 440070381 439999886 440298767 440663414 441626015 443007736
1165 443007736 444293900 445336418 447004471 448871765 450916901 452661819 454697266 457219696 459188919
1173.7D59188919K363129K367058K133827K483024K754670K264480J298599R95331
1181.4D75849037J296501J966515J773796J322784J810036J315117R61876J224861
1189.1D87520523K44064j92909l62091j44462K20489k35291k83813n42641p75184m84200
1198.8D84964485Q8844m04853j306763j154480j084251q01239o58074p67403o79855
1207.4D78196411k63481M1733k94724k47879k79007o96830q58956o56509k73972p3318
1217.1D74593468j88942k59438l5286k32086m29687m73519m77562n23948r92547q96224
1226.7D70084229q50029j069642p66487m19311m06876m62723m83017m51164k41318
1235.4D64933662l95507l69149o5803l06778k56157L5973m2038l47901k88048p1144
$$ plain form
1173.7 459188919 461552048 463919106 466052933 468535957 471290627 473555107 474853706 475849037
1181.4 475849037 477145538 479112053 480885849 482208633 484018669 485333786 486295662 487520523
1189.1 487520523 487764587 487571678 487209587 487065125 487285614 487050323 486766510 486223869 485448685 484964485
1198.8 484964485 485053329 484648476 483341713 482187233 481102982 480301743 479643669 478876266 478196411
1207.4 478196411 477932930 477974663 477679939 477432060 477153053 476456223 475597267 474940758 474666786 474593468
1217.1 474593468 474404526 474145088 474109802 473877716 473448029 472974510 472496948 471973000 470980453 470084229
1226.7 470084229 469234200 468164558 467398071 466978760 466571884 466109161 465626144 465174980 464933662
1235.4 464933662 464538155 464169006 464103203 463796425 463540268 463576241 463534203 463186302 462898254 462827110
1245D62827110k44674O790j04408p92389q45986k75039o8436l87764K1858L14827K8992
1255.7D60480881k88506k19002L58124q0604k07024K01492K93923N34858L51105K78015
1265.3D61703262N9777J96266K62718L49045J092148J049690R87053P38830O11153
1274D67049942R55811R21821P71942R31015R84726P06101R22012J050263J065406J363678
1283.6D76722717J867256J466752O60553R07402J012802J022720O77414P74689R76371
1292.3D86088676P76940Q94089P41958Q90694O48270L29895K8114J86119L71742k25029
1301.9D90731468J72768N07545M49868J79138l89366n81932o34118p48481k63329L23715
1311.6D89747276l97987p19223n56679l53699k9411L8338N96847L40920K04086Q06313
$$ plain form
1245 462827110 462582436 462589226 462484818 461692429 460846443 460571404 460502968 460115204 460137062 460451889 460480881
1255.7 460480881 460192375 459973373 460331497 460250893 460043869 460245361 460539284 461074142 461425247 461703262
1265.3 461703262 461763039 461959305 462222023 462571068 463663216 464712906 465699959 466438789 467049942
1274 467049942 468005753 468927574 469699516 470630531 471615257 472321358 473243370 474293633 475359039 476722717
1283.6 476722717 478589973 480056725 480717278 481624680 482637482 483660202 484337616 485112305 486088676
1292.3 486088676 486865616 487759705 488501663 489392357 490040627 490370522 490398636 490584755 490956497 490731468
1301.9 490731468 490904236 491411781 491861649 492040787 491651421 491069489 490435371 489686890 489423561 489747276
1311.6 489747276 489349289 488630066 488073387 487719688 487690277 487728615 488325462 488666382 488870468 489676781
1321.2D89676781Q22487O38389N61295K97203O1912L72200J8807k32010r4757j8311
1330.9D92103996q7890l37944l23754n39627j00326p0534m23508l31497m53377k9793
1340.5D89405746O20499J241188R22318O12869O51741O59409Q97178L90129L13454
1349.2D95714531j65062l9215n23720j198120k61116J09291O36025r461n10139l41759
1358.8D93411255j25160m16375j065712j31759r54399J10168M85268k58103J93863
1367.5D91249046n75370m42696j97983j29356p6027n80139p10717k27432M75388J68037
1377.2D88952751M72641q1253l61824l54118r75151p92733j303520j370773j150475
1385.8D83035545o38275j636886j212082j57433j358757q78792q88061j476441k893600
$$ plain form
1321.2 489676781 490499268 491137657 491698952 491996155 492058067 492430267 492449074 492217064 492122307 492103996
1330.9 492103996 492016106 491678162 491354408 490814781 490714455 490643921 490220413 489888916 489435539 489405746
1340.5 489405746 490026245 491267433 492189751 492802620 493454361 494113770 495010948 495401077 495714531
1349.2 495714531 495549469 495510254 494986534 493788414 493527298 493636589 494272614 494263153 493753014 493411255
1358.8 493411255 493286095 492869720 491804008 491672249 490717850 490828018 491313286 491055183 491249046
1367.5 491249046 490673676 490230980 490032997 489903641 489827614 489247475 488536758 488309326 488784714 488952751
1377.2 488952751 489425392 489344139 488982315 488628197 487653046 486860313 485556793 484186020 483035545
1385.8 483035545 482397270 480760384 479548302 479390869 478032112 477153320 476265259 474788818 471895218
1394.5D71895218l563843j102066j227417j081581k528000k174072o59485j510048
1402.2D58048706j444473j104775k096977k329674j249122j523781k040863j550980
1409.9D44708061j116409p58324j001701n91354l82462p65762j014061j266709N8670
1418.6D37869949k681312j30692J893807M54368O80809n00297O20651J255837J14936
1427.3D39578056Q39806Q17032P71293M23012J352616J196785R88922K239036J878014
1436D50084572N21164K84157K341995J604576J327324J899223Q37212J257782J015930
1444.7D61173935J473274J335831Q14514P56607J314964J725083N19218R26323J072197
1453.3D71111946J866875J863479Q22716O90308M83131K783623Q52508K417946J740303
$$ plain form
1394.5 471895218 468331375 467229309 466001892 464920311 462392311 460218239 459558754 458048706
1402.2 458048706 456604233 455499458 453402481 451072807 449823685 448299904 446259041 444708061
1409.9 444708061 443591652 442833328 441831627 441240273 440857811 440092049 439077988 437811279 437869949
1418.6 437869949 435188637 435057945 436951752 437406120 438086929 437586632 438207283 439463120 439578056
1427.3 439578056 440417862 441234894 442006187 442429199 443781815 444978600 445967522 448206558 450084572
1436 450084572 450605736 450889893 453231888 454836464 456163788 458063011 458900223 460158005 461173935
1444.7 461173935 462647209 463983040 464797554 465554161 466869125 468594208 469113426 470039749 471111946
1453.3 471111946 472978821 474842300 475665016 476355324 476838455 479622078 480474586 482892532 484632835
1462D84632835Q98858K431411j45912J708527K643242K190666K202720K173882K453422
1470.7E01189651J230355R34677Q63457L259811L642921J925202J914711K514572K001228
1479.4E19476585J733590J618614R01031J243782Q16231J7243J064338J277580M30680
1488.1E28579674J251449M4670p06787Q46749N95016n81894o57158r63897m697190
1496.7E23710632J007309O1798k564735K84500l52745p70683p20825L82804p3814n976181
1506.4E14988060m293518J421890K362328P9918Q98018j69716j307831M25758p27119
1515.1E13677788r36508j602745k142373J617089K191047j509094m154587Q58765J940155
1523.7E09939537J930275o18515N19447J089859n20591N82847J396103Q86307r8457
$$ plain form
1462 484632835 485531693 487963104 487817192 489525719 492168961 494359627 496562347 498736229 501189651
1470.7 501189651 502420006 503354683 504218140 507477951 511120872 513046074 514960785 517475357 519476585
1479.4 519476585 521210175 522828789 523729820 524973602 525789833 525807076 526871414 528148994 528579674
1488.1 528579674 529831123 529875793 529169006 530015755 530610771 530028877 529371719 528407822 523710632
1496.7 523710632 524717941 524779739 522215004 522499504 522146759 521376076 520655251 521038055 520964241 514988060
1506.4 514988060 510694542 512116432 514478760 514558678 515456696 515286980 513979149 514404907 513677788
1515.1 513677788 512741280 511138535 508996162 510613251 512804298 511295204 507140617 507999382 509939537
1523.7 509939537 511869812 511251297 511770744 512860603 512340012 512922859 514318962 515205269 515106812
1532.4E15106812l79830j291046J693115J273155L84140J743432j733895n593605L030777
1541.1E14233055J838455r38644J723289J410561r52682J359291O3133M38804o20536
1549.8E18554726j600838J431236O85845Q61930k948799l14750K969055L141670k447662
1558.5E20332413j0291138Q66623J131515J422844n88150j041641k330780j943321
1566.2E07558365n60913j473465l29437p593003k317543j252823k832412k150383k130204
1574.9D86918182r94606j0550766m92019j499214l283959l225517m875717l507500
1582.6D58488884m890938k725258l864517l289490l333931m150390k577477n133247
1590.3D28523636k835541m523086l109665l553810m012757j755104m182320j999206
$$ plain form
1532.4 515106812 514726982 513435936 515129051 516402206 516786346 518529778 516795883 511202278 514233055
1541.1 514233055 516071510 515132866 516856155 518266716 517314034 518673325 518736458 519175262 518554726
1549.8 518554726 516953888 518385124 519070969 519932899 516984100 516669350 519638405 522780075 520332413
1558.5 520332413 510041275 510907898 512039413 513462257 512874107 511832466 509501686 507558365
1566.2 507558365 506997452 505523987 505194550 497601547 495284004 494031181 491198769 489048386 486918182
1574.9 486918182 485923576 475372810 474880791 473381577 470097618 466872101 461996384 458488884
1582.6 458488884 453597946 450872688 447008171 443718681 440384750 436234360 433656883 428523636
1590.3 428523636 425688095 421165009 418055344 414501534 410488777 408733673 404551353 402552147
1598D02552147l751564j869011l008957l369484j905136l350792p55997l158874j462021
1606.7C79920311k565727j027146p10945k701568j50338k296676j9379j676445L44887
1615.4C69116974N97992n821800R41047q49151J047134j291389J093444J40496k530480
1624C62444267J738968k62947J674461j177864P55387Q71925Q02384J225433j66588
1632.7C67905426J961708J014824O89659k355804K574920J640663J009102K168923
1640.4C76609421L32451K335014N74112K139015J942291k97432J561165j220474L195190
1649.1C87170753J263657L070831L647652K855072o302071M24653M325294J248398
1656.8C97704239J825752R88350J520233J486435J525879K394600o4087L786202K189254
$$ plain form
1598 402552147 398800583 396931572 393922615 390553131 388647995 385297203 384541206 381382332 379920311
1606.7 379920311 377354584 376327438 375616493 372914925 372764587 370467911 370448532 368772087 369116974
1615.4 369116974 369714966 363893166 364834213 363985062 365032196 363740807 364834251 364974747 362444267
1624 362444267 364183235 363920288 365594749 364416885 365172272 366044197 366846581 368072014 367905426
1632.7 367905426 369867134 370881958 371571617 369215813 371790733 373431396 374440498 376609421
1640.4 376609421 376941872 379276886 379850998 381990013 383932304 383634872 385196037 383975563 387170753
1649.1 387170753 388434410 391505241 395152893 398007965 391705894 392130547 396455841 397704239
1656.8 397704239 399529991 400518341 402038574 403525009 405050888 407445488 407381401 411167603 413356857
1665.5D13356857K226715K480660K460708J891785K00195M802628J926003L205642
1673.2D32551193L881417K553024J598472K961350M301338K328453K875099J947213
1680.9D54997559L988876N206871J744919Q52508K723427O451759M289704L110847
1688.6D83366470L844033K893104L850403L569069L525047L972054M374008J72768
1696.4E09566956M408531N783157N840378M752846m959984O639061N337448L150864
1704.1E40519257J667022K376099K425041K605553M054603K547036J518440K183800
1711.8E59896851K088279K333489j26991m23050L761215L133697m221801K506141L742409
1720.5E72690239K117462J525765O99577K24876J150246J319847N30701O90994J812630
$$ plain form
1665.5 413356857 415583572 418064232 420524940 422416725 422616920 427419548 429345551 432551193
1673.2 432551193 436432610 438985634 440584106 443545456 447846794 450175247 453050346 454997559
1680.9 454997559 458986435 464193306 465938225 466790733 469514160 475965919 480255623 483366470
1688.6 483366470 487210503 490103607 493954010 497523079 501048126 505020180 509394188 509566956
1696.4 509566956 513975487 519758644 525599022 530351868 525391884 532030945 537368393 540519257
1704.1 540519257 542186279 544562378 546987419 549592972 553647575 556194611 557713051 559896851
1711.8 559896851 561985130 564318619 564191628 563768578 567529793 570663490 566441689 568947830 572690239
1720.5 572690239 574807701 576333466 577033043 577257919 578408165 579728012 580258713 580949707 582762337
1729.1E82762337J58462M49677L488045L594703j80359m717102K816735L208274J589432
1737.8E93170204K706490L90815j202812M277382L285980N04837J153183K787056K684174
1746.5F09757309J962585J941643J679611M576035K443390J64451M381676L252907
1754.2F30159607K818413L045921m7150J455803K422562K199745L353272j68229N80979
1762.9F45820923L544540J913834J529541J940689J243057k457809J761551L890762
1770.6F59187088O22482r66034j872940L455353K683716j91574J811218Q48618J339187
1779.3F66917114N22995q02154J056213J787720J896667J89362L76587J487427P95593
1788F74227524K30179J009140K52151N24445r88236o38962L376465J331940j03302
$$ plain form
1729.1 582762337 582920799 583370476 586858521 590453224 590272865 585555763 588372498 591580772 593170204
1737.8 593170204 595876694 596267509 595064697 599342079 602628059 603132896 604286079 607073135 609757309
1746.5 609757309 611719894 613661537 615341148 619917183 622360573 622525024 626906700 630159607
1754.2 630159607 632978020 636023941 635976791 637432594 639855156 642054901 645408173 645239944 645820923
1762.9 645820923 649365463 651279297 652808838 654749527 655992584 653534775 655296326 659187088
1770.6 659187088 659809570 658843536 656970596 660425949 663109665 662918091 664729309 665577927 666917114
1779.3 666917114 667440109 666637955 667694168 669481888 671378555 671567917 671944504 673431931 674227524
1788 674227524 674457703 675466843 675718994 676243439 675255203 674616241 677992706 679324646 679221344
1796.7F79221344J260147J839447M13513j315536J425705k56424O93512J592560K33078
1805.3F85107346J179123P88345L20129Q67234J161499j135178k28195J095352N01175
1814F89656830Q37097K18506J102218K82288N72662J208725K42539Q83865l45611Q99734
1823.7F95558853R18808l118362j03989K207184J779556K56958k130661P42340K057953
1832.3F98168640L49426L71476O4621k11487q2627M2344J424942J94320N54047M42810
1842G01318512J290207Q40759n497055K044678K420349n03388n70449P26089J199036
1850.7G03268738K16522J046066J55793N0125J63269j04294J65176m47998L43399P6599
1860.3G04933395M53263K81906N26962P92389J9150K03476p90558N08041m80880j469346
$$ plain form
1796.7 679221344 680481491 682320938 682734451 681418915 682844620 682588196 683281708 684874268 685107346
1805.3 685107346 686286469 687074814 687394943 688262177 689423676 688288498 688060303 689155655 689656830
1814 689656830 690493927 690712433 691814651 692096939 692669601 693878326 694120865 695004730 694659119 695558853
1823.7 695558853 696477661 693359299 693255310 695462494 697242050 697499008 695368347 696110687 698168640
1832.3 698168640 698518066 698889542 698954163 698742676 698660049 698702393 700127335 700321655 700875702 701318512
1842 701318512 702608719 703449478 697952423 699997101 702417450 701914062 701343613 702069702 703268738
1850.7 703268738 703485260 704531326 704687119 704737244 704900513 704796219 704961395 704513397 704856796 704933395
1860.3 704933395 705386658 705668564 706195526 706987915 707007065 707210541 706419983 706928024 706447144 704977798
1869.9G04977798J062851J243210Q53272J66397O22406K53906K22397K6932l06168
1878.6G09123001k34909m32129N37872J97678L65524p6K99225P88193j78833P92160
1888.3G11257706m85993k034454L39661J062927Q7356L25547J54419n17426J159821
1896.9G11349564J94931k52610N6687j50223l2501m13590L67279J7090L99323K72751
1906.6G11808701q8730K83813J1292r1935m73251N99747k98462j23596L06091P3242
1916.2G12006912J411820j677018p57751J390762N89142K72904j400528n77927M19693
1924.9G11678009K52152K86636L99933O9656J75324M06112o2942J2512m92249L0747
1934.6G12755890p1640l86658k02637j21536P47299K49405P26929m13666j711426P01905
$$ plain form
1869.9 704977798 706040649 707283859 708137131 708303528 708925934 709179840 709402237 709429169 709123001
1878.6 709123001 708888092 708455963 708993835 709191513 709557037 709556961 709856186 710644379 710465546 711257706
1888.3 711257706 710771713 708737259 709076920 710139847 710227203 710552750 710707169 710189743 711349564
1896.9 711349564 711544495 711291885 711348572 711198349 711165848 710752258 711119537 711136627 711535950 711808701
1906.6 711808701 711719971 712003784 712015076 711923141 711449890 712049637 711751175 711627579 711933670 712006912
1916.2 712006912 713418732 711741714 710983963 712374725 712963867 713236771 711836243 711258316 711678009
1924.9 711678009 711930161 712216797 712616730 712686386 712861710 713267822 713204880 713217392 712725143 712755890
1934.6 712755890 712684250 712297592 712094955 711973419 712720718 712970123 713697052 713283386 711571960 712273865
1944.2G12273865K39944n60760k27509J75324J60064P7210k4719J58004K65580k00501
1953.8G12336502p3242k46506r5367k33612j90049J21232N1345J62964J8158M74091
1963.5G12325516j65100j21155M23736o23855p82318k3651L09753m39453l0518L49884
1973.1G11222839K48490M30298j46408K517j46103j21383k23618k48718j73721l31421
1982.8G10512772K67257O5537l1128L2348K92206k98309o99997N80902J85852r72671
1992.4G09934769p22962L18680L91235J90888K64358j26724j20773j61362O6223m58221
2002.1G09576111k76566M5166l10058L5858m40216k03934K25525J94626j57471j07956
2011.7G08581085J76544l92379j33057q0338j41601o28967k25602J73874j04141N70450
$$ plain form
1944.2 712273865 712513809 711953049 711725540 711900864 712060928 712138138 712113419 712271423 712537003 712336502
1953.8 712336502 712263260 712016754 711921387 711687775 711497726 711618958 711670303 711833267 711851425 712325516
1963.5 712325516 712160416 712039261 712462997 711839142 711056824 711033173 711342926 710903473 710872955 711222839
1973.1 711222839 711471329 711901627 711755219 711757736 711611633 711490250 711266632 711017914 710844193 710512772
1982.8 710512772 710780029 710845566 710814438 710846786 711138992 710840683 710140686 710721588 710907440 709934769
1992.4 709934769 709211807 709530487 709921722 710112610 710376968 710250244 710129471 709968109 710034332 709576111
2002.1 709576111 709299545 709344711 709034653 709070511 708630295 708426361 708651886 708846512 708689041 708581085
2011.7 708581085 708757629 708365250 708232193 708151855 708010254 707381287 707155685 707329559 707225418 707795868
2021.3G07795868k39868m6387K27051l41263l32947m99649j28784k74735J11695k6169
2031G06244812j42059J44806J9455K85339n7449l58124p60269k78092k24304m10538
2040.6G04463577o1722r460L48511l86353k6092K03247q0490R308k40632N6229l04031
2051.2G03972092j63803m21982j5793L39203j03836K53372k8305K54516m38232m97894
2060.9G03149338J297r0561K56348k21177j11694k95868J49231J6480k66953j9913
2070.5G02566528m40597P0419l60184N6153P6446l4942M74624L4867L81927k89535
2080.2G02535706j72883o3781k02866k00119o49185n9357r1400K90909Q697r5443J09405
2090.8G01409683j02005j24283o41174k21481o05622o3476N00412J59530j93023o47278
$$ plain form
2021.3 707795868 707556000 707509613 707736664 707395401 707062454 706562805 706434021 706159286 706270981 706244812
2031 706244812 706102753 706247559 706267014 706552353 706494904 706136780 705376511 705098419 704874115 704463577
2040.6 704463577 704401855 704392395 704740906 704354553 704328461 704531708 704451218 704460526 704219894 704276123 703972092
2051.2 703972092 703808289 703386307 703370514 703709717 703605881 703859253 703830948 704085464 703647232 703149338
2060.9 703149338 703150635 703060074 703316422 703095245 702983551 702687683 702836914 702853394 702586441 702566528
2070.5 702566528 702125931 702196350 701836166 701892319 701968765 701933823 702408447 702443314 702825241 702535706
2080.2 702535706 702362823 702299042 702096176 701896057 701246872 701187515 701096115 701387024 701395721 701300278 701409683
2090.8 701409683 701307678 701183395 700542221 700320740 699715118 699651642 700152054 700311584 700118561 699471283
2100.4F99471283L65143j44882J3504N4931n20859n6457m80423m2954J22681J63574
2110.1F98945541p171R3612n111n44129j63269m65698m3335k79236j55563K09198J9684
2120.7F97604523P36236K39716m0436m07486l86200l99475l88260L04260k78167l46222
2130.3F96638489j8921M70352M5090k2202K90451l64990J71051n2185k60620k72980
2140F96623535k99148K08129M40674J73798m22211K24076J78756J36566r9105n18876
2149.6F96646194o4773k81830J90430J74713R1247P2937J73874N38788m2114k48489
2159.3F97250977n14985j97677l58200k13928M25109J73645K97928q9798J47705J29090
2168.9F97049866k17209j59836k31247m0207j49383K50930M60892O02417J89819j35879
$$ plain form
2100.4 699471283 699836426 699691544 699705048 699759979 699239120 699182663 698702240 698659286 698781967 698945541
2110.1 698945541 698938370 699031982 699026871 698482742 698319473 697853775 697810440 697531204 697375641 697584839 697604523
2120.7 697604523 698340759 698580475 698540039 698132553 697746353 697346878 696958618 697262878 696984711 696638489
2130.3 696638489 696619568 697089920 697135010 697112808 697403259 697038269 697209320 697157135 696896515 696623535
2140 696623535 696324387 696532516 696973190 697146988 696724777 696948853 697127609 697264175 697165070 696646194
2149.6 696646194 696581421 696299591 696490021 696664734 696755981 696828918 697002792 697541580 697499466 697250977
2159.3 697250977 696735992 696538315 696180115 695966187 696391296 696564941 696862869 696773071 696920776 697049866
2168.9 697049866 696832657 696672821 696441574 696401367 696251984 696502914 696963806 697566223 697756042 697620163
2178.5F97620163q5144m93088j61209k23618l2882j21689N8746N08652M5929K51007
2188.2F97366867J54800P6371O2103K71378j1063p15256m79202j16348M94537L85895
2197.8F97490082K27890j72196k05612L45993J47095O103l35845o3324k14768L6621
2207.5F97262039K15759j78909N59082L50800J02997k06528r1782o0959l92227p5073
2217.1F97485199l93982K1133m1351K45438N38788J9912J95618l6774k63748n81207
2226.8F97189026l7079q5525j88981M05503K09655K18201k31857K43225k4414m91104
2236.4F97206650N9738j71051q4305k16141K38877M23889L81012J7624m95606J53656
2246F97514343J28632R7046k14386m15497n05524k34146L75977M76455N31311k72064
$$ plain form
2178.5 697620163 697535019 697041931 696880722 696657104 696624222 696502533 696561279 697069931 697115860 697366867
2188.2 697366867 697521667 697598038 697660141 697931519 697920456 697205200 696725998 696609650 697104187 697490082
2197.8 697490082 697717972 697545776 697340164 697686157 697833252 697839355 697503510 697440186 697225418 697262039
2207.5 697262039 697477798 697298889 697857971 698208771 698311768 698105240 698013458 697952499 697560272 697485199
2217.1 697485199 697091217 697112350 697070999 697316437 697855225 697875137 698070755 698033981 697770233 697189026
2226.8 697189026 697151947 697066422 696877441 697282944 697492599 697710800 697478943 697722168 697697754 697206650
2236.4 697206650 697266388 697095337 697011032 696794891 697033768 697457657 697838669 697856293 697360687 697514343
2246 697514343 697642975 697740021 697525635 697110138 696604614 696370468 696746445 697222900 697754211 697482147
2255.7F97482147J2207m4937k72446q3923k43759J99814n23758j67236K68707J60904
2265.3F96787720o790l38669K02484k85874p6217R1858J28174Q6517N1422L79639l55759
2275.9F96664505p6599k20032J75095K41775p50198m16260J1444K94571l42026K10038
2285.6F95792313K29721j32294M85458j39160p400m58680k88391J09864J2130Q6136
2295.2F95689697n79834J45188L17764K43988q3923m74472j20240n4397K89612r3537
2304.9F95279846J67389q7738j43661L22494j55640n5465m82865K1973j25885p19223
2314.5F94021225J92490Q43124O04324k00500m5471n14069l96500K63062M09851N95016
2324.2F95772552r9029p2250j38627J19019j45721m28009o0349p2784J05285r29107
$$ plain form
2255.7 697482147 697494354 697449417 697176971 697093048 696849289 697049103 696525345 696358109 696626816 696787720
2265.3 696787720 696780930 696442261 696644745 696358871 696282654 696374512 696502686 696589203 696640625 697020264 696664505
2275.9 696664505 696587906 696367874 696542969 696784744 696034546 695618286 695629730 695924301 695582275 695792313
2285.6 695792313 696022034 695889740 696375198 696236038 696228638 695769958 695481567 695591431 695603561 695689697
2295.2 695689697 695109863 695255051 695572815 695816803 695732880 695258408 695138168 695083771 695373383 695279846
2304.9 695279846 695447235 695359497 695215836 695538330 695382690 695327225 694844360 694866333 694740448 694021225
2314.5 694021225 694213715 695056839 695661163 695460663 695415192 694901123 694504623 694767685 695177536 695772552
2324.2 695772552 695673523 695601273 695462646 695581665 695435944 695007935 694947586 694874802 694980087 694050980
2333.8F94050980n95017O15311O05850o55746q52051Q93097J023636j7930m09393l76968
2343.4F94281769m25186m27399p53174j006317p38297P99866J793671O47049M60129
2352.1F94632111l99857n07050K50092J35345O99463r53903j10626l27835k3041M97437
2361.8F93892136P59887J21155k698746J039200M61426j450882j346512j195755L22190
2370.4F89904099o69938M6387k59018j01776K4872q03909l76893p31506m69665n59159
2380.1F86003494m28009m27627r4223M60052p5455j1062o46363o81838j41221k0599
2389.7F83937149o7139k54440%n18570j41067L49578J99967j30692l84216n5771o35223
2400.3F82299576p93228o42701l48510m6845K98920L62472l36990j35574k62909l08991
$$ plain form
2333.8 694050980 693455963 694071274 694677124 694021378 693169327 694062424 695086060 695068130 694658737 694281769
2343.4 694281769 693856583 693429184 692676010 691669693 690931396 691731262 693524933 694171982 694632111
2352.1 694632111 694232254 693725204 693975296 694110641 694810104 693856201 693745575 693417740 693394699 693892136
2361.8 693892136 694652023 694773178 692074432 693113632 693575058 692124176 690777664 689581909 689904099
2370.4 689904099 689234161 689280548 689021530 688919754 688944626 688140717 687763824 687032318 686562653 686003494
2380.1 686003494 685575485 685147858 685053635 685513687 685438232 685427170 684780807 684098969 683957748 683937149
2389.7 683937149 683870010 683615570 683615570 683097000 682955933 683305511 683505478 683374786 682990570 682934799 682299576
2400.3 682299576 681506348 680863647 680515137 680468292 680767212 681129684 680792694 680657120 680394211 680085220
2410F80085220m82711k57721j1521n95703o7520m9896J30310K3193j83029j78757o34308
2420.6F77777557j61666m96064n08804k88162k16828j49841l75977Q7357J36261L43857
2430.2F76147690k80991o79703l85971o38656n54886o95419k43912J20087J90200k9068
2439.9F72949371l64990k71835k84729n4550k35596m01535n92575j77002r7504n06744
2449.5F69962311k0981o4926K04468j20469n90133m10691l71856k42233m92096l28980
2459.2F67524414m33502n0430L2043l27911O3858j78452k35290n61448q13064n86319
2468.8F64433899j16425j44195m79813j5106l89709l24555n3482j13907k64892o20728
2478.5F61911087m81949n34210o0425j28403j35421j91346n19180j79291o35299m68750
$$ plain form
2410 680085220 679602509 679344788 679333267 678737564 678670044 678620148 678750458 678773651 678590622 678411865 677777557
2420.6 677777557 677615891 677119827 676611023 676322861 676106033 675956192 675580215 675667572 675803833 676147690
2430.2 676147690 675866699 675186996 674801025 674162369 673607483 672912064 672668152 672788239 672978439 672949371
2439.9 672949371 672584381 672312546 672027817 671973267 671737671 671336136 670743561 670566559 670469055 669962311
2449.5 669962311 669941330 669876404 670080872 669960403 669370270 668959579 668587723 668345490 667853394 667524414
2459.2 667524414 667090912 667040482 667072525 666744614 666808472 666630020 666394730 665833282 665020218 664433899
2468.8 664433899 664317474 664173279 663693466 663678360 663288651 662964096 662910614 662796707 662531815 661911087
2478.5 661911087 661429138 660894928 660834503 660706100 660570679 660379333 659860153 659680862 659045563 658576813
2488.1F58576813m16107l57361j61667m95529j54572k02637j81579m47312o04248j98364
2497.7F55357437k39410n66941n91049J26114J23673l01819n55573m71039j49688l43323
2507.4F52388382o28815n32150k05841m77295k73361Q7127N4398j90735n75332k72675
2517F49373703n44586p42722o32858r2926L83453l48892k15835J62200j49688n83191
2526.7F46608658n56717n57022p39517l41034j97449j56021n77545o14090l2654j95465
2536.3F42641144l45764O5689J25580m83246m63944m17251j24436K136n56182k61612
2546F40182114j69220j99967k81944m98047m90189k70118l03917q53577m85573k87094
2555.6F36342468j65291j35688l07274J945l23753l48778j93367j27601k13242m48723
$$ plain form
2488.1 658576813 658160706 657803345 657641678 657146149 656991577 656788940 656607361 656160049 655555801 655357437
2497.7 655357437 655118027 654551086 653960037 654086151 654209824 653908005 653352432 652881393 652731705 652388382
2507.4 652388382 651759567 651227417 651021576 650544281 650270920 650358047 650412445 650221710 649646378 649373703
2517 649373703 648829117 648086395 647453537 647360611 647744064 647395172 647179337 647341537 647191849 646608658
2526.7 646608658 646051941 645494919 644755402 644414368 644216919 644060898 643483353 642869263 642836609 642641144
2536.3 642641144 642295380 642361069 642486649 642003403 641539459 641122208 640997772 640999908 640443726 640182114
2546 640182114 640012894 639812927 639530983 639032936 638542747 638272629 637968712 637115135 636629562 636342468
2555.6 636342468 636177177 636041489 635734215 635736160 635412407 635063629 634870262 634742661 634529419 634080696
2565.2F34080696o35605o65855p4654l5896j02997m08134l75519K899m15230m28695
2574.9F30941010m46663m52996j87988l5629n36423m72870K78511j49879l19290k15683
2584.5F28402100k91024n72548n43212q3695l26652n08995m68865k42538n49240n24483
2594.2F24290848m0360m5700j17836l68080j19705m86107l89557k20375o98395k72140
2603.8F21532593n34706k91329O8283j01204k59094n27687k93655n75791l75251k34604
2613.5F18407555m09203k10724k94266l45382l95012m25987n81246l06167l24212l67164
2623.1F14748192j54076m40788l48358l52783m26903o48346o36902k81639M7264j40152
2632.8F11365509p86209j94855k9678l79677o40144o22292M7531j32484m40674n71938
$$ plain form
2565.2 634080696 633445091 632779236 632704582 632668686 632565689 632157555 631782036 631784935 631369705 630941010
2574.9 630941010 630494347 630041351 629853363 629817734 629281311 628808441 629086952 628937073 628617783 628402100
2584.5 628402100 628111076 627538528 626995316 626911621 626584969 626075974 625607109 625364571 624815331 624290848
2594.2 624290848 624250488 624204788 624086952 623718872 623599167 623113060 622723503 622503128 621804733 621532593
2603.8 621532593 620997887 620706558 620774841 620673637 620414543 619886856 619593201 619017410 618642159 618407555
2613.5 618407555 617998352 617787628 617493362 617147980 616752968 616326981 615745735 615439568 615115356 614748192
2623.1 614748192 614594116 614153328 613804970 613452187 613025284 612376938 611740036 611458397 611505661 611365509
2632.8 611365509 610579300 610384445 610354767 609975090 609334946 608712654 608760185 608627701 608187027 607615089
2642.4F07615089l04184m00314n10483j94091m82064l09219l21121k27814m20723n22881
2652F03922195J4916l96614m61159k33612j03188l67355p49817m90036k87285j76201
2661.7F00671844m21485m61998k40021j0643k05002m42162q1405j40305k91748l51562
2671.3E98025513l87268k65427j85013m36554j46103P7133n28373k36778l30620m29077
2681E95157433l11699m87213o4316l03459l88184l27644l24402l64189k77253K09771
2690.6E92518845k82784n50194k26478N6114j86348m65546l83262l95241k92587o66809
2700.3E89125710l93181j70937o0196K29798k87781k73400l86009k82020K60124k0752
2709.9E87741356q05130p47490k11906j51711R9449m58412m09584r6207n48820j45874
$$ plain form
2642.4 607615089 607310905 606910591 606400108 606206017 605723953 605414734 605093613 604865799 604445076 603922195
2652 603922195 603937111 603540497 603079338 602845726 602742538 602375183 601625366 601135330 600848045 600671844
2661.7 600671844 600250359 599788361 599548340 599537697 599332695 598890533 598809128 598668823 598377075 598025513
2671.3 598025513 597638245 597372818 597187805 596751251 596605148 596682281 596153908 595917130 595586510 595157433
2681 595157433 594845734 594358521 594294205 593990746 593602562 593274918 592950516 592586327 592309074 592518845
2690.6 592518845 592236061 591685867 591459389 591515503 591329155 590863609 590480347 590085106 589792519 589125710
2700.3 589125710 588732529 588561592 588501396 588731194 588443413 588170013 587784004 587501984 587762108 587741356
2709.9 587741356 586936226 586188736 585976830 585825119 585924568 585466156 585056572 584960365 584411545 584265671
2719.5E84265671n6305J7853j09024l24364k53525l48740k37541m31595k95982O87
2729.2E82227135L12652K33383l88412m90723k49252L0098p2441m12521o87218l55911
2738.8E80146790l6316k26708k31170n570L94821Q0719l08761j89324j65596m80194
2748.5E78978691m34456l9863k92588j60789m3068J30577J60790l66669o38123o93702
2758.1E76600800k4109l17040n46722p0076k14958n0354j00327J4381k63557l27911
2767.8E74700127L6430l33595m45290k76146L5172l13111k90985o0158n14068l70445
2777.4E72167931m24118m65661k26135j71470l02659m25262n63850l53432K0218l12691
2787E68942871j34468j88980m43420l85018o22940n13992m00772o2523l58544q57200
$$ plain form
2719.5 584265671 584209366 584227219 584118195 583793831 583540306 583191566 582954025 582522430 582226448 582227135
2729.2 582227135 582539787 582773170 582384758 581894035 581644783 581674881 581602440 581189919 580502701 580146790
2738.8 580146790 580110474 579883766 579652596 579647026 580041847 580122566 579813805 579624481 579458885 578978691
2748.5 578978691 578544235 578504372 578211784 578050995 578007927 578138504 578299294 577932625 577294502 576600800
2758.1 576600800 576576691 576259651 575712929 575642853 575427895 575377541 575277214 575291595 575028038 574700127
2767.8 574700127 574736557 574402962 573957672 573681526 573716698 573403587 573112602 573052444 572538376 572167931
2777.4 572167931 571743813 571278152 571052017 570880547 570577888 570152626 569588776 569235344 569255562 568942871
2787 568942871 568808403 568619423 568176003 567790985 567168045 566654053 566253281 566190758 565832214 564975014
2796.7E64975014m96903k30407l61405o70128o01234m67377q6250l76816j024704n65224
2806.3E60094566j81884n2910l84827o40984k67791l07160p18841p47452o11992n42412
2816E55638313l37982n92689n63622n08804p61605n55725n78537q08105p11365k83470
2825.6E49936409o34804q52394m85992p31583o88324n89790p23458p67746n78003p89146
2835.3E43095169p51953k24266p61490j047554j432495j509132r68094j421967j500206
2843.9E33478012j378403j566848j469803j354904j541787j440506j265983j166191
2851.7E22293587m59976o90194j103592m33044J43242J33972L0937j19934l07312j4000
2861.3E19473686j37405j26343k96898n75905l46412p74155p03087p17773o58913m39148
$$ plain form
2796.7 564975014 564478111 564247704 563886299 563216171 562614937 562147560 562061310 561684494 560659790 560094566
2806.3 560094566 559912682 559859772 559474945 558833961 558566170 558259010 557540169 556792717 556180725 555638313
2816 555638313 555300331 554707642 554144020 553635216 552873611 552317886 551739349 550931244 550219879 549936409
2825.6 549936409 549301605 548449211 547963219 547231636 546543312 545953522 545230064 544462318 543884315 543095169
2835.3 543095169 542343216 542118950 541357460 540309906 538877411 537368279 536400185 534978218 533478012
2843.9 533478012 532099609 530532761 529062958 527708054 526166267 524725761 523459778 522293587
2851.7 522293587 521833611 521143417 520039825 519606781 519750023 519883995 519914932 519794998 519487686 519473686
2861.3 519473686 519336281 519209938 518913040 518337135 517990723 517216568 516513481 515795708 515136795 514697647
2870.9E14697647n29785j52702o21186o11114q7166l04756o80618p86477o49452q57582
2880.6E09416809p44934n74265m13322m08287o42090n25131o50978q62389o49452l43018
2890.2E03602943p29026p59201o93207q86803m20380o04629q77304q76618p04574l71552
2899.9D96679649m73480o00471o88515l11203k42577p41310j124229o29120r613p67517
2909.5D91091614j144829r04160r58213j283875j249046q81272r39674j006126j370316
2918.2D81354103j063309m82635j175499j454811n55763r5673r1553j76544n30891
2926.9D75727425J47514M49142n2566r8343l510L37143L93334P16171L57704m5051
2936.5D77928963P61604Q89587M47617J11809N02052O60629N12696N60875J95732L70331
$$ plain form
2870.9 514697647 514167862 514015160 513393974 512782860 512695694 512390938 511710320 510923843 510274391 509416809
2880.6 509416809 508671875 508097610 507684288 507276001 506633911 506108780 505457802 504595413 503945961 503602943
2890.2 503602943 502873917 502114716 501421509 500534706 500114326 499509697 498632393 497755775 497051201 496679649
2899.9 496679649 496206169 495605698 494917183 494605980 494363403 493622093 492497864 491868744 491859131 491091614
2909.5 491091614 489946785 489042625 488084412 486800537 485551491 484670219 483730545 482724419 481354103
2918.2 481354103 480290794 479808159 478632660 477177849 476622086 476526413 476434860 476258316 475727425
2926.9 475727425 475874939 476324081 476271515 476173172 476169662 476506805 476900139 477616310 477974014 477928963
2936.5 477928963 478690567 479580154 480027771 480139580 480641632 481302261 481814957 482375832 482571564 482941895
2946.2D82941895O43692P83996P79801N45539J98555N9052m4441q3618N49964Q0147
2955.8D86454582j12114K73285L27797P38335L68309M26559N71976O33888P52793J44767
2965.5D90580177K0142L63617P74650O13862N40695P24868O36635Q27446O84433O409
2975.1D95772934k22549N00946O18591L13911M12407K48947J87264J71165q5411j13373
2984.7D97804832M30413J63269j33324L40996J36146Q6136J52397p4157p3166K25830
2994.4D99059372j75972m88777R5367k97165n49736n38940o90460n44548m78211N2986
3004D95443916m5242l87650l33595l31344k72446o08482o03829j26991n39093r63860
3013.7D91231384k36358j63193l37677k74010o45904m33159l41873o55022q32024m29001
$$ plain form
2946.2 482941895 483585587 484369583 485149384 485694923 485893478 485952530 485908089 485824471 486374435 486454582
2955.8 486454582 486342468 486615753 486943550 487681885 488050194 488476753 489048729 489682617 490435410 490580177
2965.5 490580177 490600319 490963936 491738586 492352448 492893143 493618011 494254646 495082092 495766525 495772934
2975.1 495772934 495550385 496051331 496669922 496983833 497396240 497645187 497832451 498003616 497918205 497804832
2984.7 497804832 498235245 498398514 498265190 498606186 498742332 498828468 498980865 498906708 498833542 499059372
2994.4 499059372 498883400 498394623 498489990 498192825 497643089 497104149 496413689 495869141 495390930 495443916
3004 495443916 495398674 495011024 494677429 494346085 494073639 493465157 492861328 492734337 492195244 491231384
3013.7 491231384 490995026 490831833 490494156 490220146 489574242 489141083 488799210 488144188 487312164 486883163
3023.3D86883163J6327k94838q38813r89533m19197l93677n48401m96482n63164m74739
3033D81880646o36254o55670p02324k65236k58255r32350o26220l02506n02396q51440
3042.6D76147995p74384n15441n20516o61659o21605l33900n10369o90460q96301p71256
3052.2D69852104l83987m81034p85942p16438l67966n59158m09889p98531j025772
3060.9D64323387k02026j32065m19617q44040k75459j92871j060829p04155l22609
3069.6D60169716m30412q55103n39818k92282l05328k14043p87659m64439k18964n36384
3079.2D55525284p80945m57764l09372r56382o13671m71687m67224m91409n36614k88696
3088.9D50151520n84374l78456m14543n64880p03202p16552j82877o60400q96645l37830
$$ plain form
3023.3 486883163 486899490 486604652 485765839 484776306 484357109 483963432 483415031 482918549 482355385 481880646
3033 481880646 481244392 480588722 479886398 479621162 479362907 478430557 477804337 477501831 476999435 476147995
3042.6 476147995 475373611 474858170 474337654 473675995 473054390 472720490 472210121 471519661 470623360 469852104
3052.2 469852104 469468117 468987083 468201141 467484703 467116737 466557579 466147690 465349159 464323387
3060.9 464323387 464121361 463989296 463569679 462725639 462450180 462257309 461196480 460492325 460169716
3069.6 460169716 459739304 458884201 458344383 458052101 457746773 457532730 456745071 456280632 456061668 455525284
3079.2 455525284 454744339 454286575 453977203 453020821 452407150 451935463 451468239 450976830 450440216 450151520
3088.9 450151520 449567146 449188690 448774147 448209267 447506065 446789513 446606636 445946236 445049591 444711761
3098.5D44711761j02920l65410q05092q41141o14471l72772j99890m66614q06694m54788
3108.2D39681969l27645m09469n69916n46722j48163m73023p60574j083260q09631
3116.9D34553566n9128l54194q76008q44841k99797q50448j282044k57187K9946n10826
3126.5D29249039j032372r58938o98662o61469n87425k67982m23584q15621j85356
3135.2D23617630j11809l78380l52630p92008j101036q13751n17197q28437m12636
3143.9D18309746m7722n71671p57370q45260n44892j07307m85764j054534p46613l22418
3153.5D12826195m65241n58929m32358n61142r41276p88002q17986p66640n64270r03473
3163.1D06026878p36656l97377k67753l98980n28450m57687l42217m42848j103706
$$ plain form
3098.5 444711761 444608841 444243431 443438339 442597198 441982727 441609955 441410065 440943451 440136757 439681969
3108.2 439681969 439354324 438944855 438374939 437828217 437680054 437207031 436446457 435363197 434553566
3116.9 434553566 434494438 434140244 433264236 432419395 432119598 431269150 429987106 429729919 429759865 429249039
3126.5 429249039 428216667 427257729 426559067 425897598 425310173 425042191 424618607 423802986 423617630
3135.2 423617630 423505821 423127441 422774811 421982803 420881767 420068016 419550819 418722382 418309746
3143.9 418309746 418262024 417690353 416932983 416087723 415542831 415435524 414949760 413895226 413148613 412826195
3153.5 412826195 412360954 411802025 411369667 410808525 409867249 409079247 408261261 407494621 406930351 406026878
3163.1 406026878 405290222 404892845 404625092 404226112 403697662 403239975 402897758 402454910 401351204
3171.8D01351204r19342m57268n79910p81441o99196l76091m95796l83377m46701o51779
3181.5C95560303m49448m90646q79402j089287o41289m55589m60358n16052p60994
3190.1C89817238o00891k65847k48107m94194q23479j091843n38597l74451k53448
3198.8C85126381J87225m85573p42607p91931n41954m43573q55713n24864o40793m55475
3208.5C79831123l64875o23360m69093l07770M806m31595p57064n71671m40178m91791
3218.1C75378532m77523m64440q25424o03600o05239n41039l52096l17727p1716m47273
3227.8C70672455o62918q44536o32668q888j01089o40869p00455n6076l64685r07822
3237.4C65752449q03986m60281j68838j99738k03934n71556l82347j63231k82898l92837
$$ plain form
3171.8 401351204 400431862 399974594 399394684 398613243 397914047 397537956 397042160 396658783 396212082 395560303
3181.5 395560303 395110855 394620209 393740807 392651520 392010231 391554642 391094284 390578232 389817238
3190.1 389817238 389216347 388950500 388702393 388208199 387384720 386292877 385754280 385379829 385126381
3198.8 385126381 385313606 384828033 384085426 383293495 382751541 382307968 381452255 380927391 380286598 379831123
3208.5 379831123 379466248 378842888 378373795 378066025 378070831 377639236 376882172 376310501 375870323 375378532
3218.1 375378532 374901009 374436569 373611145 373007545 372402306 371861267 371509171 371191444 371119728 370672455
3227.8 370672455 370009537 369165001 368532333 368523445 368422356 367781487 367081032 367024956 366660271 365752449
3237.4 365752449 364948463 364488182 364319344 364119606 363915672 363344116 362961769 362798538 362515640 362122803
3247C62122803q91419o20689n47104n46722k12441m94003m07295q0414j23215k76184
3256.7C57923317l64227m57726n90668o63223o86722k42462K88277k61917p83844m80156
3266.3C53680649k72141M7608k24572l06358J6976m52652n54505o46057l65639l83491
3276C50539818q15582r270J82762j88026n42031n17616m4441l86429n87654j46141
3285.6C47485390K9030m23966l97377j69105k74811j05973m66651m16451J06773j49231
3295.3C45217628l65867l44582n57441p81098o47468k47040j16539j5984L05100j59073
3304.9C42287636o51589n02205l71170k80761m70124k09388j3810k81639m87213n36957
3314.6C38482780j06315m21066q77724o27365k03858o6948p43713j096344n60303M09088
$$ plain form
3247 362122803 361231384 360610695 360063591 359516869 359304428 358810425 358403130 358322716 358199501 357923317
3256.7 357923317 357559090 357101364 356510696 355847473 355160751 354918289 355206566 354944649 354160805 353680649
3266.3 353680649 353408508 353456116 353231544 352925186 352942162 352489510 351935005 351288948 350923309 350539818
3276 350539818 349724236 349714966 349897728 349709702 349167671 348650055 348605614 348219185 347631531 347485390
3285.6 347485390 347514420 347090454 346693077 346523972 346249161 346143188 345676537 345260086 345366859 345217628
3295.3 345217628 344851761 344507179 343949738 343168640 342521172 342274132 342157593 342141609 342446709 342287636
3304.9 342287636 341636047 341133842 340762672 340481911 340011787 339802399 339788589 339506950 339019737 338482780
3314.6 338482780 338376465 337955399 337077675 336450310 336246452 336179504 335435791 334339447 333779144 334188232
3324.2C34188232K17896r09233j055489n55725k40097m93431m95758n70869q35038
3332.9C29250488o32133j50223J33858q57125q19397J15662l39279n67513l22532m85840
3342.5C25325966q65936o00167o79512j105194m79584o3972J19324M3258k53563l42903
3352.2C21097717o38084o10809m40045k53105l49941l58029J5984m29745o22082k77748
3361.8C17134113n36518m56486k41718l76663j28479l834l63579p93533k92282L04337
3371.4C14245358n48459o13212k32201n11284M7360K39677n8365j47724k63634j84707
3381.1C11972809j43051o77662j116142l605L80687j36661J59073o9046j36757j12534
3390.7C10117111l61118n64118l67317L32318M5147j04065j87569k39716K98081N4207
$$ plain form
3324.2 334188232 334406128 333496895 332441406 331885681 331645584 331152153 330656395 330085526 329250488
3332.9 329250488 328618355 328468132 328601990 327744865 326925468 327041130 326701851 326134338 325811806 325325966
3342.5 325325966 324460030 323859863 323180351 322075157 321595573 321531601 321650925 321694183 321440620 321097717
3352.2 321097717 320459633 319848824 319408779 319155674 318805733 318447704 318463688 318033943 317411861 317134113
3361.8 317134113 316597595 316141109 315899391 315522728 315394249 315390415 315026836 314233303 313941021 314245358
3371.4 314245358 313696899 313083687 312851486 312340202 312387562 312627239 312568874 312421150 312157516 311972809
3381.1 311972809 311829758 311152096 310035954 310032349 310413036 310276375 310435448 310366402 310229645 310117111
3390.7 310117111 309755993 309191875 308824558 309156876 309202023 309097958 308910389 308670673 308968754 309022961
3400.4C09022961m39930n43289L91693K11963n55248K63004n5866r308K62223l13397
3410C08234806j85680j60256J83048J96076j3619j81293k32067K44789o924j09100
3419.7C07969780j1902J77422N46302L42579m57l7461K95887J11599K7580K37294J13640
3430.3C09772263J4801J29489Q10872R17644J16406l67947l9425M12903M35219K41890
3439.9C12444115L05748L51162q965M71630M36897N61009R85660l88488l3894R01642
3449.6C16026516R64966M11796o21624O7120Q55484R61037O70719N28030K55623k09885
3459.2C19909782L03345K06185M34684O52237P68852J378937M24805j9913Q50983R50622
3468.8C25860519M55704M96903P38563O18019O18248L90549L43399O95953O37589L22304
$$ plain form
3400.4 309022961 308583031 308039742 308431435 308643398 308088150 308351154 308295288 308285980 308548203 308234806
3410 308234806 308049126 307888870 308071918 308267994 308254375 308073082 307841015 308085804 308078880 307969780
3419.7 307969780 307957878 308135300 308681602 309024181 309023724 308986263 309282150 309393749 309421329 309658623 309772263
3430.3 309772263 309787064 309916553 310727425 311645069 311761475 311393528 311354103 311767006 312202225 312444115
3439.9 312444115 312749863 313101025 313092060 313563690 314000587 314561596 315547256 315158768 315124874 316026516
3449.6 316026516 316991482 317403278 316781654 316848774 317704258 318665295 319336014 319864044 320119667 319909782
3459.2 319909782 320213127 320419312 320853996 321506233 322275085 323654022 324078827 324058914 324909897 325860519
3468.8 325860519 326316223 326813126 327551689 328169708 328787956 329178505 329521904 330217857 330855446 331177750
3478.5C31177750P48481R93958M96330Q3504J40953J352043J294899L98369O77986
3487.2C37364273P06062O14624N11551O65818R08203Q50448O79550O56472P30591K21481
3496.8C43909073O44188J189117N32456M01191J359558J106682j72958J37787P77511
3505.5C49884605J229592P95440O18859J161728Q99658J234245P95593K78473P27616
3514.2C57625809J048774J013909P26509J067848O72875N8288O32973J495628J010056
3522.9C65352669O4201J046448J559563J052780M19426M11186O93664J355591J324349
3531.5C73279877Q69446R81941O08749J866951J163406j75628J255073R00536J113663
3540.2C81864014J410331J570168J062584J084480J597023K73132J027871J70517J037712
$$ plain form
3478.5 331177750 331926231 332920189 333416519 333500023 333640976 334993019 336287918 336686287 337364273
3487.2 337364273 338070335 338684959 339196510 339862328 340770531 341620979 342300529 342957001 343687592 343909073
3496.8 343909073 344553261 345742378 346274834 346676025 348035583 349142265 348969307 349107094 349884605
3505.5 349884605 351114197 351909637 352528496 353690224 354589882 355824127 356619720 356898193 357625809
3514.2 357625809 358674583 359688492 360415001 361482849 362155724 362214012 362846985 364342613 365352669
3522.9 365352669 365416870 366463318 368022881 369075661 369495087 369906273 370599937 371955528 373279877
3531.5 373279877 374149323 375131264 375740013 377606964 378770370 378594742 379849815 380750351 381864014
3540.2 381864014 383274345 384844513 385907097 386991577 388588600 388861732 389889603 390060120 391097832
3548.9C91097832J610946J420098K271156j68037J255188J387519R32541J800804Q26912
3557.6D02434959J671639R10911J091767J176224J680984J584969N57479L512040Q61129
3566.2D15482101k57949M37431j45111L424148J989174J399308J550254J677514J415100
3574.9D26971970J231193K042008P26852K106323J511650R70192K005577J214943J191635
3583.6D39972343J018296L985061K450333r40437J866798o03104K173462L094368K561112
3592.3D55578232J038246Q08372L778229Q9493J563149L088798J090622K327042N87196
3601D69949379J249237K342911J969681K154884K475319K432327o98357K847786O95916
3609.6D85419083n49736O975517K133636k405433L654442L44200L266487M583130J107902
$$ plain form
3548.9 391097832 392708778 394128876 396400032 396231995 397487183 398874702 399807243 401608047 402434959
3557.6 402434959 404106598 405017509 406109276 407285500 408966484 410551453 411108932 414620972 415482101
3566.2 415482101 415224152 415661583 415516472 418940620 420929794 422329102 423879356 425556870 426971970
3574.9 426971970 428203163 430245171 430972023 433078346 434589996 435560188 437565765 438780708 439972343
3583.6 439972343 440990639 444975700 447426033 446485596 448352394 447749290 449922752 453017120 455578232
3592.3 455578232 456616478 457424850 461203079 461292572 462855721 465944519 467035141 469362183 469949379
3601 469949379 471198616 473541527 475511208 477666092 480141411 482573738 481875381 484723167 485419083
3609.6 485419083 484869347 491844864 493978500 491573067 495227509 495571709 498838196 503421326 504529228
3618.3E04529228K049256l16697J275826L579216K167473J664848K180290K321244
3626E19450684L377914O984177P14225j0299377L270035N021515O075668K711220j210213
3634.7E36095848K353134L292046K658691O46096J557464K865601K281494J646843
3642.4E53397217J333275K491760L032379N303536J108970k110061O008529J522560
3650.1E72088165l046035k093125M506493M327736L776855O096726o812706L80745
3657.9E79224854N555381K095490K797508J119919J903343J092796R16443J683846
3665.6E96389580N12733M271622K792664k23351J098518o714515J441765P978706R615898
3674.3F17163620K363892j6679078P14570P008934M826011j998367l74642K543412
$$ plain form
3618.3 504529228 506578484 506261787 507537613 511116829 513284302 514949150 517129440 519450684
3626 519450684 522828598 529812775 530527000 520227623 523497658 528519173 534594841 537306061 536095848
3634.7 536095848 538448982 541741028 544399719 545045815 546603279 549468880 551750374 553397217
3642.4 553397217 554730492 557222252 560254631 565558167 566667137 564557076 570565605 572088165
3650.1 572088165 569042130 566949005 571455498 575783234 579560089 585656815 578844109 579224854
3657.9 579224854 584780235 586875725 589673233 590793152 592696495 593789291 594705734 596389580
3665.6 596389580 596902313 601173935 603966599 603743248 604841766 598127251 599569016 607547722 617163620
3674.3 617163620 619527512 602848434 603563004 610571938 615397949 613399582 613024940 615568352
3682F15568352K042885J741333R9334K60659L806495O388321o847610m786187Q451272
3690.6F26724854l474274j847992M883003J185990J509857K20794l15475J206512L51868
3699.3F30445137K525635K893295m951630k650489M388923J594734k37312j23672K674331
3708F36558952N538292o443176K333336N790443j3032150K279854M368973N35049M12903
3716.7F38342476J798286J348191k852478J164589O127586k881394o084213M322815
3724.4F41285858K183151J05439k674179o62156L693619J235047N812072k272110q645553
3733.1F40061188Q839798P16324r941025J213531K921295j66473J327667L040009l298798
3741.8F44713516K102585J1456375p173767j8318863R057999O017837O194382j828918
$$ plain form
3682 615568352 617611237 619352570 619451904 619712563 623519058 629907379 623059769 618273582 626724854
3690.6 626724854 623250580 621402588 626285591 627471581 628981438 629202232 628886757 630093269 630445137
3699.3 630445137 632970772 635864067 630912437 628261948 632650871 634245605 634008293 633884621 636558952
3708 636558952 642097244 635654068 637987404 643777847 630745697 633025551 637394524 637929573 638342476
3716.7 638342476 640140762 641488953 638636475 639801064 645928650 643047256 636963043 641285858
3724.4 641285858 643469009 643574448 640900269 640238113 643931732 645166779 650978851 648706741 640061188
3733.1 640061188 648900986 649617310 639676285 640889816 643811111 643644638 644972305 648012314 644713516
3741.8 644713516 646816101 658272476 651098709 632779846 641837845 647855682 654050064 652221146
3749.5F52221146j0716706J1407700k920990r683075M980316L947373K914123m533539
3757.2F47616348K029572N403518p570343j957168M115982J462402L19748L341599
3764.9F54761658k478485n061951L306808N949479J911926r531326J91726L079987
3772.6F52129822k1591P18917p4920J055603P9193K120514Q79898p021408J905365
3781.3F51771393K211685Q71887K417221k515259j048965Q58154q6898P01980L41416
3790F55522614L29895M882k90298j062698Q50143L246765l672409m444885K454910
3798.7F52938919M760819O496200n223389j1755752L028259K770462M368973P003326
3806.4F64387817q000488o683655M492035K713852J75171k87094l08991J283036N888595
$$ plain form
3749.5 652221146 641504440 652912140 649991150 640308075 645288391 649235764 652149887 647616348
3757.2 647616348 649645920 655049438 647479095 645521927 649637909 651100311 651420059 654761658
3764.9 654761658 652283173 647221222 650528030 656477509 658389435 648858109 649049835 652129822
3772.6 652129822 652108231 652827148 652752228 653807831 653887024 656007538 656887436 649866028 651771393
3781.3 651771393 653983078 654854965 657272186 654756927 653707962 654566116 654479218 655181198 655522614
3790 655522614 655852509 655857391 655567093 654504395 655354538 658601303 654928894 650484009 652938919
3798.7 652938919 657699738 664195938 658972549 647216797 650245056 653015518 657384491 664387817
3806.4 664387817 656387329 649703674 654195709 656909561 657084732 656797638 656488647 657771683 663660278
3815.1F63660278J72348j4682769L052444N551682N067062K994690j6388474K59018
3822.8F49686279M850998J862946K719726r2392m606857L0289K237701L432770J513901
3831.4F61635361r038925J905899P832489m803543j777268P502365o930237n655746
3839.2F50670395O293793m510956P66830Q005524j651611m475174J980362J135559
3846.9F58214722k63443J921997n37262J192245N446244n026093J873016j4878158
3854.6F47943268j620255J1335907J43128k858658J939011K687301K742920n331802
3862.3F56980820K365P051391n109863o211166K957535M291381O210404n798493j0241088
3871F50133286L300094O829910M475174j0142898j085816M012070L77121K270432M604415
$$ plain form
3815.1 663660278 663832626 649149857 652202301 657753983 662821045 665815735 649427261 649686279
3822.8 649686279 654537277 656400223 659119949 659027557 654420700 654450989 656688690 660121460 661635361
3831.4 661635361 652596436 654502335 662334824 657531281 655754013 663256378 656326141 650670395
3839.2 650670395 656964188 652453232 653220062 661225586 659573975 655098801 657079163 658214722
3846.9 658214722 657951279 659873276 659336014 660528259 665974503 660948410 662821426 647943268
3854.6 647943268 646323013 657658920 657802048 654943390 656882401 659569702 662312622 656980820
3862.3 656980820 656983185 664034576 658924713 652713547 655671082 659962463 666172867 660374374 650133286
3871 650133286 653433380 660263290 664738464 654595566 653509750 657521820 657898941 660169373 664773788
3879.7F64773788n196151q256226N220337J570587J931763N486755j2880630o9275
3887.4F52580948M034424J046829M914169O00281q311310k42309L018188j032715J211319
3896.1F57819824N49088K071228L313293r738617L740921K111435o237411M387588
3903.8F58017349k252807j551743P9117N12924K416000L7384M21753J82343J95999
3912.5F58058319j97906n68161J166839K464600k048874m132233L305359m52347m133606
3921.1F53461990K432862K124252J133041j455078k765655P84225J346131J048736
3928.8F58110504j246719j56327K379609k299805k268295J449585Q73642Q57315K90527
3937.5F57990036j301651m41208J44425J375732R44214l628693m22897J694260J270599
$$ plain form
3879.7 664773788 659577637 651321411 656541748 658112335 660044098 665530853 652650223 652580948
3887.4 652580948 656615372 657662201 662576370 663176651 654865341 654623032 657641220 656608505 657819824
3896.1 657819824 658368912 660440140 663753433 654014816 657755737 659867172 653629761 658017349
3903.8 658017349 655764542 654212799 654291916 654804840 657220840 657258224 657679977 657862320 658058319
3912.5 658058319 657860413 657292252 658459091 660923691 658874817 654742584 658047943 657595596 653461990
3921.1 653461990 655894852 658019104 659152145 657697067 654931412 655715637 657061768 658110504
3928.8 658110504 656863785 656707458 659087067 656787262 654518967 655968552 656842194 657699509 657990036
3937.5 657990036 656688385 656247177 656391602 657767334 658711548 655082855 654659958 656354218 657624817
3946.2F57624817J203918k988205l1280Q18558k417298J651917J440353p28531o93741
3954.9F55880508m9057M06647n49164J4191j82800Q95614P81174j365128R5292M51583
3964.5F56378860j36413j62735m68674P0114M9363Q2016Q53271k98004r93500j92566
3974.2F55181732k21100Q76007M94767l54081L02124N0202L75976J12915j041870o02722
3983.8F55173950O45447J56403m31138K39869P28073Q83713n65110j077728k06223
3992.5F55547256M91410O28280j94625J6784l14636n58167l21121J39923
4000.2F55435104
$$ plain form
3946.2 657624817 658828735 655840530 655809250 656627808 654210510 655862427 657302780 656574249 655880508
3954.9 655880508 655831451 656238098 655688934 655703125 655520325 656415939 657197113 655831985 655927277 656378860
3964.5 656378860 656242447 656079712 655611038 655681152 655730515 655812531 656665802 656367798 655374298 655181732
3974.2 655181732 654960632 655836639 656331406 655977325 656279449 656329651 656705627 656818542 655776672 655173950
3983.8 655173950 655819397 655975800 655544662 655784531 656512604 657396317 656831207 655753479 655547256
3992.5 655547256 656038666 656666946 656472321 656489105 656174469 655616302 655295181 655435104
4000.2 655435104
##END=$$ End of the data block
