##TITLE=$$ Begin of the data block
##JCAMP-DX=5.00 $$ ACD/SpecManager v 10.08
##SPECTROMETER/DATA SYSTEM=Varian
##DATE=14 Jan 2013 10:50:16
##DATA TYPE=INFRARED SPECTRUM
##DATA CLASS=XYDATA
##ORIGIN=
##OWNER=
##NPOINTS=3735
##FIRSTX=399.26403809
##LASTX=4000.35498047
##MAXX=4000.35498047
##MINX=399.26403809
##MAXY=67.60404205
##MINY=18.63837624
##XFACTOR=1.0000000000
##YFACTOR=0.000000100000000
##FIRSTY=38.38922882
##DELTAX=0.96440572
##XUNITS=1/CM
##YUNITS=TRANSMITTANCE
##XYDATA=(X++(Y..Y))
399.3C83892288J0932923P772903p392349o772652l68271P997322J1138993Q41713
407D08042870r421769m105491o162567j723252M917870k577210K509804K587433n300560
415.7C88767128k239456J297111N974007M647446j996155n946274l417816L397140
423.4C90483131l941001j270676N573959j239776o50025L006592K029076j378289l386497
432.1C89226494l97034j424370j488304J584282L318176M389954K891846k286263n936584
440.7C89878197l73383J663895k851525M20609J003838J51748l898239l650284K153435
449.4C84498291J794891L851662J887245j645698N79414k698173r30062j377601m906426
458.1C81053543J600151J133118K367325Q5754j266365l086052k883491M132461j296272
$$ y = [383892288, 394825211, 402598114, 395205765, 388433113, 388064842, 396062164, 407201157, 408042870, 398621101, 394515610, 388353043, 386629791, 391547661, 388970451, 391480255, 394067688, 388767128, 386527672, 387824783, 393798790, 398446236, 396450081, 390503807, 387085991, 390483131, 386542130, 385271454, 390845413, 389605637, 388955612, 391962204, 393991280, 392612991, 389226494, 388829460, 387405090, 385916786, 387501068, 390819244, 395209198, 398101044, 395814781, 389878197, 389504814, 391168709, 388317184, 388737793, 389741631, 389893379, 385995140, 382344856, 384498291, 386293182, 390144844, 392032089, 390386391, 390965805, 388267632, 387337570, 385959969, 381053543, 382653694, 383786812, 386154137, 386239891, 384973526, 381887474, 379003983, 383136444, 381840172]
466.8C81840172k671890J854705j805076L02505K291565K710839j39084j885987J33362
475.5C82631111l175773k860260K501869L70712L14026K896614k163582m473190k503205
484.1C73538322J663819L78265o804428k424202K360001K22130p98226r4681J969834
492.8C70010834K002640K377395J879692j063804j546517q39004r94416j722374k086830
501.5C68017616P41577L922844P47338l032837l057480k4414K083816o56471l175049
510.2C65566940j396789J578102M89998j087380O4888l79524r59892j48278r84420
518.9C62743645k555428o91719M83132m12140R98230J208419p11364k265244r96208
527.5C57801323K96745K60124P36847l69148q98323J012650R06295K63863K47383k081947
$$ y = [381840172, 379168282, 381022987, 379217911, 379520416, 381811981, 384522820, 384383736, 382497749, 382631111, 379455338, 376595078, 379096947, 379467659, 379781685, 382678299, 380514717, 376041527, 373538322, 375202141, 375580406, 368775978, 366351776, 368711777, 368933907, 368135681, 368041000, 370010834, 372013474, 374390869, 376270561, 375206757, 373660240, 372821236, 371826820, 370104446, 368017616, 368759193, 372682037, 373429375, 370396538, 367339058, 367314644, 369398460, 368741989, 365566940, 364170151, 365748253, 366238251, 365150871, 365215759, 364836235, 363876343, 363728065, 362743645, 360188217, 359496498, 359979630, 359567490, 360565720, 361774139, 361062775, 358797531, 357801323, 358098068, 358358192, 359095039, 358725891, 357827568, 358840218, 359746513, 360010376, 360257759, 358175812]
537.2C58175812k798615j048469l22953M3946M1847O41747N07125k8534m64859j622581
546.8C53124466o10657q51249j678391k82288j12838j816559p02896K118644R7466
555.5C49285698m11224j65940k152862k056122n06821J639023K09007L54348J252288
564.2C47447395k11982J098213K73208m94117J35650l23257q6098j684532j004753
572.9C45149727J720505J145820r56459j635170j519432o10733J571312Q87642j443939
581.5C44309273j040955O12450J127243J97105n8365J87645K49901r0751r88923K60430
591.2C44765053J139869R9411J611329J732254J37863l71208q19283n8632j08108j59035
600.8C47969513M35829j82152m6234p05871j951638q63151J50299l12576q44040q82454
$$ y = [358175812, 355377197, 354328728, 354005775, 354049721, 354091568, 354733315, 355240440, 355211906, 354747047, 353124466, 352513809, 351662560, 349984169, 349701881, 349589043, 347772484, 347069588, 349188232, 349285698, 348874474, 348708534, 346555672, 344499550, 343992729, 345631752, 345840759, 346195107, 347447395, 347235413, 348333626, 348606834, 348112717, 348248367, 347925110, 347839012, 346154480, 345149727, 346870232, 348016052, 347059593, 345424423, 343904991, 343294258, 344865570, 345753212, 344309273, 343268318, 343880768, 345008011, 345205116, 345146751, 345334396, 345584297, 345493546, 344504623, 344765053, 345904922, 346004333, 347615662, 349347916, 349485779, 349114571, 348295288, 348236656, 348128548, 347969513, 348405342, 348223190, 348176956, 347471085, 345519447, 344656296, 344806595, 344494019, 343649979, 342767525]
610.5C42767525M50554Q91914r01833o70127k01302j397400j183815L58429J672058
619.2C41786003Q24318j297O24123L17650R93461J595001K50626R75037J348953K30141
628.8C48944016L7345O15921K261048K398605K111168J465187K41089J165504J623688
637.5C60863571P14874j0185O57730J585846K182541J698609N64117O38123K83622
646.2C69178848R76258N33027n63354J360512K326431J362762J102486J800575L13530
654.8C78391075q42476n75256r38835n52483l13225M2343l35235j080246N12466J168175
664.5C75476303K47574M49867J312599J699181j755180j396981Q89969J604614M29459
673.2C78957405R76868P68051J253395J682472M57421L41682M84848R01718R26895
$$ y = [342767525, 343218079, 344109993, 343208160, 342538033, 342336731, 340939331, 339755516, 340113945, 341786003, 342610321, 342609024, 343233147, 343550797, 344544258, 346139259, 346389885, 347364922, 348713875, 348944016, 348981361, 349597282, 351858330, 354256935, 356368103, 357833290, 358074379, 359239883, 360863571, 361578445, 361568260, 362225990, 363811836, 365994377, 367692986, 368257103, 368895226, 369178848, 370155106, 370688133, 370124779, 371485291, 373811722, 375174484, 376276970, 378077545, 378391075, 377548599, 376973343, 376034508, 375482025, 375168800, 375211143, 374875908, 373795662, 374308128, 375476303, 375723877, 376173744, 377486343, 379185524, 377430344, 376033363, 376923332, 378527946, 378957405, 379934273, 380702324, 381955719, 383638191, 384095612, 384437294, 384922142, 385823860, 386750755]
681.8C86750755J028138J734199J522141J076393K55432M37088J949539J636047O49224
690.5C97038956O39457P5837K9182J263504J059952O2866N74455J78109p4883Q36449
700.2D01683884M05426L44200O80961J238862J299133N29098Q32787M80575O77147
708.8D08172073R45969n9700j31683Q27217J410217N24025M96559J164246P27806P72133
718.5D14848862J413574O47812J64184N84679l79372O28624J747170R02443O3972k9526
728.1D20592422J665116J615867R47190K51198k20108P87849L87497O66771R43756
736.8D27637558J57471N68618J941567J476517m34342q00514j26915P43561L04260
745.5D31467781N79147J041031R50699P38373m76341L93943J017075J533089R34257
$$ y = [386750755, 387778893, 389513092, 391035233, 392111626, 392367058, 392804146, 394753685, 396389732, 397038956, 397678413, 397754250, 397783432, 399046936, 400106888, 400169754, 400744209, 400922318, 400847435, 401683884, 402089310, 402433510, 403114471, 404353333, 405652466, 406181564, 407014351, 407494926, 408172073, 409118042, 409058342, 408926659, 409753876, 411164093, 411688118, 412184677, 413348923, 414076729, 414848862, 416262436, 416910248, 417074432, 417659111, 417279739, 417908363, 419655533, 420557976, 420621948, 420592422, 422257538, 423873405, 424820595, 425071793, 424851685, 425639534, 426027031, 426693802, 427637558, 427795029, 428363647, 430305214, 431781731, 431347389, 430546875, 430419960, 431163521, 431467781, 432046928, 433087959, 434038658, 434777031, 434300690, 434694633, 435711708, 437244797, 438179054]
754.2D38179054l15780J771621K052574J299210J207199P10106R03092J008186l9635
762.8D46775627J10245J769295J025734M82482M43917j01624k96554N48973R99946
771.5D51758041j22947K39143k50206K23312J39122q79020N84144K17171K17590N71251
781.2D52697601L53737l28064l52630O10580M83589J528511M82369L6239P40471p0152
790.8D56182251j98975q03413K16866O20765J74370O16646j77231j222115r05304o74552
800.5D53829308j023484m30259j357651j776886p71561m34303q41560j593018j919289
809.1D43681297k570724j717186j026840p03469j095733j631394k68287r34220n96199
817.8D33137245M24957m90226o30875N3787J023865J801567L078499K621498J876144
$$ y = [438179054, 437863274, 439634895, 441687469, 442986679, 444193878, 444903984, 445807076, 446815262, 446775627, 446885872, 448655167, 449680901, 450163383, 450607300, 450505676, 450209122, 450758095, 451758041, 451635094, 451874237, 451624031, 451847343, 451986465, 451107445, 451691589, 451908760, 452126350, 452697601, 453051338, 452723274, 452370644, 452981224, 453464813, 454993324, 455475693, 455511932, 456252403, 456182251, 455983276, 455179863, 455396729, 456017494, 456191864, 456808510, 456631279, 455409164, 454503860, 453829308, 452805824, 452375565, 451017914, 449241028, 448469467, 448035164, 447193604, 445600586, 443681297, 441110573, 439393387, 438366547, 437663078, 436567345, 434935951, 434667664, 433733444, 433137245, 433562202, 433071976, 432441101, 432494888, 433518753, 435320320, 438398819, 441020317, 442896461]
826.5D42896461K588349K630958K637978K861900K880440J629639J892814K273865
834.2D62292404K802468L361969J839485K450676K593650J540642L50418R46579K066880
842.9D80245171J711692J910477R73969J658325J531601J407928J175499j47018Q32901
851.6D91300545M37736O07186J184005K205429K210885J467285J647834Q60939J891404
860.3E03813248J066360N78232M03633l26538L4981o33545k13394p10335j97334k35672
869.9E03579636j307221j632500j867790j195831j394692k02140k08283j112938j274910
878.6D93383331j067085j02615m41056j025352j794167o04934n63431p23457L30619
887.3D87391853q61168o67915m00047r3231o25229j317978q1482L66897N57785N74723
$$ y = [442896461, 445484810, 448115768, 450753746, 453615646, 456496086, 458125725, 460018539, 462292404, 465094872, 468456841, 470296326, 472747002, 475340652, 476881294, 477231712, 478178291, 480245171, 481956863, 483867340, 484841309, 486499634, 488031235, 489439163, 490614662, 490467644, 491300545, 491738281, 492345467, 493529472, 495734901, 497945786, 499413071, 501060905, 501921844, 503813248, 504879608, 505457840, 505861473, 505534935, 505569916, 504936371, 504722977, 504012642, 503815308, 503579636, 502272415, 500639915, 498772125, 497576294, 496181602, 495979462, 495771179, 494658241, 493383331, 492316246, 492213631, 491772575, 490747223, 488953056, 488348122, 487784691, 487061234, 487391853, 486530685, 485862770, 485462723, 485369492, 484744263, 483426285, 483344803, 483711700, 484269485, 484844208]
896.9D84844208O08063K32849J08986m43383p68203p71294l44925J897964J965523
905.6D87329788K359085K420769J050415J136208J716766J731758L0937j70631n90630
914.3D97014465r11598j427765k031898j111717k077103k015228k056466k397880l153534
922.9D79831276l245087j880417k330017k493896l119850k691346k975311l298111
930.7D57797241j639442j869393k382354k275086q20846m36592j033593j509971j802483
939.3D44027481l06587r14726j714592j864434j550750m71917r54284j302834r26246
948D34021111L62319J64452j400337j514282l17307K10266r42573j514778j854249
956.7D27214622j779785j812553j989594k576866k845115j331673j784706k023125
$$ y = [484844208, 485452271, 485685120, 485794106, 485350723, 484582520, 483811226, 483466301, 485364265, 487329788, 489688873, 492109642, 493160057, 494296265, 496013031, 497744789, 497775726, 497605095, 497014465, 496102867, 494675102, 492643204, 491531487, 489454384, 487439156, 485382690, 482984810, 479831276, 476586189, 474705772, 472375755, 469881859, 466762009, 464070663, 461095352, 457797241, 456157799, 454288406, 451906052, 449630966, 448810120, 448373528, 447339935, 445829964, 444027481, 443720894, 442806168, 441091576, 439227142, 437676392, 437204475, 436250191, 434947357, 434021111, 434383430, 434547882, 433147545, 431633263, 431315956, 431526222, 430583649, 429068871, 427214622, 425434837, 423622284, 421632690, 419055824, 416210709, 414879036, 413094330, 411071205]
964.4D11071205j443138k105637j837921k016334k255936j401405j574784k828102
972.1C95607948l257370k654457k331390k935639l113212l748627m724121m093285
979.8C68749847l835601m031067m553223n333900n255242m125061l515587m236145
987.6C33864021l938217l398628l468933l164082l092689l555641l287812k716598
995.3C07241421k312145k641621k959576j657905k185231l514461l052750k168045
1003B86749687k242679k566033k332134k649612k031689j384678q52184j659546k705975
1011.7B68325157j737728j400928r98211j845837k307434k374859k060089j228619
1019.4B54371452k477054k472801k432862j431541j131516k085819j476841j455898
$$ y = [411071205, 409628067, 407522430, 405684509, 403668175, 401412239, 400010834, 398436050, 395607948, 392350578, 389696121, 387364731, 384429092, 381315880, 377567253, 372843132, 368749847, 364914246, 360883179, 356329956, 350996056, 345740814, 341615753, 338100166, 333864021, 329925804, 326527176, 323058243, 319894161, 316801472, 313245831, 309958019, 307241421, 304929276, 302287655, 299328079, 297670174, 295484943, 291970482, 288917732, 286749687, 284507008, 281940975, 279608841, 276959229, 274927540, 273542862, 272690678, 271031132, 268325157, 266587429, 265186501, 264188290, 262342453, 260035019, 257660160, 255600071, 254371452, 251894398, 249421597, 246988735, 245557194, 244425678, 242339859, 240863018, 239407120]
1027.1B39407120j336155j632824q55827q43430n97363n44414j375446J66301O39363
1035.8B33027325J378822R20277N01308J160088J420078J457100P32517J578732R83925
1044.5B43160172L8032j121044n53551P83196p84664p76902p54184l55320j152764
1053.1B38482971j517925j092453j371555j28479j134148n01080K09408L01476J527309
1061.8B34775524K474747K180958O75277J749592J324654J325035J090889K23274M17843
1070.5B46237793K11735J372127R45778P83234n26447k10267J450043O31848M45823
1079.2B51341667l86219P96032Q43392J119766J706524N84507M53930M70104K184791
1087.9B59114494R46141M29954J546955J946488K375621J175175J549301O39973N56507
$$ y = [239407120, 238070965, 236438141, 235582314, 234738884, 234141521, 233597107, 232221661, 232387962, 233027325, 234406147, 235326424, 235827732, 236987820, 238407898, 239864998, 240597515, 242176247, 243160172, 243198204, 242077160, 241523609, 242306805, 241522141, 240745239, 239991055, 239635735, 238482971, 236965046, 235872593, 234501038, 234372559, 233238411, 232737331, 232946739, 233248215, 234775524, 237250271, 239431229, 240106506, 241856098, 243180752, 244505787, 245596676, 245819950, 246237793, 246449528, 247821655, 248767433, 249550667, 249024220, 248813953, 250263996, 250895844, 251341667, 250955448, 251751480, 252594872, 253714638, 255421162, 256005669, 256459599, 256929703, 259114494, 260060635, 260490589, 262037544, 263984032, 266359653, 267534828, 269084129, 269724102, 270280609]
1096.5B70280609J226788J108780J229820P98244J088791J185074K326927J802235
1104.2B81047268J726417J800614J032753R97829o36978J56098O67457P33662J299877
1112.9B88824997J188202J405201M12407P25956M72336O3476k50702m12865K88277
1121.6B92717285j0795P84359J013450P97825K57931Q2359O95725J424999K077522
1130.3B99840660J504727K120056J551208J189442K145767K574673K551498J571160
1138C15049191J760921J566105J260071M88338J59760J604347J381721R15986P80906
1146.7C24967346N60532L24402K25525K46009J30845O42433Q6097k89802J2092l08265
1156.3C26597214l31192k98806q08944j010971l96385p515O48040O44493Q07457J435128
$$ y = [270280609, 271507397, 272616177, 273845997, 274644241, 275733032, 276918106, 279245033, 281047268, 282773685, 284574299, 285607052, 286604881, 285967903, 286124001, 286791458, 287525120, 288824997, 290013199, 291418400, 291830807, 292556763, 293029099, 293092575, 292841873, 292429008, 292717285, 292706490, 293490849, 294504299, 295302124, 295560055, 295642414, 296338139, 297763138, 299840660, 301345387, 303465443, 305016651, 306206093, 308351860, 310926533, 313478031, 315049191, 316810112, 318376217, 319636288, 320124626, 320284386, 321888733, 323270454, 324186440, 324967346, 325527878, 325852280, 326077805, 326323814, 326454659, 327097092, 327183189, 326893387, 326905479, 326597214, 326266022, 325967216, 325158272, 324147301, 323750916, 323743401, 324391441, 325035934, 325843391, 327278519]
1166C27278519J153526J982269K535210K321892K484245K750816K802468L351783L320847
1174.6C49981575K240181K269211K466736K574081K615738K438774K480240K576370
1182.4C69642906K323494K020683J669655J372567J160202O30798J117668P49550j49574
1191C80537949K66494L68576q3694k13318l08189r44100j098175j346092j286125q42171
1200.7C75051155n90057l95813j362915j618920r50126j091957j362000q77342m14810
1209.4C66387215m09317q5183l68957n77812k57569n33638q98056r41276l50990j76240
1219C61788177l90815m30641l44468j93634p77168q71544r36317j043320n95550p27005
1228.6C55477715p78161q85200o02150l15247p66067m91829k86522l53584l31726l67546
$$ y = [327278519, 328432045, 330414314, 332949524, 335271416, 337755661, 340506477, 343308945, 346660728, 349981575, 352221756, 354490967, 356957703, 359531784, 362147522, 364586296, 367066536, 369642906, 371966400, 373987083, 375656738, 377029305, 378189507, 378820305, 379937973, 380687523, 380537949, 380804443, 381173019, 381089325, 380876007, 380567818, 379623718, 378525543, 377179451, 375893326, 375051155, 374461098, 374065285, 372702370, 371083450, 370133324, 369041367, 367679367, 366802025, 366387215, 365977898, 365892715, 365523758, 364945946, 364688377, 364154739, 363256683, 362315407, 361964417, 361788177, 361397362, 360966721, 360622253, 360428619, 359651451, 358779907, 357843590, 356800270, 356204720, 355477715, 354699554, 353814354, 353212204, 352896957, 352130890, 351639061, 351352539, 350998955, 350667229, 350299683]
1238.3C50299683l86429k6169L31078j04294O9542Q125m88968n55000l91312m5662
1247.9C48710594o37893o65970J97944J13564l00675j62925k55394j63536K02827o82297
1257.6C46356239o14509L00445M70581M09165K89268P13463L12843R5787L66631M15535
1267.2C49115448O15273N17463J032219J137200Q93516Q68874P69462J130295J247253
1275.9C57327003Q63457R25179J382179J143570Q23097J199188J330338J161957J596832
1284.6C67752800J659813J507645J416778J095009J326332R60159Q75626J134415J160278
1293.3C78888855Q95843P87621J066361J77192J91193O70013O56700M93584L70750
1301.9C84198112M29230l9558P8506o2256j04255k99530L9634K86866r84497p39670
$$ y = [350299683, 349913254, 349887085, 350218163, 350113869, 350183411, 350191536, 349702568, 349147568, 348756256, 348710594, 348072701, 347406731, 347604675, 347718239, 347417564, 347254639, 346999245, 346835709, 347038536, 346356239, 345741730, 346042175, 346512756, 346921921, 347211189, 347924652, 348237495, 348333282, 348699913, 349115448, 349730721, 350248184, 351280403, 352417603, 353311119, 354179993, 354949455, 356079750, 357327003, 358190460, 359115639, 360497818, 361641388, 362464485, 363663673, 364994011, 366155968, 367752800, 369412613, 370920258, 372337036, 373432045, 374758377, 375718536, 376594162, 377728577, 378888855, 379784698, 380572319, 381638680, 381815872, 382007065, 382677078, 383333778, 383827362, 384198112, 384627342, 384587784, 384666290, 384604034, 384499779, 384200249, 384239883, 384526749, 383542252, 382802582]
1311.6C82802582m77791o51703m43230j03492J82228J36299M10118J55563O18973Q17719
1321.2C83447266P98606P61490N17807P63588J08261L65296J79672j64719j14555m46854
1330.9C86215858K05155j90048o74248n45311j49689j27640n11589Q0147J59264O6032
1340.5C84527931N37796J013985O38809N62325P35626L36990M46472J03417M10576
1349.2C89313927r8114l71971J39961p5875r231n31082j85089O4163k67067q37174
1358.8C87142448n93490l29170p05986K20413j097794l78189L57933l78380r1667p07016
1368.5C83439102n40008n95246o65207j12495K98309M55857l63465j44501k32009J03187
1378.1C81643524l26996n72700m06418q34579q82912j377373q44002m07486m16793
$$ y = [382802582, 382324791, 381673088, 381229858, 381126366, 381308594, 381444893, 381855011, 382010574, 382629547, 383447266, 384245872, 385007362, 385525169, 386288757, 386397018, 386762314, 386941986, 386777267, 386662712, 386215858, 386421013, 386230965, 385556717, 385011406, 384861717, 384734077, 384222488, 384302635, 384461899, 384527931, 385065727, 386079712, 386718521, 387280846, 388016472, 388353462, 388799934, 388903351, 389313927, 389215813, 388843842, 388983803, 388907928, 388898697, 388367615, 388182526, 388246689, 387979622, 387142448, 386548958, 386219788, 385513802, 385734215, 384636421, 384258232, 384616165, 384237785, 384146118, 383439102, 382899094, 382303848, 381638641, 381526146, 381824455, 382280312, 381916847, 381772346, 381540337, 381643524, 381316528, 380743828, 380337410, 379502831, 378619919, 377242546, 376398544, 375991058, 375574265]
1386.8C75574265j964226j711197n12276j469650j766663j811714r03473j987762l381424
1395.5C60065880j216736j537361j378822l236390k483024j016846k220459j787529
1403.2C45188713j355324k500229k420349j167183j698150j948929r59816j098557
1410.9C32040176j192474j743469j493187o46019m16069o60591r58863M45519k843971
1419.6C22531052q77495J488151L22838M99191p31544O85501J130028N47752J299439
1428.3C26894913N11284Q88710P31010J390228J194687J001587K338371K102967Q06923
1437C37860680K69432K526664J811791J360817J746673J229897J739540R17358J677094
1445.6C51139946J958351J939201R89190R57718K072792R67826J349602J310616K279243
$$ y = [375574265, 373610039, 371898842, 371386566, 369916916, 368150253, 366338539, 365435066, 363447304, 360065880, 358849144, 357311783, 355932961, 352696571, 350213547, 349196701, 346976242, 345188713, 343833389, 341333160, 338912811, 337745628, 336047478, 334098549, 333138733, 332040176, 330847702, 329104233, 327611046, 326965027, 326548958, 325888367, 324929504, 325375023, 322531052, 321653557, 323141708, 323464546, 323963737, 323232193, 323917694, 325047722, 325595474, 326894913, 327406197, 328294907, 329025917, 330416145, 331610832, 332612419, 334950790, 337053757, 337860680, 338130112, 340656776, 342468567, 343829384, 345576057, 346805954, 348545494, 349462852, 351139946, 353098297, 355037498, 356026688, 356984406, 359057198, 360025024, 361374626, 362685242, 364964485]
1454.3C64964485K042236R79424J727943j10778K824554J158676K661438J970558J066132
1463C79284668K813415J024743J588401K216568K864571K483826K757911L828278K719727
1471.7D01582108L149223J899299K724495L327103K292938K113648K755699K601318
1479.4D22445831K213974K062683J561547J729202J164932J044197J819878Q94623
1487.1D34936867L13797K229690R83887k367210n11475Q2512o17523j34163L53584
1495.8D35269966m681320m80499q16956l553276l57780q42743r07669m77105Q78220
1504.5D24030838J149521l112335m597817J65177O08062j191520N81054j123809j934815
1513.1D14574356K16942m43688N89753j630135l091736J739884K284584l50952k179795
$$ y = [364964485, 367006721, 367986145, 369714088, 369603310, 372427864, 373586540, 376247978, 378218536, 379284668, 382098083, 383122826, 384711227, 386927795, 389792366, 392276192, 395034103, 398862381, 401582108, 404731331, 406630630, 409355125, 412682228, 414975166, 417088814, 419844513, 422445831, 424659805, 426722488, 428284035, 430013237, 431178169, 432222366, 434042244, 434936867, 435250664, 437480354, 438464241, 436097031, 435585556, 435668068, 435050545, 434916382, 435269966, 430588646, 430108147, 429291191, 425737915, 425380135, 424537392, 423629723, 423152618, 424030838, 425180359, 422068024, 417470207, 417635384, 418243446, 417051926, 417632980, 416509171, 414574356, 414791298, 414347610, 414937363, 413307228, 410215492, 411955376, 414239960, 413889008, 411709213]
1521.8D11709213p08694O53038K356109j185455o78520J096382l04146Q07305J257629
1530.5D15002861R84154O06766L8414k514611Q65135J227684J277123L324356O49300
1539.2D21461182n962334N08156Q63533o87790J285858O70776k117042J291923N58815
1547.9D17873077R99070N12313j409492O11572O78444J575356k327004p95631K388191
1556.5D20105896L471107P30706j1308022j258354O88934R87664j064949j277962l005600
1565.2D08069420k521172p22351j644363k96326p818413k159767j444626l364257k767373
1573.9C85330772k508735m72603j2564392j889839k202034l701058l823890n335961
1581.6C52832260l328819n770493l483429m709930m428444m250832m884338k854118
$$ y = [411709213, 411000519, 411653557, 414009666, 412824211, 412145691, 413242073, 412937927, 413745232, 415002861, 415987015, 416593781, 416632195, 414117584, 414982719, 416210403, 417487526, 420811882, 421461182, 415498848, 416007004, 416870537, 416182747, 417468605, 418139381, 416022339, 417314262, 417873077, 418872147, 419384460, 417974968, 418586540, 419264984, 420840340, 418513336, 417717705, 420105896, 423577003, 424307709, 412999687, 411741333, 412430267, 413417931, 412352982, 411075020, 408069420, 405548248, 404825897, 403181534, 402885208, 395066795, 392907028, 391462402, 388098145, 385330772, 382822037, 382349434, 369785042, 367895203, 365693169, 361992111, 358168221, 352832260, 349503441, 343732948, 340249519, 335539589, 331111145, 326860313, 321975975, 319121857]
1589.3C19121857n485478k779064m847164l319206l561077m815064k826366m683495
1597B86804943j767654l946209k172776l091831l050556j989593l769131j035843l355236
1605.7B62626114p45583k434196j396656j361199l006591L26099k437458j90907j582565
1614.4B49797058P98740K56844n940247J761094q40283J174164j449375R27200K51179
1623.1B46736374j991024J292591m62761K272835j325894M59252O75793J143474J691227
1631.7B50491867K29435K281837L53470K014923j980533J795482Q98800P13902K362308
1640.4B59161491J87836K408638O05030K469731K365055M13398K075215j712075K721329
1649.1B70695648N69210L069077K784214m99611p12719K04029M461651J188545K059593
$$ y = [319121857, 313636379, 310857315, 306010151, 302690945, 299129868, 294314804, 291488438, 286804943, 285037289, 281091080, 278918304, 275826473, 272775917, 270786324, 267017193, 265981350, 262626114, 261880531, 259446335, 258049679, 256688480, 253681889, 254007988, 251570530, 251379623, 249797058, 250595798, 250852642, 244912395, 246673489, 245833206, 247007370, 245557995, 246485195, 246736374, 244745350, 246037941, 245575180, 247848015, 246522121, 246981373, 247657166, 248800640, 250491867, 250721302, 253003139, 253356609, 255371532, 253390999, 255186481, 256085281, 256799183, 259161491, 259349327, 261757965, 262362995, 264832726, 267197781, 267611179, 269686394, 267974319, 270695648, 271264858, 274333935, 277118149, 276618538, 275905819, 276109848, 280571499, 281760044, 283819637]
1657.8B83819637J094628K010288K145328J575375K731953m80328L740234K288075
1665.5B98925190K449684L184643L402786K421875n31788M348278J833191M100380
1673.2C20134239M360581K854118K077141K470817M416619L544044M618111K435684
1680.9C46911354M431572O181831L746376L016816O58416O162300M441147L797036
1688.6C79346848M309234L456955M759522M267273N180778N516739O053810J668091
1696.4D14559250M584541O152573N535316M834404k640152P102280N949860M867744
1704.1D50945816L956833K999077K268905K817765M346275K649040J714707K550239
1711.8D74248657K910652L819046K050133J079636L806267K443199m941635K358741
$$ y = [283819637, 284914265, 286924553, 289069881, 290645256, 293377209, 292896881, 296637115, 298925190, 301374874, 304559517, 307962303, 310384178, 309852390, 314200668, 316033859, 320134239, 324494820, 327348938, 329426079, 331896896, 336313515, 339857559, 344475670, 346911354, 351342926, 357524757, 361271133, 364287949, 364946365, 371108665, 375549812, 379346848, 383656082, 387113037, 391872559, 396139832, 401320610, 406837349, 412891159, 414559250, 419143791, 425296364, 430831680, 435666084, 433025932, 440128212, 446078072, 450945816, 454902649, 457901726, 460170631, 462988396, 467334671, 469983711, 471698418, 474248657, 477159309, 480978355, 483028488, 484108124, 487914391, 490357590, 485415955, 487774696]
1719.5D87774696L509865K478981K188645R71260Q10127J719437J816177J221275J302109
1728.2E03792572K255974K80151Q22220M093895M415016O90651n840492L013458L750839
1736.9E17274284K263451L667755J270599j238822M058227L945732J816178J301422
1744.6E34358826L401413L965721L226928K718926J574707N028114K863503Q42094
1752.3E57980232N032807L660774L518562L640480K05956J860046L587685L296852
1760E82783394M162865N08117j08146L407821K254181J924210K591362K326317j694413
1768.7E98155708K331276N282898J700516j392746k063370M104920K689781j103668
1776.4F09705315J961517J552658K056160R36127p25403R15222K075958K430344m32663
$$ y = [487774696, 491284561, 493763542, 495952187, 496923447, 497733574, 499453011, 501269188, 502490463, 503792572, 506048546, 506328697, 507150917, 511244812, 515659828, 516350479, 510509987, 513523445, 517274284, 519537735, 523205490, 524476089, 523237267, 527295494, 531241226, 533057404, 534358826, 537760239, 541725960, 544952888, 547671814, 549246521, 554274635, 557138138, 557980232, 563013039, 566673813, 570192375, 573832855, 574038811, 575898857, 579486542, 582783394, 586946259, 587454376, 587346230, 590754051, 593008232, 594932442, 597523804, 599850121, 598155708, 600486984, 605769882, 607470398, 606077652, 604014282, 608119202, 610808983, 609705315, 611666832, 613219490, 615275650, 616211777, 615486374, 616401596, 618477554, 620907898, 620475235]
1785.1F20475235j2512K220268J602516P09839J895866J614800J374664j403503j356011
1793.8F27121162L998948J701393o72570J056176K237625N82847j501274K407227M07829
1802.4F37339363q812J409722R36470J383972M10690K16522R83811J707077o31333
1811.1F43747482L81699J277161L43017J367798K42691Q89893P9879K74353J243973
1819.8F49847946M44794R84650m53568J498489J856308k230987M7531K064285K278977
1828.5F56338425O19659l624725p2556K382965O54831N28260M46777N99213O57806
1837.2F58530655o38199J003494O05011O11496N07508J933059J792298n648194J094284
1845.8F59791412K160721L17002m33655K00500J253815K62375N64575l03040M37394
$$ y = [620475235, 620462723, 622682991, 624285507, 624995346, 626891212, 628506012, 629880676, 628477173, 627121162, 631120110, 632821503, 632148933, 633205109, 635442734, 636025581, 634524307, 636931534, 637339363, 637330551, 638740273, 639676743, 641060715, 641471405, 641687927, 642671738, 644378815, 643747482, 644129181, 645406342, 645749359, 647117157, 647359848, 648249741, 648329620, 648603973, 649847946, 650292740, 651277390, 650823822, 652322311, 654178619, 651947632, 651995163, 654059448, 656338425, 656958084, 653333359, 653260803, 655643768, 656298599, 656826859, 657273636, 657872849, 658530655, 657892456, 658895950, 659500961, 660112457, 660619965, 662553024, 664345322, 658697128, 659791412, 661952133, 662269135, 661835480, 662035980, 663289795, 663552170, 664116745, 663813705, 664251099]
1854.5F64251099K61001j89895P36160N6610L12958j79901O67114M79660L84674K94800
1864.2F67074280k2888J130142J30157J122666n96848j904678O43844J044083M99497
1872.8F69120255o07071O69937P2708j14060L50495L98178L29285l91999O72531j11465
1882.5F70388794K77862j2512l82309M20227j00784J401978P4997j666794N33828J086960
1892.1F72022247J99433M48837J9684j489792M97894L07617K70997M78820J6556L08685
1901.8F73080978m81872K66952j55944m5853N78766L87268M80804N8060m26102n54504
1911.4F73188553Q47626r2774j93863J25656L71552J793671j934662j455536J044845
1920.1F73695068Q53348J146393p91092j263809L99704M67987m52805L58353M00314
$$ y = [664251099, 664512100, 664322205, 665058365, 665114975, 665427933, 665248032, 665915146, 666394806, 666779480, 667074280, 667051392, 668181534, 668311691, 669434357, 668837509, 666932831, 667576675, 668620758, 669120255, 668513184, 669183121, 669255829, 669141769, 669492264, 669890442, 670219727, 669827728, 670500259, 670388794, 670666656, 670654144, 670271835, 670692062, 670591278, 671993256, 672068253, 670401459, 670935287, 672022247, 672221680, 672670517, 672690201, 671200409, 671698303, 672005920, 672276917, 672755737, 672772293, 673080978, 672599106, 672866058, 672710114, 672664261, 673243027, 673630295, 674111099, 674169159, 673743057, 673188553, 674036179, 673943405, 673749542, 673875198, 674246750, 676040421, 674105759, 672650223, 673695068, 674548416, 675694809, 674903717, 673639908, 674039612, 674507599, 674054794, 674413147, 674813461]
1928.8F74813461j60598m3946j07040M8218m92630J14975k60621L968L02887j92566
1938.4F74026108L52707k30561J168824J93176k454681m0131R58633M58069k70996
1947.1F74161148r3155l53393j51978L9520l5476j53809n10025K2888o256M42200k2965
1957.7F73338699l16620j67694l77655J65253k75192j75400k45667K72599M30221l52325
1967.3F72296219k25372j22071M58985M3792m196m45099l34701K85721m22287P782
1977F71538773Q8195M53644n417m21142q1558l05787r7580m52880j19477j34811L89023
1987.6F70850983L32946l73458M26559o3629r76181p46155M06113j1368p2632K93732
1997.2F70066910l26843L72238l03040l19290j79672l84064j82571k64512K03248l24326
$$ y = [674813461, 674652863, 674608917, 674501877, 674550095, 674057465, 674172440, 673911819, 673915787, 674218674, 674026108, 674378815, 674148254, 675317078, 675510254, 673055573, 673015442, 673974075, 674432144, 674161148, 674067993, 673714600, 673562622, 673602142, 673566666, 673412857, 672902832, 672925720, 672919464, 673361664, 673338699, 673022079, 672854385, 672476730, 672641983, 672366791, 672191391, 671945724, 672218323, 672648544, 672296219, 672070847, 671948776, 672407761, 672451553, 672447357, 672002258, 671667557, 671953278, 671530991, 671538773, 671626968, 672080612, 672075195, 671654053, 671572495, 671266708, 671169128, 670716248, 670596771, 670461960, 670850983, 671183929, 670810471, 671237030, 671173401, 670197220, 669451065, 669857178, 669845810, 669773178, 670066910, 669740067, 670112305, 669809265, 669489975, 669310303, 668926239, 668743668, 668479156, 668682404, 668358078]
2006.9F68358078j3199j83716l8681K01950m38079m4327l43323j91956j32446j95999
2016.5F66978302l26996J07269P7057m94918J64566o15159k96783j8921k91290k67868
2026.2F65015259o17218R689j21460K39029j71814j99356l0136l53546p0572o91300
2035.8F63008575L5782M0894J37100O3400l84674q5449n04379L0517o36367l71781
2045.5F61333618L739p5760J85852m64096J81884l1128J96610p5378k82288j28632
2055.1F60844421p28530P8277l21808R0256J46637k09503m0970o8131O53153m35639
2064.7F60008163n51452r9335j35345l25928j34049N36271l10059k81906j59760O3935
2074.4F58610535k21405l27683M3717k69165R0255k99072J83563k0294k67181J06125
$$ y = [668358078, 668344879, 668161163, 668122482, 668324432, 667886353, 667842026, 667498703, 667306747, 667174301, 666978302, 666651306, 666758575, 666835632, 666340714, 666505280, 665890121, 665593338, 665574417, 665283127, 665015259, 664398041, 664407730, 664286270, 664525299, 664353485, 664154129, 664123993, 663770447, 663699875, 663008575, 663044357, 663085251, 663222351, 663285751, 662901077, 662815628, 662311249, 662341766, 661705399, 661333618, 661337357, 661261597, 661447449, 660983353, 661165237, 661134109, 661330719, 661255341, 660973053, 660844421, 660115891, 660194168, 659872360, 659962616, 660109253, 659899750, 659858780, 659790649, 660443802, 660008163, 659456711, 659357376, 659222031, 658896103, 658762054, 659298325, 658988266, 658706360, 658546600, 658610535, 658389130, 658061447, 658105164, 657835999, 657926254, 657627182, 657810745, 657790451, 657523270, 657629395]
2084F57629395m47922j69068m93850p7973K10877J41067n2414l12347R0713k92511
2093.7F56225967j71966m02146j40609o0044j62048n5237m09088J89285j81121k71683
2103.3F54561310n30091l89633J12763j11771L1738m97589K00272o4926m54560p4920
2113F52782593j67237L23105q8348j28327n98449k70233J63879l13950q2321j01700
2122.6F51519012P7057l55835J6785j373l91236j94854n4398O72608K28881P1869k36816
2133.2F51351700k16751l51792n50613K16446k74429O1645K22778L55378j2207k79084
2142.9F50523071K66877l58582O0272k90603j04294J29623k28882K35901j40152J53198
2152.5F50246429q1176K8457J40839j39160j54648k86102J33972M6081L70865r8877
$$ y = [657629395, 657181473, 657012405, 656518555, 656440582, 656651459, 656792526, 656740112, 656427765, 656518478, 656225967, 656054001, 655651855, 655511246, 655451202, 655289154, 655233917, 654824829, 655014114, 654832993, 654561310, 654031219, 653641586, 653754349, 653642578, 653674316, 653176727, 653376999, 653312073, 652857513, 652782593, 652615356, 652938461, 652850113, 652721786, 652123337, 651853104, 652016983, 651703033, 651620712, 651519012, 651596069, 651240234, 651257019, 651255646, 650864410, 650669556, 650615158, 651287766, 651516647, 651588516, 651351700, 651134949, 650783157, 650232544, 650448990, 650174561, 650236206, 650458984, 650814362, 650802155, 650523071, 650789948, 650431366, 650491638, 650201035, 650096741, 650226364, 649997482, 650233383, 650093231, 650246429, 650165253, 650193710, 650334549, 650195389, 650040741, 649754639, 649888611, 649934692, 650305557, 650206680]
2162.1F50206680J14823L32336l41644o9809j90125M53873j0376k78931L11890K82974
2171.8F50811691J95923j70593k7695m10003J35498J31912j32447m7760l13491L55987
2181.4F50529022k2278J71738J27564J76239J1901m60510J66168l70865K06528K47345
2191.1F50782852K28272K91061k89535L13034j1063j13068n90362k45896M95682O53153
2200.7F51514130N48706n56259l37220k59781K21253J18484j45874L50571J04446K23618
2210.4F51782074m84161p3853L41873K04621J39083l74679k06070k14157M51126n646
2220F51560211l17535k3346J64337N01709k84042j17646k52227J51214L09525l99781
2229.7F51292419l64990q011Q67997J34201m9057j12153l05709M5852k53372K74048
$$ y = [650206680, 650321503, 650653839, 650312195, 650242386, 650052261, 650506134, 650495758, 650216827, 650528717, 650811691, 651007614, 650837021, 650809326, 650399323, 650534821, 650666733, 650534286, 650486526, 650173035, 650529022, 650506744, 650678482, 650806046, 650982285, 650994186, 650533676, 650699844, 650328979, 650535507, 650782852, 651011124, 651302185, 651012650, 651325684, 651314621, 651201553, 650611191, 650365295, 650860977, 651514130, 652062836, 651506577, 651169357, 650909576, 651130829, 651249313, 651103439, 651454010, 651558456, 651782074, 651297913, 651224060, 651565933, 651770554, 651909637, 651534958, 651328888, 651114731, 651565857, 651560211, 651242676, 651219330, 651383667, 651885376, 651601334, 651483688, 651231461, 651382675, 651692200, 651292419, 650927429, 650919418, 651787415, 651921616, 651872559, 651760406, 651454697, 651500549, 651247177, 651521225]
2239.3F51521225o866k86942l13034k05307J03836N62973N79147n38406l76129l06702
2248.9F50733795J00403j7166r7351L26309n22690R3079K10266M8447M196k80152k6245
2259.5F50572891P553J0605m29916J82495J9684j07270K40326Q1101L16009j00250
2269.2F50793228J43738l06473l26385j83335k74734J42441k42691J98440j6556J83564
2278.8F50111237k289l04184j20392o14166J47857j21765n493j4648j1444J63345k58560
2289.4F48969498N25436m03976l41034L0136Q3542M36248l662L13874p48902l52401
2299.1F48508759O637K6093N95703k75345q7280k47574K42309m6844j58234Q95920
2308.7F49460144J49384K22930j9531k71759p5073o5231j6938n1498M47998L80096
$$ y = [651521225, 651514359, 651227417, 650914383, 650709076, 650812912, 651375885, 651955032, 651416626, 651040497, 650733795, 650834198, 650817032, 650719681, 651045990, 650523300, 650616379, 650826645, 650875092, 650879288, 650599136, 650572891, 650580444, 650591049, 650161133, 650343628, 650363312, 650256042, 650496368, 650577469, 650893478, 650793228, 650936966, 650630493, 650304108, 650120773, 649846039, 649988480, 649745789, 649944229, 649927673, 650111237, 650108948, 649804764, 649684372, 649070206, 649218063, 649096298, 649090805, 649076157, 649064713, 649228058, 648969498, 649494934, 649090958, 648749924, 648780060, 648863602, 649299850, 649296188, 649610062, 648861160, 648508759, 648515396, 648541489, 649137192, 648861847, 648774567, 648526993, 648769302, 648722458, 648564224, 649460144, 649609528, 649832458, 649812927, 649541168, 649466095, 649400864, 649383926, 649332428, 649780426, 650160522]
2318.4F50160522M8142k97623J57013j73111o91986j22681L46833N45959J12381L88260
2328F50473709k80914j42136N79910P4997m20684n56260o10p858P57446l37143q25653
2338.6F49314804m7531j85013L89176p51191n85937K41012L86887r93729k680130j160431
2348.3F43927917J206360K079773N67322j26419n11780J78833J366043R09195J361923
2356.9F50959167n39321N34591J40152r71069l91617k57645p10067l061371Q5754K82746
2366.6F46071320r08814l90472j92719r8953j337891m94842j246109j058121n64804
2375.3F39778595o23055l65524j057472l00980m96406j093674q23250K76833J47400
2383.9F35442467p99828p4539k91252n00412p05719m11530J07613j00594J44959l07884
$$ y = [650160522, 650208664, 649911041, 650068054, 649894943, 649202957, 649080276, 649427109, 649973068, 650085449, 650473709, 650192795, 650050659, 650630569, 650705566, 650284882, 649728622, 649728012, 649720154, 650477600, 650140457, 649314804, 649267273, 649082260, 649471436, 648720245, 648134308, 648375320, 648762207, 647768478, 645088348, 643927917, 645134277, 647214050, 647781372, 647654953, 647143173, 647322006, 648688049, 649597244, 650959167, 650419846, 650954437, 651094589, 650123520, 649731903, 649474258, 648764191, 645702820, 645788574, 646071320, 645162506, 644772034, 644579315, 644480362, 643142471, 642647629, 641401520, 640343399, 639778595, 639155540, 638790016, 637732544, 637431564, 636935158, 635841484, 635018234, 635295067, 635442467, 634642639, 634568100, 634276848, 633776436, 633070717, 632659187, 632766800, 632666206, 632811165, 632503281]
2393.6F32503281k12632l71589l23067j41945k41165p3395p06634k95410p0229l24020
2403.2F29743195o60630p2975N08728l22189k24457o79359l51601j02501o12488n06325
2412.9F26719398k86788L10821m28429l87687l40882n76324j31340l07388k95563o15769
2422.5F23660049j17340p7667l69491k38610m58412l64647n36766k63023k85034l44506
2432.2F20604553m80270l49732j01661l44429L2310n33371p60383n25856l08533j07727
2441.8F17124901k90222k90604m57420O3057k88277m16870m41284p78313k94952l79334
2451.5F13550682j46103m96712j51138N226q17184o65360m99191j12915l82156j84632
2461.1F10100517k71759l49197K4948m13475j50147n04951m28772o09016p99332j52397
$$ y = [632503281, 632290649, 631919060, 631595993, 631454048, 631212883, 631139488, 630432854, 630137444, 630067215, 629743195, 629082565, 629009590, 629518318, 629196129, 628971672, 628292313, 627940712, 627838211, 627225723, 626719398, 626432610, 626743431, 626315002, 625927315, 625586433, 625010109, 624878769, 624571381, 624275818, 623660049, 623542709, 623465042, 623095551, 622856941, 622398529, 622033882, 621497116, 621234093, 620949059, 620604553, 620124283, 619774551, 619672890, 619328461, 619360771, 618827400, 618067017, 617541161, 617232628, 617124901, 616834679, 616544075, 616086655, 616149712, 615861435, 615444565, 615003281, 614224968, 613930016, 613550682, 613404579, 612907867, 612756729, 612761955, 611944771, 611279411, 610780220, 610667305, 610285149, 610100517, 609828758, 609479561, 609504509, 609091034, 608940887, 608435936, 608007164, 607398148, 606598816, 606446419]
2470.7F06446419l47100k50511m97284n22995o67991m70429j41601n55687n82657q25729
2480.4F01584435l95470p3624l8261k46201k79236k96898r01069o52123p45010l74565
2490E97581978m12979m99687N3710j18293j8769p90977p58095l34167o49491o55441
2499.7E93397789m18625m18701q97446K93007K27471p87850k57187m06341r70879r47952
2509.3E88813286k08893j62888m81720p84416o59752j83105j98670j87187n11322k03438
2519E85231895l78875o17981n35774m26598J51787p07360p70378j98822k26402m53568
2528.6E81067924o37245m22935m97246L6659k51960n08004m23927n25894j53465n47600
2538.2E77136307o13556m40216K2774l24517q14781j29356j67427k45591o21261o70815
$$ y = [606446419, 606099319, 605848808, 605351524, 604828529, 604160538, 603690109, 603548508, 602992821, 602410164, 601584435, 601188965, 601115341, 601077080, 600830879, 600551643, 600254745, 599353676, 598701553, 597956543, 597581978, 597168999, 596669312, 596723022, 596604729, 596585960, 595794983, 595036888, 594702721, 594053230, 593397789, 592979164, 592560463, 591663017, 591956024, 592183495, 591395645, 591138458, 590732117, 589761238, 588813286, 588604393, 588441505, 587959785, 587175369, 586515617, 586332512, 586133842, 585946655, 585435333, 585231895, 584853020, 584235039, 583699265, 583272667, 583424454, 582717094, 581946716, 581747894, 581521492, 581067924, 580430679, 580007744, 579510498, 579547157, 579295197, 578787193, 578363266, 577837372, 577683907, 577136307, 576522751, 576082535, 576105309, 575780792, 574966011, 574836655, 574669228, 574423637, 573802376, 573131561]
2547.9E73131561l30772l17726l19023m32663l55263n87158n88188k80457o0959m65965
2557.5E69393387n06859l93181o15768j58844m18091k69127j76353l84789m14619p39060
2567.2E65316696k72789n02357n21050j31378p6981l28483n46570j24779m43077p03163
2576.8E61666069p29637m12293o28700m87556K03705p52869n63431k6588k06414l47709
2586.5E57714577l16201k38800o99386m19617l52211k13318n06477p79686l23906l06664
2596.1E53558311l42521r57031m61312q6822n29023o51588o80046j8921j49956l99093
2605.7E49281998p18575n92346j99623o37436o17943m44908o6681k47307m46014o66809
2615.4E44644356o97174k34528p20177p10830o69747l96003o5232m75654n17350n66864
$$ y = [573131561, 572800789, 572483063, 572164040, 571731377, 571376114, 570788956, 570200768, 569920311, 569859352, 569393387, 568886528, 568493347, 567877579, 567718735, 567300644, 567031517, 566855164, 566470375, 566055756, 565316696, 565043907, 564541550, 564020500, 563889122, 563812141, 563483658, 562937088, 562812309, 562369232, 561666069, 560936432, 560524139, 559895439, 559407883, 559611588, 558858719, 558295288, 558268700, 558062286, 557714577, 557398376, 557159576, 556460190, 556040573, 555688362, 555475044, 554968567, 554188881, 553864975, 553558311, 553215790, 552258759, 551797447, 551710625, 551181602, 550530014, 549849968, 549831047, 549681091, 549281998, 548563423, 547971077, 547771454, 547134018, 546516075, 546071167, 546004486, 545757179, 545311165, 544644356, 543947182, 543712654, 542992477, 542281647, 541611900, 541215897, 541150665, 540675011, 540157661, 539590797]
2625E39590797m91409l73077l17383o81076p67250n12657m01116k77328m33426k31705
2634.7E35104370n21583o85196n25437l55301l73001j070938p53670k88200j14098
2643.4E30416946l68576p73277n02510m76189n28526n02968k27470k94724m64248o54755
2653E25623703n38025j80893n95894o10923n35012k12822k05841l75480k79885n63507
2662.6E21525421j75552l22342m77066l39394m28123o06537m43192J43738n37605o09665
2672.3E17729683m74892n31044p1449O8703j1597o17867l51905n50919p24831j31607
2681.9E14332275m16603o93168n85251k3155k36779j81083j36490n85213k85301m56619
2691.6E10732613l39585l41034n10864o59676m34341p744m82254l95393k46391j29929
$$ y = [539590797, 539099388, 538726311, 538408928, 537727852, 536960602, 536447945, 536046829, 535769501, 535336075, 535104370, 534582787, 533897591, 533372154, 533016853, 532643852, 531572914, 530819244, 530531044, 530416946, 530048370, 529275093, 528772583, 528296394, 527767868, 527264900, 527037430, 526742706, 526278458, 525623703, 525085678, 524904785, 524308891, 523697968, 523162956, 522950134, 522744293, 522368813, 522088928, 521525421, 521349869, 521027527, 520550461, 520211067, 519782944, 519176407, 518733215, 518876953, 518339348, 517729683, 517254791, 516723747, 516652298, 516721001, 516709404, 516091537, 515739632, 515188713, 514463882, 514332275, 513915672, 513222504, 512637253, 512614098, 512377319, 512196236, 512059746, 511474533, 511189232, 510732613, 510393028, 510051994, 509541130, 508881454, 508447113, 508439369, 507957115, 507561722, 507315331, 507185402]
2701.2E07185402l16353k38609l8872o99806n50080m15153k99225j12801j38435o80923
2710.9E03695145q78029Q9187K1058l27111n31730k39029j98784o87332j42746k44675
2720.5E00555954k70882r1819l80707k19994k3956l38249n50042j98249k17934j41792
2730.2D98122330j11618l77350o15158l33405J02616k76413l52135m60243k94953j39656
2739.8D95264015l42445j78948j54533J24359L8185k08778m16832m83551m43916l11509
2749.4D92886047M4175k87667l5515j84097n62782j38474j33781k68173l87307r9449
2759.1D90832977k37770k37236r6245l32298m18434n62363j10664k63519l47138m68521
2768.7D87758789n08308J76620l41263l67355o3591l67279n75714p07779n59197j55677
$$ y = [507185402, 506869049, 506630440, 506591568, 505891762, 505341682, 504926529, 504627304, 504514503, 504376068, 503695145, 502817116, 502906303, 502927361, 502600250, 502068520, 501829491, 501630707, 500943375, 500800629, 500555954, 500285072, 500193253, 499812546, 499592552, 499568596, 499230347, 498680305, 498482056, 498264122, 498122330, 498010712, 497633362, 497018204, 496684799, 496787415, 496511002, 496158867, 495698624, 495403671, 495264015, 494921570, 494742622, 494588089, 494712448, 494750633, 494541855, 494125023, 493641472, 493197556, 492886047, 492930222, 492642555, 492607040, 492422943, 491860161, 491721687, 491587906, 491319733, 490932426, 490832977, 490595207, 490357971, 490261726, 489929428, 489510994, 488948631, 488837967, 488574448, 488227310, 487758789, 487250481, 487427101, 487085838, 486718483, 486654892, 486287613, 485711899, 485004120, 484444923, 484289246]
2778.4D84289246j41793o75964l21693n14870p27768%k2850l98941m44489r2201p15485
2789D80233192r84954l54615l80249o14662n60493j88561n83610n62516l57513o27632
2798.6D75018387p44438p78923l65410p13234o05011l08075n96199n62630p35817o87904
2808.3D68920746o64063m96978o41632q68340p59468n92346n90515j094590p48825
2816.9D62463989n69458o02531m63677n44510n38749q90961o63757o08330q74443r52416
2826.6D55755157r94262r14116o98929o28204j234055q00590l76435p06672q45795
2835.3D48556099j017037j029853j603470j646156j284562j297798j341934j464844
2843D37870445j620025j773224j815949k044029j644516j706429j951255j640625j661911
$$ y = [484289246, 484147453, 483471489, 483149796, 482634926, 481907158, 481907158, 481884308, 481485367, 481040878, 480948677, 480233192, 479248238, 478893623, 478513374, 477898712, 477338219, 477149658, 476566048, 476003532, 475646019, 475018387, 474273949, 473495026, 473129616, 472416382, 471811371, 471503296, 470907097, 470344467, 469608650, 468920746, 468256683, 467759705, 467118073, 466249733, 465490265, 464897919, 464307404, 463212814, 462463989, 461894531, 461292000, 460828323, 460283813, 459745064, 458854103, 458190346, 457582016, 456707573, 455755157, 454760895, 453846779, 453147850, 452519646, 451285591, 450485001, 450108566, 449401894, 448556099, 447539062, 446509209, 444905739, 443259583, 441975021, 440677223, 439335289, 437870445, 436250420, 434477196, 432661247, 430617218, 428972702, 427266273, 425315018, 423674393, 422012482]
2851.7D22012482j067849o30950k65313k24380o09932p05757k96250K85874k98500
2860.3D18199425n65415m06227j92947k04811k91901m44221j041947m95491p82661
2869D13773804j169892q44421n13306k58178j135750p01180m71992o82450m11987m94804
2878.7D07089844m67873j138229n84603l23257r09119o53305r67521j129303p40128
2887.3D00176506m44908j016884j405487j053963o11572l44200q25806p83081o12449
2896C93078156r81980p27234k42004p78122r22318n05676q16383o43425o07567o92558
2905.7C86160889q22144j038093p88842r13086q25767q23059j020165j456299j593856
2914.3C76879578j377411j338692q68721j217995j383171j078758j027107r37386o62498
$$ y = [422012482, 420944633, 420313683, 420048370, 419823990, 419214058, 418508301, 418212051, 418497925, 418199425, 417634010, 417227783, 417034836, 416830025, 416538124, 416093903, 415051956, 414556465, 413773804, 412603912, 411759491, 411246185, 410988007, 409852257, 409151077, 408679085, 407996635, 407584648, 407089844, 406621971, 405483742, 404899139, 404575882, 403666763, 403013458, 402045937, 400916634, 400176506, 399731598, 398714714, 397309227, 396255264, 395643692, 395299492, 394473686, 393690605, 393078156, 392096176, 391368942, 391126938, 390348816, 389426498, 388920822, 388104439, 387461014, 386853447, 386160889, 385338745, 384300652, 383511810, 382598724, 381772957, 380949898, 379929733, 378473434, 376879578, 375502167, 374163475, 373294754, 372076759, 370693588, 369614830, 368587723, 367650337, 366987839]
2923C66987839k08092o94656o14090m32663J30501R76219K27813l88984o38047k7351
2932.7C65318489M53568O11152R39675K88848M23279P87468O00128M19732L40118O68259
2942.3C70850716J025009N06325l97492N73158J409645O90117N01480O20347L58314
2951C76137619M63448R03282M33616N0469L08647K27776P8811J69525O86455J200028
2960.6C80659676J020164N79453M52385K60925J82113L35732P33414J033363O83479
2969.3C85940704N39780M18015N76171J047173Q14438L69186K77558L87001N13763
2978C90883789P69234L09410n0278M79126N71633J48544j22299L97300L58010j76049
2987.6C93568420J02539L02392L35235M53987J38703n07393k92321j53808l42102k35405
$$ y = [366987839, 366779747, 366085091, 365471001, 365038338, 365168839, 366145058, 366372871, 365983887, 365345840, 365318489, 365772057, 366383209, 367322884, 367611732, 368035011, 368822479, 369422607, 369842339, 370182457, 370850716, 371875725, 372382050, 371984558, 372557716, 373967361, 374657478, 375158958, 375779305, 376137619, 376601067, 377504349, 377937965, 377988434, 378297081, 378524857, 378603668, 378773193, 379459648, 380659676, 381679840, 382259293, 382711678, 382972603, 383154716, 383490448, 384223862, 385257225, 385940704, 386480484, 386898499, 387474670, 388521843, 389336281, 389705467, 389983025, 390370026, 390883789, 391653023, 391962433, 391912155, 392391281, 392962914, 393111458, 392989159, 393386459, 393744469, 393568420, 393670959, 393973351, 394308586, 394762573, 394901276, 394393883, 394101562, 393947754, 393605652, 393370247]
2997.3C93370247m01344l03841l30544J11351K71912o30875r66720o31905k03323l84903
3006.9C89900055m77142l33367k10953m50210p33185l22990l20435k84042j027260
3015.6C85740471j417389l17307p2403m66232r43832p58934m48952l94440n34629j032792
3025.2C79353561p78465p35435n90592k82631p40890q62236m11606m46625q39882q44230
3034.9C72820969p34215o64787j088639j018905l87230o22216r75036q18100l47328
3043.6C66164513n64309q36868j001701j274376o17409q2741k11486r36814j255607
3052.2C59383202j112862r87015m77600n40848n49240o52351r23500n80597l63503
3060.9C53195686q14170j160279o61354l34740k41165m46815q42362p45735n43709
$$ y = [393370247, 392968903, 392665062, 392334518, 392445869, 392717781, 392086906, 391120186, 390488281, 390284958, 389900055, 389422913, 389089546, 388878593, 388428383, 387695198, 387372208, 387051773, 386767731, 385740471, 384323082, 384005775, 383933372, 383467140, 382523308, 381764374, 381315422, 380920982, 380386353, 379353561, 378575096, 377839661, 377249069, 376966438, 376225548, 375363312, 374951706, 374505081, 373665199, 372820969, 372086754, 371421967, 370333328, 369314423, 368927193, 368304977, 367329941, 366511841, 366164513, 365600204, 364763336, 363761635, 362487259, 361869850, 361787109, 361575623, 360638809, 359383202, 358270340, 357283325, 356805725, 356264877, 355715637, 355063286, 354139786, 353559189, 353195686, 352381516, 351221237, 350559883, 350225143, 349983978, 349537163, 348694801, 347949066, 347405357]
3069.6C47405357p23991j055031o81648n40238l98254l73115p43638n94558o80275
3078.3C41614609n94330p57027q80203o23131n72052k52380l56369o24924p05070n31540
3087.9C35717583o30036p40966p22847j011582n90820p18498q00744l48968m41551
3096.6C29711571k63481k21634n21241q05473p67364r57871r54170n82504m83323l14674
3106.2C23839836o99501p88574o65741p02133n33142m95148n16796r19934o85920m47617
3115.9C17385330n18074n36747r84516p26013n91755p42836o77433q08411q41617q26569
3125.5C10131359n62935j78528k32372q08372r18656l61347m39892j345157j202164
3134.2C04081936k28253k81639n43785o76708o55231o83022j055317r71794j002178
$$ y = [347405357, 346681366, 345626335, 344944687, 344404449, 344006195, 343633080, 342889442, 342294884, 341614609, 341020279, 340263252, 339383049, 338759918, 338187866, 337935486, 337579117, 336954193, 336249123, 335717583, 335087547, 334346581, 333623734, 332612152, 332021332, 331302834, 330502090, 330153122, 329711571, 329448090, 329226456, 328705215, 327899742, 327132378, 326174507, 325220337, 324637833, 324154510, 323839836, 323140335, 322351761, 321686020, 320983887, 320450745, 319955597, 319438801, 318518867, 317832947, 317385330, 316867256, 316330509, 315345993, 314619980, 314028225, 313285389, 312607956, 311799545, 310957928, 310131359, 309568424, 309389896, 309157524, 308349152, 307430496, 307069149, 306629257, 305284100, 304081936, 303853683, 303572044, 303028259, 302351551, 301696320, 301013298, 299957981, 298986187, 297984009]
3142.9B97984009r76048l64341p0935p37743r69353o57692p25555m82922q21476p12566
3152.5B91465378j79196q16078o07452m82330j310311r87530m94499o49738l27168
3161.2B85611076l99227q22811o93207q25309q52547o39076n89924m82140m37107n65739
3170.9B79303989p13558q28113q97999o82163n70412n82905q61645p73410n02835j298160
3180.5B71592789r69773p0362l74794m90284k28595l67299r27772q21838n02892p49187
3190.1B66089993q60768m83742k72483l36914m16794r89170q60405p83654q08029j91288
3199.8B60086746o16665n28850m42295r01604m01726l62530q66260q57792m26712n24483
3209.4B54157829p59201n92384k11277J7509o34708o48441j88008m73652q20503p66811
$$ y = [297984009, 297007961, 296643620, 296572685, 295834942, 294865589, 294207897, 293482342, 292999420, 292177944, 291465378, 291286182, 290470104, 289862652, 289380322, 288070011, 287082481, 286587982, 285938244, 285611076, 285211849, 284389038, 283695831, 282870522, 282017975, 281378899, 280788975, 280306835, 279869728, 279303989, 278590431, 277762318, 276864319, 276182156, 275611744, 275028839, 274167194, 273393784, 272890949, 271592789, 270623016, 270552654, 270177860, 269687576, 269458981, 269091682, 268163910, 267342072, 266839180, 266089993, 265229225, 264745483, 264473000, 264136086, 263719292, 262730122, 261869717, 261086063, 260278034, 260086746, 259470081, 258941231, 258498936, 257597332, 257195606, 256833076, 255966816, 255109024, 254682312, 254157829, 253398628, 252806244, 252594967, 252612476, 251977768, 251329327, 251141319, 250667667, 249847164, 249080353]
3219.1B49080353m67873l22532l96271p57828n56240m96349j016560o02684k86770
3227.8B44177246k90413j98040n30052o50539n88837l27587l43228q83503m95700o0120
3237.4B39809227o64349r22298n08060j53008l93887n48133m02775n23854m31442m00696
3247B34860725n38826n67398l21884M9401q4420l94249m64763m34132p54738m91142
3256.7B30858574J81179l70560q71658o47812m19445m52518n20821j15185j736l57074
3266.3B27282944m84200m58965m52480l67146j80244j25561n56469p94525l06855j36985
3276B23419514k96440k60773l81889l19405l2005n28107l91235N02777j10150o99768
3285.6B20902519n04532m80098n88665k85244K58693j77040m61464n27439m82940J9760
$$ y = [249080353, 248612480, 248289948, 247893677, 247135849, 246579609, 246083260, 245066700, 244464016, 244177246, 243886833, 243688793, 243158741, 242508202, 241919365, 241591778, 241248550, 240365047, 239869347, 239809227, 239144878, 238222580, 237714520, 237561512, 237167625, 236619492, 236216717, 235692863, 235261421, 234860725, 234321899, 233754501, 233432617, 233482018, 233397598, 233003349, 232538586, 232104454, 231349716, 230858574, 231039753, 230669193, 229797535, 229149723, 228730278, 228277760, 227756939, 227641754, 227640018, 227282944, 226798744, 226339779, 225887299, 225520153, 225339909, 225214348, 224657879, 223863354, 223556499, 223419514, 223123074, 222862301, 222480412, 222161007, 222129002, 221600895, 221209660, 221712437, 221602287, 220902519, 220397987, 219917889, 219329224, 219043980, 219302673, 219125633, 218664169, 218136730, 217653790, 217673550]
3295.3B17673550O0367k19135n98831k99759l26367n00526j50642k85740k91291l76281
3304.9B14685345j00441m0360k05478j96000q03489n23968q9340k10705o75068o65874
3314.6B11174622j4821k65483m03119m90245o57006m16622j59473l39565n60818q1921
3324.2B07785549l93753p58037n64061o08081o55365p16134k03380J10397j19171n83839
3333.8B03294125q02861l38096l04737n32151k89211k41547o02912l11127n12295j139164
3343.5A98220024k19860r8972p18479M2476M9038n17731q4018k12956p00493o61792
3353.1A95097237j80283K89249l10592p70378n38578K09350K34127p22351l86352k82479
3362.8A92638950l94668j10131m9877J11561k71873l40977l03211J18255L48988m07791
$$ y = [217673550, 217733917, 217514782, 216915951, 216616192, 216289825, 215789299, 215638657, 215352917, 215061626, 214685345, 214584904, 214544544, 214339066, 214143066, 213339577, 212815609, 212726269, 212515564, 211840496, 211174622, 211159801, 210894318, 210491199, 210000954, 209343948, 208927326, 208767853, 208428288, 207867470, 207785549, 207391796, 206633759, 206069698, 205461617, 204806252, 204090118, 203886738, 203997135, 203877964, 203294125, 202491264, 202153168, 201848431, 201316280, 201027069, 200785522, 200182610, 199871483, 199359188, 198220024, 198000164, 197901192, 197182713, 197225189, 197274227, 196756496, 196672478, 196459522, 195759029, 195097237, 194916954, 195206203, 194895611, 194125233, 193586655, 193796005, 194030132, 193307781, 192921429, 192638950, 192244282, 192134151, 192084274, 192195835, 191923962, 191582985, 191279774, 191398029, 191747017, 191339226]
3372.4A91339226n68657m92401k70119J2074N4836m64688o09607M8179j86538m26026
3382.1A88436279k05269M59614K17743q41637k56595K3327k53315q5411J9245J68075
3391.7A87682056M3965r7122j31550k25411m80823m07353M34780M54541l56751l24402
3401.3A86591930j55887l2730K29835K3899M0341j54419L6564K93865q2340P8029K26097
3412A87095184L62301M2343k45399j12896N5332K94075k479J93691Q2397J92890N5676
3422.6A88013115p31640K01569M29172O1970N9681M18377J101360N77126Q2283l22132
3432.2A89890881L8223M71554j5564K16617M35238K86884K10038K29969M40197O78024
3441.8A92882061N7983l42159M39148R48715P29485m29840o3572Q27350O11344O07452
$$ y = [191339226, 190770569, 190278168, 190008049, 190020123, 190074959, 189610271, 189000664, 189048843, 188862305, 188436279, 188231010, 188690624, 188908367, 188066730, 187810135, 187833462, 187580147, 187494736, 187513981, 187682056, 187726021, 187628899, 187497349, 187271938, 186791115, 186383762, 186818542, 187273083, 186916332, 186591930, 186436043, 186403313, 186633148, 186657047, 186697388, 186542969, 186579533, 186873398, 186791058, 186869087, 187095184, 187457485, 187499828, 187254429, 187141533, 187196865, 187490940, 187488461, 187682152, 187764549, 187957439, 188013115, 187281475, 187483044, 187912216, 187974186, 188033867, 188452244, 189553604, 190130730, 190213013, 189890881, 189929104, 190400658, 190385094, 190601711, 191036949, 191323833, 191533871, 191763840, 192204037, 192882061, 192940044, 192597885, 193037033, 193985748, 194715233, 194285393, 194221821, 195049171, 195660515, 196267967]
3451.5A96267967M99325M83322K24075M08421N58910J12133L84064L55625L74966N98793
3461.1B00267601P40070O60992M20284O01921M98658N31578P39860O29502M22649N60303
3470.8B06073418P17067N51834M62075M73728O28834P49626R41257N63317N78270R54418
3480.4B12693844O45809O26030P0744K97298P23591Q58307J493969N43060j63212O25229
3490.1B18414669Q89378R07592J432915Q86822J08013Q07495P60708M69399O32610
3498.7B25309601J027450P51343M47006J252251N67455L13492Q08792P68585Q87108
3507.4B32133083J270008J312085K17685N54695J133824J174126Q54434J003819J404476
3516.1B41058235N58071Q13885P48425O89296J144734R44748J152629M22307K42786
$$ y = [196267967, 196767292, 197250614, 197474689, 197883110, 198442020, 198554153, 198938217, 199293842, 199668808, 200267601, 201007671, 201668663, 202088947, 202690868, 203189526, 203721104, 204460964, 205090466, 205513115, 206073418, 206790485, 207342319, 207804394, 208278122, 208906956, 209656582, 210597839, 211161156, 211739426, 212693844, 213339653, 213965683, 214036427, 214333725, 215057316, 215915623, 217409592, 217952652, 217789440, 218414669, 219304047, 220211639, 221644554, 222531376, 222639389, 223446884, 224207592, 224676991, 225309601, 226337051, 227088394, 227535400, 228787651, 229355106, 229668598, 230477390, 231245975, 232133083, 233403091, 234715176, 234932861, 235487556, 236621380, 237795506, 238649940, 239653759, 241058235, 241616306, 242430191, 243178616, 243867912, 245012646, 245957394, 247110023, 247532330, 247775116]
3524.8B47775116R79748J575737J243458N75733M97055J085281J584091M25454P32231
3533.5B56473904J494865J561756R08585L23658J767845J309586O52103R41849J597328
3542.1B67031479J622352Q29201J132584R14230J547089Q85258J314563K126122J689949
3550.8B79092827J875133J11122R64718J449185J924591K020035k37675J412258K157250
3559.5B90769444J614799J132374J974602K082958L22742L230763K337398L52841R47323
3568.2C04765244k41738K270355J672535J690922K139797J569138J040535J583080
3575.9C16489868K523003J291389K419358J912002K99111J712646K874260K718544
3583.6C32240181J339188L096618K937584M68979J037483m58107K336693K944641K737618
$$ y = [247775116, 248754864, 250330601, 251574059, 252149792, 252646847, 253732128, 255316219, 255741673, 256473904, 257968769, 259530525, 260439110, 260762768, 262530613, 263840199, 264492302, 265434151, 267031479, 268653831, 269483032, 270615616, 271529846, 273076935, 273962193, 275276756, 277402878, 279092827, 280967960, 281079082, 282043800, 283492985, 285417576, 287437611, 287199936, 288612194, 290769444, 292384243, 293516617, 295491219, 297574177, 297896919, 301127682, 303465080, 303817921, 304765244, 304523506, 306793861, 308466396, 310157318, 312297115, 313866253, 314906788, 316489868, 319012871, 320304260, 322723618, 324635620, 324934731, 326647377, 329521637, 332240181, 333579369, 336675987, 339613571, 340082550, 341120033, 340661926, 342998619, 345943260, 348680878]
3592.3C48680878J929931R94110L264199P34863J528053L366089J503906K804833K060776
3601C66867638R91439K202263K227288K101326L022842L097916L90281L357010R60045
3609.6C85218048m06456O678619L405495p69691L382377M90723L610916M775925P11670
3618.3D07097626J578521J479607J275635K625542L129386K947808L375664L422698
3626D26932487L538933P402916L642235j0037918K205276N095597N911026K684479
3633.8D47375031j485901K192115L958435L744965J781197J691970L271981L560905
3641.5D66090698K193947J199646L265152M514809O370239J872520j939659N899926
3649.2D89467278K82592k619476j09711N053292N034561M434585O939392n679016j66816
$$ y = [348680878, 350610809, 351604919, 354869118, 355603981, 357132034, 360498123, 362002029, 364806862, 366867638, 367859077, 370061340, 372288628, 374389954, 377412796, 380510712, 380900993, 384258003, 385218048, 384811592, 391490211, 394895706, 394126015, 397508392, 397999115, 401610031, 406385956, 407097626, 408676147, 410155754, 411431389, 414056931, 417186317, 420134125, 423509789, 426932487, 430471420, 437874336, 441516571, 431478653, 433683929, 438779526, 444690552, 447375031, 445889130, 448081245, 452039680, 455784645, 457565842, 459257812, 462529793, 466090698, 468284645, 469484291, 472749443, 477264252, 483634491, 485507011, 483567352, 489467278, 489749870, 487130394, 487020683, 492073975, 497108536, 501543121, 508482513, 502803497, 502636681]
3657.9E02636681N333557J843528K449952J905517K866898J782455J864968K257232
3665.6E22940788Q41904N071793M846572J857148R99717p667961J030731Q880845J0634384
3674.3E49435921K025375j6683502p4654P245865N016899j437225Q26034K650795K202683
3682.9E51208191K190552O41899M18625L997230P460060o818580n221825Q641434l798638
3691.6E58718948k057037N298080J604424J323471O18668J83334J089096M35524K528572
3700.3E69743080L047028l715744k577248M178352K100831N29327Q66089K287864N109330
3709E81568909n283928L126945O692238j5711670J681557N210724O82716L83415K207261
3717.7E80558167K818336l403816l52173O732864j667747n215340N068283J884766
$$ y = [502636681, 507970238, 509813766, 512263718, 514169235, 517036133, 518818588, 520683556, 522940788, 523782692, 528854485, 533701057, 535558205, 536557922, 528889961, 529920692, 538801537, 549435921, 551461296, 534777794, 534703140, 541949005, 546965904, 545528679, 546354713, 549005508, 551208191, 553398743, 554040642, 554459267, 558456497, 565916557, 559097977, 553876152, 562517586, 558718948, 556661911, 561959991, 563564415, 564887886, 565506554, 565689888, 566778984, 567214508, 569743080, 572790108, 569074364, 566497116, 570675468, 572776299, 573305626, 574171715, 576459579, 581568909, 576284981, 579411926, 586104164, 570392494, 572074051, 577284775, 577967491, 578350906, 580558167, 583376503, 579972687, 579620514, 586353378, 584685631, 579470291, 584538574, 586423340]
3725.4E86423340k47917j736412j055527K923622J016617O049309l87421q767166Q010330
3734E92228775K638855r130936j152420J895409M48341K136536L331337m196701J986008
3742.7E90185204J2985000n712433k0349769Q811111N589295N691871o8474r765281
3750.4E87366524J0637016l853455j0734977N474624M740181L113938n558586J310348
3758.2E92495613O813622n879898l380776L273239J256447l20930L601722r53903n116959
3766.8E91788177K255173N377083K571869q986435n09682L082238O04057R78660K7695
3775.5E97188835J285324N79033K785835R06716q049011J438903K192803Q02002K761383
3784.2F01891823k359276j890144M11644L94973J499367J43128q5717L19786l547n16548
$$ y = [586423340, 586175423, 584439011, 583383484, 586307106, 587323723, 593373032, 592985611, 584218445, 592228775, 594867630, 585736694, 584584274, 586479683, 586928024, 589064560, 592395897, 588199196, 590185204, 603170204, 597457771, 577108002, 585919113, 591508408, 597200279, 597131805, 587366524, 598003540, 594150085, 583415108, 588889732, 593629913, 596743851, 591185265, 592495613, 599309235, 593429337, 590048561, 593321800, 594578247, 594257317, 597859039, 596905136, 591788177, 594043350, 599420433, 601992302, 593005867, 592496185, 595578423, 596182480, 597161140, 597188835, 598474159, 599053192, 601839027, 602745743, 594696732, 596135635, 598328438, 599130440, 601891823, 599532547, 597642403, 598054047, 598449020, 599948387, 600091515, 600005798, 600325584, 600322037, 599805489]
3793.8E99805489J864624M574012l593979n141487K138634L878975O699753l958435
3801.5F06267586j1872368K366714K229729M383011O386719q591843n935669M331207
3809.3E99565086J773987K45705R20753N13230J097335M853364M19349j3694992L309441
3817.9E99003258N875091N341645O219253j7339172l081742M485856J971664L410149
3825.7F05886002M30412n050659m31443J571312K872353L219566p592582P56302P821617
3834.3F09482880m507866j455117Q419152o606789n782356P436333m530907k352829
3842.1F00102501O061249j573944m197312K016792K036744M06341J187401q62884J483650
3850.7F06660538N408478m035340L543816j4195709l242112J0357476L80592k427292
$$ y = [599805489, 601670113, 606244125, 602650146, 597508659, 599647293, 603526268, 610226021, 606267586, 594395218, 596761932, 598991661, 603374672, 609761391, 601169548, 595233879, 599565086, 601339073, 601584778, 602505531, 603018761, 604116096, 608969460, 609388809, 595693817, 599003258, 604878349, 610219994, 616439247, 599100075, 596018333, 600504189, 602475853, 605886002, 606316414, 601265755, 600834312, 602405624, 605277977, 608497543, 600904961, 601661263, 609482880, 604975014, 603519897, 611939049, 605332260, 599549904, 606986237, 602455330, 600102501, 606163750, 604589806, 600392494, 602409286, 604446030, 604852371, 606039772, 605176888, 606660538, 612069016, 608033676, 611577492, 597381783, 594139671, 604497147, 604877739, 602450447]
3858.4F02450447J090088J961746L256531m579506q19397O962242m140930p753944
3866.2E98427277K996254M803428O281014m626046j0816307K430344N450325M812775
3873.9F09759064q114968k035637L410111J32713K321663M842224l645553q729668
3881.6E97939949L941002K337341J024361M801903j1413651o96182M671211J782646
3889.3F04388580M662896K4108q353118P591L172035j185112R47990J011162J228676
3898F05904808K829323q086853L383369L028832n346337M331551k467575k739792N72815
3906.7F01410141M82903J437225n76019J54380k8038K58789L72811o48384P88307K372627
3916.3F06024742k565231m919396L460083J194954l379898K554474J930618N28069
$$ y = [602450447, 603540535, 605502281, 608758812, 604179306, 603359909, 610322151, 606181221, 598427277, 601423531, 606226959, 612507973, 607881927, 597065620, 599495964, 604946289, 609759064, 601644096, 599608459, 603018570, 603151283, 605472946, 610315170, 606669617, 597939949, 601880951, 604218292, 605242653, 610044556, 598630905, 597934723, 602605934, 604388580, 609051476, 609075584, 600722466, 600730057, 603902092, 602716980, 603664970, 604676132, 605904808, 608734131, 600647278, 604030647, 607059479, 601713142, 606044693, 603577118, 600837326, 601410141, 601893044, 603330269, 602754250, 602908630, 602880592, 603139381, 603512192, 602863808, 603652115, 606024742, 603459511, 598540115, 602000198, 603195152, 599815254, 602369728, 604300346, 604828415]
3924F04828415j577568l570976J405868K144165J062927j078376j244202J893501j372642
3932.7F02491112j194725J060905r11255J43662J091499l20320j040764l02925J853714
3941.4F02870903J426735l578377j146850J161766J35307J463852j325646L11051J009140
3950.1F02327881k811966J319733N99098r23691K91595o1721O98013o63834m09660
3958.7F00365448j00365K09351N88264n51872L43208m0702m59137K02407L06473K14615
3968.4F01077690o31065p38716J028404J275406p98188r85755n15366l50494O7405
3977.1E99429321K68708K21595M69513P69539j09482m31785j08490O60209j80473r79957
3986.7F00008698k7047l95279N36728M19350o91567m54826j488J049309J54610j74790
$$ y = [604828415, 603250847, 599679871, 601085739, 603229904, 604292831, 603214455, 601970253, 603863754, 602491112, 601296387, 602357292, 601446037, 601589699, 602681198, 602360878, 601320114, 601017189, 602870903, 604297638, 600719261, 599572411, 600734177, 600869484, 602333336, 601007690, 601318741, 602327881, 599515915, 600835648, 601434746, 600511055, 600802650, 600740929, 601438942, 600775108, 600365448, 600265083, 600474434, 601062698, 600510826, 600854034, 600813332, 600354195, 600556602, 600863075, 601077690, 600446625, 599707909, 600736313, 602011719, 601213531, 600227776, 599712410, 599361916, 599429321, 599698029, 599919624, 600389137, 601158676, 601049194, 600617409, 600508919, 601169128, 600988655, 600008698, 599981651, 599586372, 600123100, 600542450, 599850883, 599396057, 599394569, 600443878, 600598488, 600423698]
3996.3F00423698K21520k87895k24190K70424
4000.2F00403557
$$ y = [600423698, 600645218, 600357323, 600133133, 600403557]
##END=$$ End of the data block
