##TITLE=$$ Begin of the data block
##JCAMP-DX=5.00 $$ ACD/SpecManager v 10.08
##SPECTROMETER/DATA SYSTEM=Varian
##DATE=14 Jan 2013 10:50:06
##DATA TYPE=INFRARED SPECTRUM
##DATA CLASS=XYDATA
##ORIGIN=
##OWNER=
##NPOINTS=3735
##FIRSTX=399.26403809
##LASTX=4000.35498047
##MAXX=4000.35498047
##MINX=399.26403809
##MAXY=68.03878784
##MINY=18.90556908
##XFACTOR=1.0000000000
##YFACTOR=0.000000100000000
##FIRSTY=42.22165298
##DELTAX=0.96440572
##XUNITS=1/CM
##YUNITS=TRANSMITTANCE
##XYDATA=(X++(Y..Y))
399.3D22216530j1295319p959823j523209n484848j428909P428894p032051p047959
407C87873306M719429O690789J886177K175560M900093m756584l288918j628914r513435
415.7C89057503l236962M972077l29857r79805M471245m926186l740730J880836J675492
424.3C88843613L475227K246819K242965p896l356781l77960j70861r59472R08012
433C92843666m57611n563049l490181K576332J342315J628647J474076N65719J947632
441.7C92867546L87650r44291j417923l458633m667625Q39386L970985K401314J729660
450.4C91708069k853508l330536L386459J054383m090996k181931l71895j666603O25992
459.1C82279434J934166M746857J427383m499359k464599j934090m89617R00803l011131
$$ plain form
399.3 422216530 410921211 402961388 401438179 395953331 394524422 401953316 394921265 387873306
407 387873306 392592735 399283524 401169701 403345261 408245354 403488770 400199852 398570938 389057503
415.7 389057503 385820541 390792618 390462761 389482956 393954201 389028015 385287285 387168121 388843613
424.3 388843613 392318840 394565659 396808624 396800728 393443947 393065987 392895126 391935654 392843666
433 392843666 392386055 386823006 383332825 385909157 387251472 388880119 390354195 390919914 392867546
441.7 392867546 393255196 392310905 390892982 387434349 382766724 383606110 387577095 389978409 391708069
450.4 391708069 388854561 385524025 388910484 389964867 385873871 383691940 383320045 381653442 382279434
459.1 382279434 384213600 388960457 390387840 385888481 383423882 381489792 381000175 381900978 378889847
467.7C78889847k232971K022934J233940j783181r08432J731759L040428K658958n815239
476.4C78838043n687942K694893K325668K74124j339073j587372J603355P40281j530991
485.1C76330986l16009j265641k981643N39894J913185k472573k371368l45039r2621
493.8C68939171J889992K130317O33126J772537K15301l077545k56691R01871j267357
502.5C71880722k034607M53911L009300j909370k136193P28913k776375j614800o66885
511.1C64934616m90570K276344l31955j172866J364784k572975r69887K957496j303825
519.8C64691162k328148k454834o67648J198578j901016o99044K051544M70849j195946
528.5C59165497q30879k22931J40991N40199J53313O34346o88286j037674j103210
$$ plain form
467.7 378889847 376656876 378679810 379913750 378130569 377222137 378953896 381994324 384653282 378838043
476.4 378838043 373150101 375844994 378170662 378444786 377105713 375518341 377121696 377861977 376330986
485.1 376330986 376014977 374749336 371767693 372307587 374220772 371748199 369376831 369031792 368939171
493.8 368939171 370829163 372959480 373592606 375365143 375580444 372502899 372246208 373148079 371880722
502.5 371880722 369846115 370300026 373309326 371399956 369263763 369992676 367216301 365601501 364934616
511.1 364934616 364444046 366720390 366388435 365215569 366580353 364007378 363037491 365994987 364691162
519.8 364691162 362363014 359908180 359240532 360439110 358538094 357839050 359890594 360361443 359165497
528.5 359165497 358334618 358111687 358252678 358792877 358946190 359580536 358892250 357854576 356751366
537.2C56751366j809464Q01087J062164o57463m63562j198006p78885K530632N90439
545.9C56828308k428436n60570j87530l17040j336861n39703R4223m84772L95203o30569
555.5C50832253o73638j091003l27263m85230j373558L59497q53729n7106J014290
564.2C47344513J284790Q08411o78482L433r66149p51228n36995M48380J495857J36795
573.8C48589325K48260M44146L89366j440163k074890m82140O3096j50071N77088R18617
583.5C47082634j109962k22016l3455J42327K161979R85718m74091j611862j8120J356316
593.1C48259468J078873P39708l41835J224746M93431r58824k75650j8806l79791r79042
602.8C48842278J63307O89850l01781j434899j341743r21364j251793J5106P66297
$$ plain form
537.2 356751366 354941902 355742989 356805153 356147690 355684128 354486122 353707237 356237869 356828308
545.9 356828308 354399872 353839302 353651772 353334732 351997871 351458168 351552391 351067619 351462822 350832253
555.5 350832253 350158615 349067612 348740349 348255119 346881561 347241058 346387329 346330223 347344513
564.2 347344513 348629303 349437714 348759232 348762665 347796516 347045288 346508293 346956673 348452530 348589325
573.8 348589325 348837585 349281731 349671097 348230934 346156044 345673904 345737000 345586929 346164017 347082634
583.5 347082634 345972672 345750656 345717201 345859528 348021507 349007225 348533134 346921272 346903152 348259468
593.1 348259468 349338341 350078049 349736214 350960960 351454391 350495567 350219917 350201111 349821320 348842278
602.8 348842278 349005585 349695435 349393654 347958755 346617012 345695648 344443855 344458961 345225258
611.4C45225258n35240n69077R44710n04456j356506R4719o93550k85835J460533J351928
621.1C45132484K23580L53241N25360Q47778P67098K11487J796035J876908P29408
629.8C52463379Q01697R64775P71103J056289J764183J548920J412811R65691N45425
638.4C62294273Q80356J949120K185478J325607J053734L13530Q85468J429138N39894
647.1C72856598M90074P88422P83577Q83674J044464O31562J234893J038552L62816
655.8C80114632K79350j669540j556817J6900J56784J56555l05977J61438M58412M65012
665.4C78276749J299133K483520J298981l313904j478881M23355J433792J002006J410637
674.1C82835388O82945O22521J407127J30921J89552J451225J879578J466217J539459
$$ plain form
611.4 345225258 344690018 344120941 345065651 344561195 343204689 343299408 342605858 342320023 343780556 345132484
621.1 345132484 345356064 345709305 346234665 347082443 347849541 348061028 349857063 351733971 352463379
629.8 352463379 353265076 354229851 355000954 356057243 357821426 359370346 360783157 361748848 362294273
638.4 362294273 363174629 365123749 367309227 368634834 369688568 370002098 370887566 372316704 372856598
647.1 372856598 373346672 374135094 374918671 375802345 376846809 377478371 378713264 379751816 380114632
655.8 380114632 380393982 378724442 377167625 377184525 377341309 377497864 377191887 377353325 377811737 378276749
665.4 378276749 379575882 382059402 383358383 380044479 378565598 378988953 380422745 381424751 382835388
674.1 382835388 383518333 384140854 385547981 385678902 385868454 387319679 389199257 390665474 392204933
682.8C92204933J357155O77757J181221O74897P24372Q53691p6980P86552R92928M39186
692.4C99815712Q78029J409950R00879k30598O1340N36995L52020R88808J173897K51503
702.1D06138535N44128O69861k10877L90892J116181J942177J438751l56560R14421
710.8D12587509J596337R66262Q66547j78757l42026P4463J051751J060676N00260
719.5D18183022J200637N42336K85416L16123L87078J268654R77096N04112J74141
728.1D23838615R12743J678886M40445K67754J053543J360703J192245q3160j80207
736.8D30481567O02761P51419J156196Q29659j62888o85119P43789J260147O4278J096878
746.5D36138687J145439K66228p0877K00157R83543Q03719J188736R2392k14310Q62122
$$ plain form
682.8 392204933 393562088 394239845 395421066 396095963 396820335 397674026 397597046 398383598 399376526 399815712
692.4 399815712 400693741 402103691 403004570 402773972 402835312 403372307 403724327 404713135 405887032 406138535
702.1 406138535 406682663 407352524 407141647 407532539 408648720 410590897 412029648 411673088 412587509
710.8 412587509 414183846 415150108 416016655 415837898 415495872 415570335 416622086 417682762 418183022
719.5 418183022 419383659 419925995 420211411 420527534 420914612 422183266 423160362 423664474 423838615
728.1 423838615 424751358 426430244 426870689 427138443 428191986 429552689 430744934 430661774 430481567
736.8 430481567 431084328 431835747 432991943 433821602 433658714 432973595 433717384 434977531 435041809 436138687
746.5 436138687 437284126 437550354 437479477 437679634 438663177 439466896 440655632 440748024 440533714 441395836
756.1D41395836J358795K186317J223374J070480J629105J009636j44081K70691J135635
764.8D51135788N35278J784058J363525N5428N836j71623k55470l99094O83785j93215
774.4D54544296p47070K46887N18952M43916J38054J95465m79241O13671J268768p9841
784.1D56663857j263199j54114K321892N43708r12551k60353Q41445Q31070k89230
792.7D58322525L93028l90358m87137J10245n51452r99146n08652k58674p78122l79524
802.4D54472733j011200q41065j463394k188492o61888q86879j619530k256355j748466
811.1D41795464r18503j179810j712761j790848l51715j8119n01938n42221j80817
819.7D34598732J33514L968M24118J359062K708588K719001K068863K525521L344612
$$ plain form
756.1 441395836 442754631 444940948 446164322 447234802 448863907 449873543 449729462 450000153 451135788
764.8 451135788 451671066 453455124 454818649 454874077 454879913 454708290 454452820 454053726 454737511 454544296
774.4 454544296 453797226 454044113 454563065 455006981 455145035 455340500 454861259 455474930 456743698 456663857
784.1 456663857 455400658 455246544 457568436 458112144 457199593 456939240 457780685 458611755 458322525
792.7 458322525 458715553 458325195 457838058 457948303 457396851 456397705 455889053 455630379 454852257 454472733
802.4 454472733 453461533 452620468 451157074 448968582 448306694 447419815 445800285 443543930 441795464
811.1 441795464 440876961 439697151 437984390 436193542 435841827 435823708 435321770 434779549 434598732
819.7 434598732 434732246 434736214 435160332 436519394 439227982 441946983 444015846 446541367 449885979
828.4D49885979L343887K349472J484299J483421K822723L027916K925797K575684
836.1D69899178K466011K605323J295891J961594J001472O40641J875190K069245K217979
844.8D86032524K91634J293869K078781J080017R26170R4109N32303J402893J404953
853.5D95137253P39403J593818J777230J467742J151429J236076J636353j06697Q62922
862.2E05495529P67517j08947J53808M04930O62728j256905q60710j074143p92999
870.9E03390808o94618j864395j552544j662331m33006j056175j010513l85514l52249
879.5D94379463l19595j217880p19529j606216p27882k68898r48220r19571j014900
888.2D86636772R9945n11474K26707K136r88083l03917J67428N77049J76163P39212
$$ plain form
828.4 449885979 453229866 455579338 457063637 458547058 461369781 464397697 467323494 469899178
836.1 469899178 472365189 474970512 476266403 478227997 479229469 479870110 481745300 483814545 486032524
844.8 486032524 486324158 487618027 489696808 490776825 491702995 491797104 492329407 493732300 495137253
853.5 495137253 495876656 497470474 499247704 500715446 501866875 503102951 504739304 504632607 505495529
862.2 505495529 506263046 506154099 506307907 506712837 507375565 506118660 505257950 504183807 503390808
870.9 503390808 502696190 500831795 499279251 497616920 497183914 496127739 495117226 494731712 494379463
879.5 494379463 494059868 492841988 492122459 490516243 489788361 489519463 488571243 487651672 486636772
888.2 486636772 486736717 486225243 486451950 486454086 485466003 485162086 485329514 485906563 486082726 486821938
897.9D86821938k86293q34160n19104k10762K92015K32391J630058J214638J854057
906.5D90194778K311211K032356K032318R50966J249543p50313o89011J60332r24759
915.2D96567421j663971j832237q30384k194252k827987l031769k453804j749344k612610
923.9D77371063k341041k036286j839866l089600l227997k811584k854882k376823
931.6D56792984k314072j818847k237168j700248j015625k71454o62804j697883l49694
940.3D44725189j260643j702423j309547j692162j301651j073303q03490j251640m16222
949D33914108o599n78957o61430p51763m64134r87320j268654j568985j750946k041816
958.6D23833504k088204j744995k141647k065010k143555j859474j880188j970329
$$ plain form
897.9 486821938 486535645 485701485 485182381 484971619 485263634 485496025 487126083 488340721 490194778
906.5 490194778 492505989 494538345 496570663 497521629 498771172 498020859 497331848 497492180 496567421
915.2 496567421 494903450 493071213 492240829 490046577 487218590 484186821 481733017 479983673 477371063
923.9 477371063 475030022 472993736 471153870 468064270 464836273 462024689 459169807 456792984
931.6 456792984 454478912 452660065 450422897 448722649 447707024 447435570 446772766 445074883 444725189
940.3 444725189 443464546 441762123 440452576 438760414 437458763 436385460 435581970 434330330 433914108
949 433914108 433907509 433328552 432667122 431915359 431451225 430463905 429195251 427626266 425875320 423833504
958.6 423833504 421745300 420000305 417858658 415793648 413650093 411790619 409910431 407940102
966.3D07940102j610146k007255k017823j819343k036133k845383k659912k637253
974.1C90306854l495178l215141l337441l458404l710862m259796l796272l928947
981.8C61104813m459420m847755n309601m561615m108696m075165l683815l367042
989.5C26691704l202286l805351l654919k911835k229728k623978l118706k582664
997.2C02562237k679215k862320k918586k395821k547073k474537k632046k692070
1004.9B81360569j359062k096329k041016k033615j853962p75699j365891j513862
1012.6B68321133j791802k180023k991371k099304j142426j750946k181759k544975
1020.3B51638527j462650j931382j697483j476612j992187j770916j932068j445294
$$ plain form
966.3 407940102 406329956 404322701 402304878 400485535 398449402 395604019 392944107 390306854
974.1 390306854 386811676 383596535 380259094 376800690 373089828 368830032 365033760 361104813
981.8 361104813 356645393 351797638 346488037 341926422 337817726 333742561 330058746 326691704
989.5 326691704 323489418 319684067 316029148 313117313 310887585 308263607 305144901 302562237
997.2 302562237 299883022 297020702 294102116 291706295 289159222 286684685 284052639 281360569
1004.9 281360569 280001507 277905178 275864162 273830547 271976585 271200886 269834995 268321133
1012.6 268321133 266529331 264349308 261357937 259258633 258116207 256365261 254183502 251638527
1020.3 251638527 250175877 248244495 246547012 245070400 243078213 241307297 239375229 237929935
1028.1B37929935j630325p5436q29963j447849l42007n70374M54560m41285L50438
1036.7B33397694J143360J310043J567421J270027J784840R68056J448688O21891Q8844
1045.4B43600864m58450q59375r3346j279754o32038n64499l06778r93309j289082
1054.1B37124233m29249j373710n77374j207905r2105J003265O73294R84097P24887
1062.8B36829433J727944J827049K167454J406917J280404P05852r3822J123218Q04672
1071.5B47779121Q91457K05536J98746M76245M55094K74467L6927J169376M24747N47543
1081.1B52459259K02694O70700J898117J420021J136360N99614J414165J125183J275349
1089.8B62201462R92832J266994K283326J095028J624317J066379R95083J408787J259327
$$ plain form
1028.1 237929935 236299610 236224174 235394211 233946362 233604355 233033981 233488541 233047256 233397694
1036.7 233397694 234541054 235851097 237418518 238688545 240473385 241441441 242890129 243512020 243600864
1045.4 243600864 243142414 242283039 242189693 240909939 240277901 239713402 239406624 238413315 237124233
1054.1 237124233 236694984 235321274 234743900 233535995 233443890 234447155 235120449 236104546 236829433
1062.8 236829433 238557377 240384426 242551880 243958797 245239201 245945053 245851231 246974449 247779121
1071.5 247779121 248670578 248876114 249074860 249551105 250006199 250280666 250317593 251486969 251911716 252459259
1081.1 252459259 252661953 253332653 255230770 256650791 257787151 258386765 259800930 260926113 262201462
1089.8 262201462 263194294 264461288 266744614 267839642 269463959 270530338 271525421 272934208 274193535
1098.5B74193535J311951P69100J332435R75228J254425J582870J744194J232128P65648
1107.1B85161514J359368L79753J30634L20358R89342Q16078J059361J309662L70788
1115.8B91896858J708794P51858m64631k06775J964K98577j3428O32439L31382O42510
1125.5B95579548O88286O58378J115761J104050J684055J245575J583233J944618K422371
1134.1C08025875K317829J401730J520519J628075J823044J261844J300278J367817
1141.9C20647011J249161J210861R35631J154670N98755L96652r6283K27929R17205
1150.5C27241592K94419N31349L57819N4206k29988o20308m93393l38249q03337j320991
1160.2C24673119k35711N14298M78668O8932N07660J442184J832161K341385J644401
$$ plain form
1098.5 274193535 275505486 276274586 277607021 278582249 279836674 281419544 283163738 284395866 285161514
1107.1 285161514 286520882 286900635 287031269 287351627 288340969 289157047 290216408 291526070 291896858
1115.8 291896858 293605652 294357510 293892879 293686104 293688068 293986645 293973217 294605656 294937038 295579548
1125.5 295579548 296267834 296926212 298041973 299146023 300830078 302075653 303658886 305603504 308025875
1134.1 308025875 310343704 311745434 313265953 314894028 316717072 317978916 319279194 320647011
1141.9 320647011 321896172 323107033 324042664 325197334 325796089 326192741 326096458 326324387 327241592
1150.5 327241592 327536011 328067360 328425179 328479385 328249397 327629089 327135696 326797447 325994110 324673119
1160.2 324673119 324437408 324951706 325430374 325499306 326006966 327449150 329281311 331622696 333267097
1168.9C33267097K016030K784004K905808L305969L317642K648506K218933K643929
1176.6C55107918K484550K569008K825508K908974K334480J962662K399521K138405
1184.3C74731026J519317J027298J063118O01387P38411J133576P77549O51322k35672
1193C82007332m45252m5471n07469j003647j242103j203576r62371q76847o62384n45578
1202.6C74512634j197357j452026r04122j072845j481552p67746j35842o69403n76973
1211.3C66254768j52397n87959j73493r5825q67271q31795o88705o89736o07414n75294
1220.9C60984879m02108K2850k50740q45909j030197j253319n88341k12440o08482
1229.6C55816193p54090q63151n59464o30569n08232j21575m29535m94384k68746k16408
$$ plain form
1168.9 333267097 335283127 338067131 340972939 344278908 347596550 350245056 352463989 355107918
1176.6 355107918 357592468 360161476 362986984 365895958 368230438 370193100 372592621 374731026
1184.3 374731026 376250343 377277641 378340759 378942146 379680557 380814133 381591682 382243004 382007332
1193 382007332 381562080 381516609 381009140 380005493 378763390 377559814 376597443 375720596 375058212 374512634
1202.6 374512634 373315277 371863251 370959129 369886284 368404732 367636986 367501144 366831741 366254768
1211.3 366254768 366102371 365514412 365340919 365245094 364377823 363546028 362857323 362167587 361560173 360984879
1220.9 360984879 360582771 360605621 360354881 359508972 358478775 357225456 356637115 356424675 355816193
1229.6 355816193 355062103 354198952 353639488 353008919 352500687 352379112 351949577 351455193 351186447 350970039
1239.3C50970039j6594P1412j25885j33362l03765l395Q9722n27344r35821r81560
1248.9C48103447P0267L23829r9754j717j29165j88370m97894l77579k12631j81465
1258.5C46808968p2289M14581Q16422L20282L98292K03057L78914M07905K41432Q40073
1268.2C50757637M91219P22847J102180J171684J231118R44709J152192Q98132P40433
1276.9C59212151J362304J218643N07317Q30116J577225J599922J205826J352348J644593
1285.5C70510445J541938J378136J035996J119995J163330J050834Q75092R25636R94988
1294.2C80596390Q52318O64634K77596P33681P51686P63321M76379m9095O46248K83470
1303.9C85996628r5940p0572p8850K8420l62244o03065m95377k95677m71344l10287
$$ plain form
1239.3 350970039 350953445 351024857 350898972 350765610 350461845 350458450 350548172 350020828 349085007 348103447
1248.9 348103447 348173714 348497543 348397789 348396072 348266907 348078537 347580643 347203064 346990433 346808968
1258.5 346808968 346736679 347151260 347967682 348287964 348686256 348889313 349268227 349676132 349917564 350757637
1268.2 350757637 351248856 351971703 353073883 354245567 355476685 356421394 357573586 358471718 359212151
1276.9 359212151 360574455 361793098 362300415 363130531 364707756 366307678 367513504 368865852 370510445
1285.5 370510445 372052383 373430519 374466515 375586510 376749840 377800674 378675766 379601402 380596390
1294.2 380596390 381448708 382113342 382390938 383124619 383876305 384639626 385116005 385066910 385713158 385996628
1303.9 385996628 385900688 385830116 385751266 385779686 385417442 384814377 384319000 384023323 383551979 383241692
1313.5C83241692m19236m04510P8697L30505N91698K21825K53143M01993P10831J088218
1323.2C86094856Q20809N96237J88637L16124K39830J80168j50757n19371j82533k63787
1332.8C87320213m66194q58459m67301k11677M7340N88455J75476J67122m9324N73235
1342.4C86818886Q13942N02357Q44193O71158O35948K14348O9084j64223j47400j23329
1352.1C90134964j39923J72806p69310o14472K1744J03760l35541k49252k43645j164551
1361.7C86916580j9722n89027n73883J59263k80685k72560j035500o28204l05634q03833
1371.4C82566795J2207Q24662j4000n48821K13471J19972k9602q25348o34689p67594
1381C80917053j029320n48706j114387p81212m72755l34893j835251j639823o35148
$$ plain form
1313.5 383241692 382822456 382417946 382496643 382827148 383418846 383640671 383893814 384295807 385006638 386094856
1323.2 386094856 386915665 387511902 387700539 388016663 388256493 388436661 388285904 387766533 387584000 387320213
1332.8 387320213 386854019 385995560 385528259 385316582 385363922 385952377 386127853 386294975 386245651 386818886
1342.4 386818886 387632828 388135185 388979378 389650536 390286484 390500832 390569916 390405693 390258293 390134964
1352.1 390134964 389995041 390167847 389398537 388784065 388805809 388909569 388574028 388324776 388081131 386916580
1361.7 386916580 386896858 386307831 385733948 385893211 385612526 385339966 384304466 383676262 383370628 382566795
1371.4 382566795 382579002 383403664 383389664 382840843 383054314 383174286 383144684 382319336 381684647 380917053
1381 380917053 379887733 379339027 378224640 377443428 376970673 376635780 374800529 373160706 372525558
1389.7C72525558k033157j804352j231002q62198k146073l568535j500892j468430
1397.4C57910919j351776k724609k650414j663437j924591j319275j314926k475929
1405.1C42485962k124939q97331j578102j888619j399422j619644j304168j774292
1412.8C29899445j457024o09512k67868m7722k47574R16252k802353j617012J017952
1421.5C24784584N0659N51605p75680L97873J216545O47316J349220O80809N88684
1430.2C29491615N36766J593056J228905R64432K460060K208175R21784L43323K512702
1438.9C42260818J936951J564865J639138R55352J575547R90142J948777J920242J882362
1447.6C56674194R03130P76749K133140O91834J296577J226120J780586K306633J254349
$$ plain form
1389.7 372525558 370492401 368688049 367457047 366594849 364448776 360880241 359379349 357910919
1397.4 357910919 356559143 353834534 351184120 349520683 347596092 346276817 344961891 342485962
1405.1 342485962 340361023 339463692 337885590 335996971 334597549 332977905 331673737 329899445
1412.8 329899445 328442421 327832909 327565041 327517319 327269745 328185997 325383644 323766632 324784584
1421.5 324784584 324835243 325386848 324611168 325009041 326225586 326872902 328222122 328902931 329491615
1430.2 329491615 330028381 331621437 332850342 333814774 336274834 338483009 339404793 339748116 342260818
1438.9 342260818 344197769 345762634 347401772 348357124 349932671 350922813 352871590 354791832 356674194
1447.6 356674194 357577324 358354073 360487213 361179047 362475624 363701744 365482330 367788963 369043312
1456.2C69043312J541519L58544K875862J200294K261772J917115J600074K909623
1464C83708115R89723J532211J907921K961273K649574K557831L819886L071708L258553
1472.6D06456795J464996K742462L369904K569389K411499K545395K616234K481460
1480.3D26658134J878319R27811J564217J638526J353226J753273O64215N08385K369423
1489D39315529M64783k273255k81791K33383p04995n19485L96080l951340l48854r41696
1498.7D31388359l563499m02031j061707j475181q62618J214600R75189m334602k873269
1507.3D19005241L95813J128426j222343M96597j90087k121772m70162m44488M56581
1516D17033806j173592l114547J187973K221756p86171j287003N08423L967J582909
$$ plain form
1456.2 369043312 370584831 370943375 373819237 375019531 377281303 379198418 380798492 383708115
1464 383708115 384697838 386230049 388137970 391099243 393748817 396306648 400126534 403198242 406456795
1472.6 406456795 407921791 410664253 414034157 416603546 419015045 421560440 424176674 426658134
1480.3 426658134 428536453 429464264 431028481 432667007 434020233 435773506 436437721 436946106 439315529
1489 439315529 439780312 437507057 437225266 437458649 436753654 436234169 436630249 432678909 432330055 431388359
1498.7 431388359 427824860 427422829 426361122 424885941 424023323 425237923 426213112 421878510 419005241
1507.3 419005241 419401054 420529480 419307137 419803734 419613647 417491875 417021713 416577225 417033806
1516 417033806 415860214 412745667 413933640 416155396 415369225 414082222 414590645 414594612 416177521
1524.7D16177521r74655k03743P70416m71535N09415R00688J256599J363793Q85734
1533.4D20214233l098716K85377R48486J003762K981949O57730m095040m68101R66415
1542.1D19396095k16102M99649P39402j390800J227074N46417J207352N96923j711959
1550.7D20894051L87268L68499J342926k103805n56679K127724K281074K93618n974350
1559.4D19060326k733956p91511Q37516j025962j030121k708130l291969j196213j226540
1568.1D05893440P27043p617759l270989j909179l512764k609253k347794m67377j1421775
1576.8C73463593k536278l263207l973007l567734n193062l272933n323983l454933
1584.5C42878456n459900m709320l908882m784546l050918n230046k810383n111293
$$ plain form
1524.7 416177521 415202866 414999123 415769539 415298004 415807419 416708107 417964706 419328499 420214233
1533.4 420214233 417115517 417400894 418349380 419353142 422335091 422992821 418897781 418429680 419396095
1542.1 419396095 419179993 419679642 420419044 419028244 420255318 420801735 422009087 422606010 420894051
1550.7 420894051 421281319 421649818 422992744 420888939 420332260 422459984 424741058 425034676 419060326
1559.4 419060326 416326370 415534859 416372375 415346413 414316292 411608162 408316193 407119980 405893440
1568.1 405893440 406620483 399002724 395731735 393822556 390309792 387700539 385352745 384885368 373463593
1576.8 373463593 370927315 367664108 363691101 360123367 354930305 351657372 346333389 342878456
1584.5 342878456 337418556 332709236 328800354 324015808 320964890 315734844 312924461 307813168
1592.2C07813168l276844l861599m556351k547493m724522j807346m435577k201424
1599.9B80402012l044014k905884j552639m010448j345883l428020j013813k792702
1607.6B60308609j128368r40075l063526J84574k428360M2724j739120O54850M15745
1616.3B52307053o873131J571159p05604J325721j029815J712265M15058k816029J236897
1625B47143574m45805K028923j523666J024017O57578P82852J520920J06964K719326
1633.7B54014683Q55884K332154k148571J272792P25422R89209K614078k9621K202778
1642.4B62828808N84965K428035K246914N91202L064957k135315K536716R22699K902012
1651B75970993K217426j604442R35707K14901M220390J336556K289524J227150J980095
$$ plain form
1592.2 307813168 304536324 300674725 296118374 293570881 288846359 287039013 282603436 280402012
1599.9 280402012 277357998 274452114 272899475 268889027 267543144 264115124 263101311 260308609
1607.6 260308609 259180241 258240166 255176640 255361214 252932854 252975578 251236458 251891308 252307053
1616.3 252307053 245433922 247005081 246299477 247625198 246595383 248307648 248722706 245906677 247143574
1625 247143574 246697769 248726692 247203026 248227043 248884621 249667473 251188393 251295357 254014683
1633.7 254014683 254870567 257202721 255054150 256326942 257052364 258041573 260655651 260626030 262828808
1642.4 262828808 263413773 265841808 268088722 268679924 271744881 269609566 272146282 273068981 275970993
1651 275970993 278188419 276583977 277519684 277734585 281954975 283291531 285581055 286808205 288788300
1659.7B88788300K026653J628647K871437k21615L629799J996231K421303L011226
1667.4C06151981L063908L191299K60716M372387J538029L603191L878136K619400
1675.1C28679047K528762L002854M685058L122864M145508K316208M751015O653022
1682.9C59884338L297120L810806O17943N934639M660415L985062M502487K958603
1690.6C89651413M571114M811630N343208N539055N979462J617851M445763O044197
1698.3D28003693O187477N653190l470192O843796N796395M643592L519593L548507
1706D60726051K570877K078438M054337L108368K398986K396927K550049L896866K394295
1714.7D86175194J175957L970680L379135n059929J431503L186112K341995K671013
$$ plain form
1659.7 288788300 290814953 292443600 295315037 295093422 298723221 300719452 303140755 306151981
1667.4 306151981 309215889 312407188 312667904 317040291 318578320 322181511 326059647 328679047
1675.1 328679047 331207809 334210663 338895721 342018585 346164093 348480301 353231316 359884338
1682.9 359884338 363181458 366992264 367610207 373544846 378205261 382190323 386692810 389651413
1690.6 389651413 394222527 399034157 404377365 409916420 415895882 417513733 421959496 428003693
1698.3 428003693 434191170 439844360 436374168 443217964 449014359 453657951 457177544 460726051
1706 460726051 463296928 465375366 469429703 472538071 474937057 477333984 479884033 483780899 486175194
1714.7 486175194 487351151 491321831 494700966 489641037 491072540 494258652 496600647 499271660
1722.4D99271660J554108L94134J266480J600532J260986J639023K583885L38517q9455
1731.1E09819870M154587N299301l96538o237907L840103M221916K142563L120804
1738.8E25964699J573028j164169L932457L753662J593933J652985L513412M029579
1746.5E44849586L245812K976379J932679M720878K149391R15566N284691L456115
1754.2E69531097L646088M070969M59060K035752L601494L083267L553581k16675M71153
1762.9E90235786M005051K377396J898002K546997K229195j468506K225838N021782
1770.6F09071541J649170j189804j584854L983802K663956q80508J699218J432686
1778.3F16845207K445374J209831m77753J398316K141037K135582n11208k07138J690292
$$ plain form
1722.4 499271660 500825768 501219902 502486382 504086914 505347900 506986923 509570808 509909325 509819870
1731.1 509819870 513974457 519273758 518877220 512639313 516479416 520701332 522843895 525964699
1738.8 525964699 527537727 526373558 530306015 534059677 535653610 537306595 540820007 544849586
1746.5 544849586 548095398 551071777 553004456 557725334 559874725 560790291 566074982 569531097
1754.2 569531097 573177185 577248154 577707214 579742966 583344460 586427727 589981308 589764633 590235786
1762.9 590235786 594240837 596618233 598516235 601063232 603292427 601823921 604049759 609071541
1770.6 609071541 610720711 609530907 607946053 611929855 614593811 613713303 615412521 616845207
1778.3 616845207 619290581 620500412 620022659 621420975 623562012 625697594 625186386 624979248 626669540
1787F26669540J245079P99599K100983K003135J524277k098007j574554M144859J790848
1795.7F36605759m72184J078568J940117O71158r18846K246627J08261L83225J705017
1804.4F43347702O83823J139526P32117M79049Q43354J811294p04574L051J343308
1813F49678650M51813J335907L51028Q52737j75933L31344J421280M31671J194992
1821.7F55873489l38668J137008J755371k092895r4071K169953K532501N89676l835602
1830.4F57696762J17264K543335L82690M60205N90439M90647Q25424m85688P40357
1839.1F63361435K89459O78635O81839J926117J936645o009598J287461K606582K34833
1847.8F66993408m35715n950R39102L07922Q80890o3095J45492K37122J27716O66885
$$ plain form
1787 626669540 627914619 628714218 630815201 632818336 634342613 632244606 630670052 634814911 636605759
1795.7 636605759 636133575 637212143 639152260 639823418 638904572 641151199 641259460 641642685 643347702
1804.4 643347702 644031525 645171051 645903168 646382217 647225571 649036865 648332291 648335342 649678650
1813 649678650 650130463 651466370 651817398 652670135 652494202 652825546 654246826 654678497 655873489
1821.7 655873489 655534821 656671829 658427200 656334305 656240234 658410187 660942688 661532364 657696762
1830.4 657696762 657814026 660357361 660740051 661200256 661790695 662281342 663106766 662621078 663361435
1839.1 663361435 663650894 664329529 665011368 666937485 668874130 662864532 664151993 666758575 666993408
1847.8 666993408 666557693 666551743 667490845 667798767 668679657 668616562 668762054 668999176 669126892 669793777
1857.4F69793777k5863N84411j2512M34952P4615J33362M23737R0408J140366L03345
1867.1F72940598J241531o34232j859054P38296Q07801O47125j68991L61557j79062
1875.7F73895569L8376K91290J36642L01133j62125P23648j94397J58157J21537j93329
1885.4F75116501K66952l9825J729813K67639j996765O0501R97390K61918L35540K26059
1895F77225723j034317M86222L39737M43267K73743j54495N76095m62494n0125j52
1904.7F77643204J63803K64206O4621N26428J94855l16239k22320J029663l03574k52838
1914.3F78791809K7618j24816J693267j452941j356659R39712O64673J057205m85992
1923F79753876j373291n0431O67878K53830L70330l2196o8969j9608k83890J15280
$$ plain form
1857.4 669793777 669767914 670352325 670339813 670774765 670849380 670982742 671406479 671496887 672637253 672940598
1867.1 672940598 674182129 673547897 671688843 672427139 673234940 673882065 673713074 674074631 673895569
1875.7 673895569 673933945 674225235 674361877 674663010 674500885 675224533 675030136 675188293 675309830 675116501
1885.4 675116501 675383453 675343628 677073441 677341080 675344315 675404816 676402206 676664124 676999664 677225723
1895 677225723 676191406 676677628 677017365 677460632 677734375 677579880 678155975 677693481 677643356 677643204
1904.7 677643204 677807007 678071213 678135834 678662262 678857117 678540878 678318558 679348221 679044647 678791809
1914.3 678791809 678819427 678694611 680387878 678934937 677578278 678517990 679182663 680239868 679753876
1923 679753876 678380585 678330154 678998032 679251862 679622192 679589996 679521027 679501419 679217529 679332809
1932.6F79332809o27288J81121J70670M7531J24054l91388L71018J3733J153030p6523
1942.3F80298767k848740J4496J021195O7749k22779L83606n2566J2588J8540k32010
1951.9F78460846j70593k27127K42767j39160K0904k45514j22146J63498j15280K15759
1961.6F78083954m12522l09448k53753K46429N47409j61743l19061j44577J72577l40577
1971.2F77108688J17951k65351l27072J38245l71704L54004K56195L92914j87302m18701
1980.8F76797867j14975n72891j08261l39127J52206L55683L94516j09406o11572L89786
1990.5F76233826J9531p49054p34024K63596q240j39237J63193j37100N26504m18090
2000.1F75020905l03040j30081m02985n0888j25809K05079o32630m73099k6168L71933
$$ plain form
1932.6 679332809 678705521 678886642 679057312 679104843 679228897 678837509 679208527 679222260 680375290 680298767
1942.3 680298767 677450027 677464523 678485718 678553467 678330688 678714294 678661728 678674316 678692856 678460846
1951.9 678460846 678290253 678063126 678305893 678166733 678187637 677942123 677819977 677983475 677868195 678083954
1961.6 678083954 677671432 677361984 677108231 677354660 677902069 677740326 677421265 677276688 677449265 677108688
1971.2 677108688 677226639 676961288 676634216 676772461 676400757 676754761 677010956 677403870 677216568 676797867
1980.8 676797867 676682892 676110001 676001740 675662613 675814819 676170502 676565018 676455612 675844040 676233826
1990.5 676233826 676253357 675504303 674770279 675033875 675025635 674886398 675049591 674912491 675438995 675020905
2000.1 675020905 674717865 674587784 674184799 674133911 674008102 674213181 673580551 673107452 673081284 673453217
2009.8F73453217J20620p28683k96860k80304K91367J90735m29612q80432r7885L03421
2019.4F71645584l68042K00653l66440k66113l28751k54745K17972m18015j80969k15607
2029.1F69665527K65122j19629l52631j63345k00424k3422n87388K2660m13437k37122
2038.7F67855911K17514M7455J00327m63181n2795o59943j89972q9645k59934K10419
2048.4F66716156m56161M272j6480K12250l58124k26440J1139q04062J46027p7134
2058F65151443M3869j47171q6746J64871m8751L98330o07681k98996j43738q4305R461
2068.6F64350586j43433J89286j78376K37275l91922j65711O638k02790J24894m37699
2078.2F63388748k07901m18777L03650O6299l35007Q0796l90702l6316m41131k31705
$$ plain form
2009.8 673453217 673573837 672845154 672548294 672267990 672559357 672750092 672320480 671440048 671342163 671645584
2019.4 671645584 671277542 671478195 671111755 670845642 670516891 670262146 670480118 670062103 669881134 669665527
2029.1 669665527 669930649 669811020 669458389 669295044 669094620 669071198 668483810 668506470 668093033 667855911
2038.7 667855911 668073425 668120880 668221207 667758026 667705231 667045288 666855316 666765671 666505737 666716156
2048.4 666716156 666259995 666264267 666247787 666460037 666101913 665875473 665886612 665082550 665228577 665151443
2058 665151443 665195312 665048141 664961395 665126266 665077515 665475845 664868164 664569168 664425430 664341125 664350586
2068.6 664350586 664207153 664396439 664218063 664455338 664063416 663897705 663904343 663701553 663826447 663388748
2078.2 663388748 663180847 662762070 663065720 663132019 662797012 662877808 662487106 662450790 662009659 661777954
2087.9F61777954j36337L2501J00174k01874J66855l93372k48260l50800J1826j32751
2097.5F60625916l93296K33994k06757p1182k64282L4332l44620n00870K03019n5695
2107.2F59260559r0408n00183J65329r9945k70234k0828l89404K96249j71051l49426
2116.8F57830658k91596J01777n7373l24097J11084l66287M1351j22223K27737R2240
2126.5F57243271o34918l44315m00162K03781L11890M94843o9580m40140k70310l71017
2136.1F55723343J04217j82190K76185K53295L10059r460n19410K62375K0371j32523
2145.8F56106262m02374K8534Q1100J36567J94244m45099L44696j55029j3047P2098
2155.4F55947952l15170R7809m4403K78854l52249j43051K77176K27813K4262k00577
$$ plain form
2087.9 661777954 661641617 661674118 661774292 661572418 661739273 661345901 661097641 660746841 660758667 660625916
2097.5 660625916 660232620 660466614 660259857 660188675 659924393 659958725 659614105 659113235 659316254 659260559
2107.2 659260559 659170151 658669968 658835297 658735352 658465118 658444290 658054886 658351135 658180084 657830658
2116.8 657830658 657539062 657640839 657583466 657259369 657370453 657004166 657045517 656923294 657151031 657243271
2126.5 657243271 656608353 656264038 655863876 656067657 656379547 656874390 656804810 656364670 656094360 655723343
2136.1 655723343 655827560 655645370 655921555 656174850 656484909 656475449 655956039 656218414 656238785 656106262
2145.8 656106262 655703888 655732422 655813522 655950089 656144333 655699234 656043930 655888901 655875854 655947952
2155.4 655947952 655632782 655730591 655686188 655965042 655612793 655469742 655746918 655974731 655998993 655798416
2165F55798416M3259l92761K10418j15432j39466M01535K89383M86450M0436p1182
2174.7F56551056n14679m7531j0376j77536M1885l28979M73785L14560J37634m7073
2184.3F56392746P3853K32772j02081l2806n95627L17154L02200Q1101K70538j86005
2194F56753845K43530J8616j44195n03922K50702M19235p3776L92075l0976n9738l27759
2204.6F56937637J03455j831m3945M11987j40381M2419k62603R0408O409P8430L10974
2215.2F57532959l13644n8899l90244J39618K92587N5542M1733j18942N4169j31302
2224.8F57103577J59835k55813K46963K73667l42942k9525l3570K31476k12250l1967
2234.5F57109451l03650R2240N63431l97873j4649n0735P4691k52761k35138P2555
$$ plain form
2165 655798416 655841675 655448914 655659332 655543900 655404434 655805969 656095352 656581802 656622238 656551056
2174.7 656551056 656036377 655988846 655978470 655800934 655842819 655513840 655987625 656302185 656439819 656392746
2184.3 656392746 656466599 656699371 656597290 656564484 655968857 656286011 656588211 656669312 656939850 656753845
2194 656753845 656997375 657015991 656871796 656367874 656618576 657037811 656964035 657356110 657325134 657265396 656937637
2204.6 656937637 657041092 657039261 656995316 657407303 657266922 657309341 657046738 657137146 657143555 657221985 657532959
2215.2 657532959 657219315 657160416 656770172 656909790 657202377 657257919 657299652 657180710 657234879 657103577
2224.8 657103577 657263412 657007599 657254562 657528229 657185287 657155762 657122192 657353668 657141418 657109451
2234.5 657109451 656805801 656898041 657461472 657063599 657048950 656998215 657072906 656820145 656585007 656657562
2244.1F56657562J29624O09359l04336j92413j04371M0741k0523l20663J75552q7204
2253.8F56583328K04392j93024K2125J88217k95028r2621n1041J82038k78473N4168
2263.4F56324081m7683l0823J28860r2849L94592k75040k15454l89328j1215K88773
2273F56073914k85187O6452j7090M17557k71988m98886j68534m8904Q5602m55933K04239
2283.7F55101242j49994j5564N1727L9139L20130m50440K02103k40250l38440j02386
2293.3F54417267q0948L21274N7373K91366m00314j10626p8049r6512M20380P0724
2302.9F54811935R8191n21241j15966m8371M01612N17044j76926N89295k43989j29241
2312.6F55182343M4860j77536K49634j92413j72119l2959M74701l3646Q2245K89764
$$ plain form
2244.1 656657562 656787186 657396545 657092209 656899796 656795425 656836166 656815643 656494980 656670532 656583328
2253.8 656583328 656787720 656594696 656616821 656805038 656510010 656417389 656366348 656548386 656269913 656324081
2263.4 656324081 656276398 656245575 656374435 656281586 656676178 656401138 656185684 655796356 655785141 656073914
2273 656073914 655788727 655855179 655838089 656255646 655983658 655484772 655316238 655267334 655352936 654897003 655101242
2283.7 655101242 654951248 654935684 654987411 655026550 655346680 654896240 655098343 654858093 654519653 654417267
2293.3 654417267 654336319 654657593 654714966 655006332 654606018 654495392 654417343 654320831 654741211 654811935
2302.9 654811935 654910126 654388885 654272919 654224548 654626160 655143204 654966278 655555573 655311584 655182343
2312.6 655182343 655227203 655049667 655299301 655106888 654934769 654901810 655376511 655342865 655425110 655714874
2322.2F55714874n16586l62167K69241N89218M4708J96534k35215M93012Q35724m75159
2331.9F56554184o96869p45697J07727L98712R09119l72009r46045k7008k22168O5078
2341.5F55025024j526489l76968R40857j73874r00727k257385j029968J608505K077942
2350.2F53386917l3035m57230j75171P64389J346741K29492J472473l18374q9188k60849
2359.8F55866165j007461k07825q14438k78397j435546L83071K79923q77457j132278
2368.5F50775757j681976n19257n59540j52969r35974q17414l54232n02778l26004
2377.2F44925613o73599l09295q56553q41217o76803o55670l05863k68326M7684l24402
2386.8F40061569l96156o30951l45192k33421m07181L28827k69280j99775j48049l24516
$$ plain form
2322.2 655714874 655198288 654836121 655105362 655694580 655739288 655935822 655700607 656193619 657029343 656554184
2331.9 656554184 655857315 655111618 655219345 655618057 656527176 656155167 655209122 655182114 654959946 655025024
2341.5 655025024 653498535 653121567 654062424 653888550 652987823 650730438 649700470 651308975 653386917
2350.2 653386917 653353882 652896652 652721481 653485870 654832611 655062103 656534576 656216202 656127014 655866165
2359.8 655866165 654858704 654650879 653836441 653558044 652122498 652505569 652785492 651908035 650775757
2368.5 650775757 649093781 648574524 648014984 647862015 646926041 646108627 645754395 645251617 644925613
2377.2 644925613 644252014 643942719 643086166 642244949 641568146 640912476 640606613 640338287 640385971 640061569
2386.8 640061569 639665413 639034462 638689270 638455849 638048668 638377495 638108215 637908440 637760391 637435875
2396.5F37435875j22147l75595m92058q96034k12974Q0146p24m6273j69448j68419
2406.1F35032349p18766m24461l78761k80457n34553n89028P3700j21841k86675m23279
2415.8F31348228J06431j20316m60892m13589q14705k86980M3945J70136k99530n61066
2425.4F28711662n05409m17175p3471m70963n85174n01480N2909k34108n60875l49807
2435.1F25066109n75180r4986m80728n36232m15383m62990r0484l6583n1995n11589
2444.7F21809959j99203l55949n15595l23486m16489j39809m38079m54979m91524j14555
2454.3F18360291j35270o28700n92804n60036k81868n24368k60124l90930m44374k82326
2464F14259491l21960R2620n23300k52266l47442o62232n34553o55709k4795k24190
$$ plain form
2396.5 637435875 637313728 636938133 636446075 635550041 635337067 635417213 635416489 635370216 635200768 635032349
2406.1 635032349 634313583 633889122 633510361 633229904 632695351 632106323 632180023 632058182 631771507 631348228
2415.8 631348228 631454659 631334343 630873451 630459862 629645157 629358177 629402122 629572258 629272728 628711662
2425.4 628711662 628206253 627789078 627715607 627244644 626659470 626157990 626210899 625976791 625415916 625066109
2435.1 625066109 624490929 624395943 623915215 623378983 622963600 622500610 622410126 622373543 622321548 621809959
2444.7 621809959 621610756 621254807 620739212 620415726 619999237 619859428 619421349 618966370 618474846 618360291
2454.3 618360291 618225021 617596321 617003517 616443481 616161613 615637245 615377121 614986191 614541817 614259491
2464 614259491 613937531 614030151 613506851 613254585 612907143 612244911 611710358 611054649 611029854 610805664
2473.6F10805664l05328o81610n85213k67334o22444m38957n29404k14424m00658l82309
2483.3F06377983k54631m18320n52330p99026l05634n87272o27823p88231l70331J22070
2492.9F01796455n21316j04714l33938m46205n04303m87175k83814o85310o47164p15484
2502.6E97067032n9281j31378m24347o72073j077957m79698l27721j11732n77622o71997
2512.2E92533226l51181k94151j23940m54864k11716n02090n55611n52941n83152k24457
2521.9E88679123j05782J84746o68182p70302k87018l00178m89693q50792n12428j27602
2531.5E84751892m4784o64902l21121k80838p43294j67961k76604k58675n06706l90587
2541.1E81096420m00009p64046l85818k82555k30598r37653o33049R4109k61269k33688
$$ plain form
2473.6 610805664 610500336 609818726 609233513 608966179 608343735 607904778 607375374 607160950 606760292 606377983
2483.3 606377983 606123352 605705032 605152702 604353676 604048042 603460770 602832947 602044716 601674385 601796455
2492.9 601796455 601275139 601170425 600836487 600390282 599885979 599398804 599114990 598429680 597782516 597067032
2502.6 597067032 597007751 596876373 596452026 595779953 594701996 594222298 593894577 593782845 593205223 592533226
2512.2 592533226 592182045 591887894 591763954 591309090 591097374 590595284 590039673 589486732 588903580 588679123
2521.9 588679123 588573341 588758087 588089905 587319603 587032585 586732407 586242714 585391922 584879494 584751892
2531.5 584751892 584707108 584042206 583721085 583440247 582696953 582528992 582252388 581993713 581487007 581096420
2541.1 581096420 580696411 579932365 579546547 579263992 579033394 578095741 577462692 577556801 577295532 577061844
2550.8E77061844k24762m56429n94406k33497n58930o63376j16844j39351m26979q15925
2560.4E72831345n15023j05934R7466k45591o01959p28302n97191m0168m28543n73082
2570.1E69093018p10946m50630J61705R1133k89421r49974n42907n11361m75006l17192
2579.7E65098419m14429j40380n58587k85911k81830l12500k93465o51092l55835l61176
2589.4E61443214j95694l16314l72200m35601o57577o11763o21071o85730p69005p4043
2599E56704216l96500o37588k86293l76702k74810p27578k68630n0164l82805o17065
2608.6E52686081p40776m89426p00111j99928k98577n42412l92379n49012o03523q01239
2618.3E47368698m15535m02756m17404m87022m29306l41644o96831n58167p45048n45502
$$ plain form
2550.8 577061844 576837082 576380653 575786247 575552750 574993820 574330444 574213600 574074249 573647270 572831345
2560.4 572831345 572316322 572210388 572307854 572062263 571460304 570732002 570134811 570094643 569666100 569093018
2570.1 569093018 568382072 567931442 568093147 568184280 567894859 566944885 566401978 565890617 565415611 565098419
2579.7 565098419 564683990 564543610 563985023 563699112 563417282 563104782 562811317 562160225 561804390 561443214
2589.4 561443214 561247520 560931206 560559006 560123405 559465828 558854065 558232994 557547264 556778259 556704216
2599 556704216 556307716 555670128 555383835 555007133 554732323 554004745 553736115 553685951 553303146 552686081
2608.6 552686081 551945305 551455879 550755768 550555840 550257263 549714851 549322472 548773460 548169937 547368698
2618.3 547368698 546953163 546550407 546133003 545645981 545216675 544875031 544178200 543620033 542874985 542329483
2627.9E42329483o13136m77371j06164m14619m1161r4680n35813r20105o56395l73230
2637.6E38096809n67436q00476j238480o12449k04163l7079l3683k27242k69089r02328
2647.2E33204384p19605k40783l00598q20580p65190l32832n35622n35164k19078j16196
2656.9E28618736r27543n88150K61650J00670l80974r81026m10423j05629k14882n14488
2666.5E24857941o53839k66266m26674m33884m90074k51617m89617m70886J2512j99432
2676.1E21188164k26593n52521l66097l57971l78685n24902p99294r2582k55966l14560
2685.8E17318993m52004n65147j11809r6817m33006p49627j11236j84631m81034l43170
2695.4E13790512j27182j05705n42717l46756p42417m53300q3237k55470l2272m59748
$$ plain form
2627.9 542329483 541716347 541238976 541132812 540718193 540677032 540582352 540046539 539126434 538470039 538096809
2637.6 538096809 537529373 536728897 535490417 534877968 534673805 534636726 534603043 534375801 534106712 533204384
2647.2 533204384 532484779 532243996 531943398 531122818 530357628 530024796 529489174 528954010 528734932 528618736
2656.9 528618736 527691193 527103043 527364693 527465363 527084389 526103363 525692940 525587311 525372429 524857941
2666.5 524857941 524204102 523937836 523511162 523077278 522587204 522335587 521845970 521375084 521387596 521188164
2676.1 521188164 520961571 520409050 520042953 519684982 519306297 518781395 517982101 517889519 517633553 517318993
2685.8 517318993 516866989 516301842 516190033 516093216 515660210 514910583 514799347 514614716 514133682 513790512
2695.4 513790512 513663330 513557625 513014908 512668152 511925735 511472435 511389198 511133728 511101456 510641708
2705.1E10641708l75518p08466q41560k11373M4899k08320p94907m39758J7433J48048
2714.7E07272186l10936m03251q1864p03392m59404J41945j41868o06461n40543q0413
2724.4E04085999j11771m17061k09541n799k94685n58891n70908o7062n0507j71928
2734E01627846j64795l56331k61574p41272n40428j00784M58J38168l70445m01268
2743.7D98829575m6769K55776M4594l10860o91490n72014j04027k85454J10855q1672
2753.3D97148514j22185j50681o67915l25126j73836m6959n84831m39797p8010n60570
2762.9D93998604m72565l05214p7972n30205m08554j81656j02196R3079l63617j19553
2772.6D91530151m23278k74620l24784p37114k76489n37720o32477p04193k2888J88294
$$ plain form
2705.1 510641708 510266190 509557724 508716164 508504791 508549690 508341370 507546463 507106705 507124138 507272186
2714.7 507272186 506961250 506557999 506476135 505772743 505313339 505455284 505313416 504706955 504166412 504085999
2724.4 504085999 503974228 503557167 503347626 503341827 503047142 502488251 501917343 501850281 501799774 501627846
2734 501627846 501463051 501106720 500845146 500103874 499563446 499462662 499463120 499601288 499230843 498829575
2743.7 498829575 498782806 499038582 499083176 498772316 498080826 497508812 497404785 497119331 497230186 497148514
2753.3 497148514 497026329 496875648 496207733 495882607 495708771 495661812 495076981 494637184 494559174 493998604
2762.9 493998604 493526039 493220825 493142853 492612648 492204094 492022438 491920242 492013321 491649704 491530151
2772.6 491530151 491106873 490832253 490507469 489770355 489493866 488956146 488323669 487619476 487596588 487784882
2782.2D87784882n12848n00412o60172m97131l50113k33269m88205o49452l18527l72620
2791.9D83202133o88057q09250m62074q23097n77088j10626l07770n40771q44231m11491
2801.5D77627678n57785l80135m05464q92715n22766o88706o21529q30345j144523
2810.2D71583710n20211l05481r52911p03201k21482q70857q22639q33054o18553l77045
2819.8D65358276p00798o31447j043891j054612o95266m29764q68149j193924p87506
2828.5D57952919q50868n28450n26657r94912j462326j131401o08673o05583m49486
2837.2D50794563j229248j425056j398392j526070j253509j490746k093315k539634
2844.9D37838593j373406j104088k102279k321511j901970j267814j334915j176262
$$ plain form
2782.2 487784882 487272034 486771622 486111450 485614319 485264206 485030937 484542732 483893280 483574753 483202133
2791.9 483202133 482514076 481704826 481242752 480419655 479842567 479731941 479424171 478883400 478039169 477627678
2801.5 477627678 477069893 476689758 476284294 475391579 474868813 474180107 473558578 472728233 471583710
2810.2 471583710 471063499 470758018 469805107 469101906 468880424 468009567 467186928 466353874 465735321 465358276
2819.8 465358276 464657478 464026031 462982140 461927528 461232262 460802498 459934349 458740425 457952919
2828.5 457952919 457102051 456573601 456046944 455052032 453589706 452458305 451849632 451244049 450794563
2837.2 450794563 449565315 448140259 446741867 445215797 443962288 442471542 440378227 437838593
2844.9 437838593 436465187 435361099 433258820 430937309 429035339 427767525 426432610 425256348
2852.6D25256348j276780o70166J68839j82419k81105k17628J72500k28004q60901
2861.3D21880684p19910j49116P4577n55725o71234r00192q59719p66525q87756o26068
2870.9D15819016o48842p26586r31205o90308l93295k36893n78842j109658p13272
2879.6D09790115l29132q2473o72226j143494q36029o39725p93381j220855o99501
2888.3D03373299o16951j131440j295013j121597n32990l24478o33240j338462r69010
2897C95410118k72789m14009n68008o77376m54598n80291j165963j232071o70394p61185
2906.6C88613434p45621n23720j157379q28857q50258j478539j251793j080665j211510
2915.3C79485092j365547j227646j439476j177826q96225j297531r52873n38483j79939
$$ plain form
2852.6 425256348 423979568 423309402 423478241 423295822 423014717 422797089 422969589 422741585 421880684
2861.3 421880684 421160774 421011658 421086235 420530510 419859276 418959084 418099365 417332840 416445084 415819016
2870.9 415819016 415170174 414443588 413512383 412822075 412428780 412191887 411613045 410503387 409790115
2879.6 409790115 409460983 409378510 408706284 407562790 406726761 406087036 405293655 404072800 403373299
2888.3 403373299 402756348 401624908 400329895 399208298 398675308 398350830 397717590 396379128 395410118
2897 395410118 395137329 394723320 394155312 393477936 393023338 392443047 391277084 390045013 389374619 388613434
2906.6 388613434 387867813 387344093 386186714 385357857 384507599 383029060 381777267 380696602 379485092
2915.3 379485092 378119545 376891899 375452423 374274597 373378372 372080841 371127968 370589485 370409546
2924C70409546j65711o20422l67393l5630k36702P5913L52859J26000K26135K47383
2933.6C70011978N25932M21219m4861O5537M96101J039162Q47626N82466M96826O02112
2943.3C75044098O69174M52919P24335P55119P67250N15976J12000M87365R47953O20651
2952.9C81096840K92625N83077K89268M60511M68330j02959J58081Q58803J311379
2961.6C85415955L22227J04790P25899N50727N31922P67097J028137M24271M53301
2970.3C90324326Q82873N27649M17633O03561R06220O98585Q00972O43387j16081j06354
2979.9C95582771M70085P66564L02620L04947L62320K97699J07689n20554r2354L67088
2989.6C97948875M05693N73273J36719m33044l22304o4431p0877q7699k80991m26560
$$ plain form
2924 370409546 370243835 369623413 369256020 369220390 368983688 369059601 369412460 369538460 369764595 370011978
2933.6 370011978 370537910 370959129 370914268 370979805 371475906 372515068 373362694 373945160 374441986 375044098
2943.3 375044098 375713272 376166191 376890526 377645645 378412895 378928871 379040871 379528236 380476189 381096840
2952.9 381096840 381389465 381972542 382261810 382722321 383190651 383087692 383245773 384104576 385415955
2961.6 385415955 385738182 385842972 386568871 387119598 387651520 388418617 389446754 389871025 390324326
2970.3 390324326 391207199 391734848 392152481 392756042 393662262 394360847 395161819 395805206 395689125 395582771
2979.9 395582771 396052856 396819420 397122040 397426987 397789307 398087006 398194695 397674141 397581787 397948875
2989.6 397948875 398354568 398927841 399064560 398631516 398309212 398244781 398173904 398086205 397805214 397378654
2999.2C97378654m16450p6408k1096o97975p69386j03226N7602k38151n83916j086540
3008.8C93443108p14264k02790k55279m97055o88744j81618p50198j065636l11431
3017.5C88776093k21749m51202j083985q73222m39110l58696l89938r73473j051025
3026.2C82933693q40340n67589m53605k34986n52101j221237o74515n22995q67080
3034.9C76999245p89032n27382q30269j055222o50673q63800o76727j51749o52542
3043.6C70801849j209678p78237l48243l37639o46057j186219q69217p54241p53212
3052.2C63919106n92156p41768m67300n58205r12781r37996p92846r02481r43947q72078
3061.9C56197548q34122k52914m12789o01425o03027j182366q09516l44887o25916
$$ plain form
2999.2 397378654 396962204 396885796 396864700 396166725 395397339 395294113 395351715 395113564 394529648 393443108
3008.8 393443108 392728844 392526054 392270775 391773720 391084976 390903358 390153160 389087524 388776093
3017.5 388776093 388554344 388103142 387019157 386145935 385706825 385348129 384958191 383984718 382933693
3026.2 382933693 382093353 381525764 381072159 380837173 380285072 379063835 378389320 377866325 376999245
3034.9 376999245 376210213 375682831 374852562 373797340 373146667 372282867 371606140 371454391 370801849
3043.6 370801849 369592171 368813934 368465691 368128052 367481995 366295776 365426559 364672318 363919106
3052.2 363919106 363326950 362585182 362117882 361559677 360646896 359708900 358916054 358013573 357069626 356197548
3061.9 356197548 355363426 355110512 354697723 354096298 353493271 352310905 351501389 351156502 350530586
3070.6C50530586p03048m81225n15251k97661m04701r90753n69649k87208p21092r29795
3080.2C44630203p56912n46303n35927m72717o74095j063576n52482O2751m93164q29277
3089.9C38768501j065826q26683j7471m99154r58519r18579n42984k23350l53279n19600
3099.5C32843056r90334r40018p89947n15595n59730p85103l93753k61955m29383j148834
3109.1C26028404r32350m81605l97644l82462j276169p37877k70386o52236o57731
3117.8C20239944p17372o81839r15661l11203m50039j201096p79991o69918p92580
3126.5C13720245m47197R8706m43363j211072j274547r39808k23904j92623n97934
3135.2C08488503r99985j057472p40834m34322n42126q74901m86545l95146r02748
$$ plain form
3070.6 350530586 349827538 349346313 348831062 348533401 348128700 347137947 346568298 346281090 345559998 344630203
3080.2 344630203 343873291 343326988 342791061 342318344 341644249 340580673 340028191 340090942 339597778 338768501
3089.9 338768501 337702675 336875992 336858521 336359367 335400848 334482269 333939285 333715935 333362656 332843056
3099.5 332843056 331852722 330912704 330122757 329607162 329047432 328262329 327868576 327606621 327177238 326028404
3109.1 326028404 325096054 324614449 324216805 323834343 322558174 321820297 321549911 320897675 320239944
3117.8 320239944 319522572 318840733 317925072 317613869 317163830 315962734 315182743 314512825 313720245
3126.5 313720245 313273048 313371754 312928391 311717319 310442772 309502964 309279060 309086437 308488503
3135.2 308488503 307488518 306431046 305690212 305255890 304713764 303838863 303352318 302957172 302054424
3143.9C02054424j120376q52967o40468p08161n01499m06627n59235n08099o01558
3152.5B96155434r12342p56703q48560q69351o54316r47246n72186m36401q17127q61893
3162.2B88479309o21376m21219p24506o21605o78425p04422n79891o63452n50843p25307
3171.8B82188263p11517o38180l95050n08518o50998n62248j143989q99544o21205
3180.5B76057014n84297n26657p14741o24446o83384m94404n83935o77719o89469p52487
3190.1B69725475o62403n75161j02501o28109j045627m57649k20013o67267j073818
3198.8B64292927l99819k36263p32937j034336p31258l08247o42814n00222n76687
3207.5B59130344q74939o28204m73690m26311m36860m68368n76534o01979n22785j91021
$$ plain form
3143.9 302054424 300934048 300081081 299440613 298732452 298230953 297824326 297265091 296756992 296155434
3152.5 296155434 295243092 294486389 293637829 292768478 292114162 291166916 290594730 290158329 289341202 288479309
3162.2 288479309 287857933 287436714 286712208 286090603 285412178 284707756 284127865 283464413 282913570 282188263
3171.8 282188263 281476746 280838566 280443516 279934998 279284000 278721752 277577763 276678219 276057014
3180.5 276057014 275472717 274946060 274231319 273606873 272923489 272429085 271845150 271167431 270477962 269725475
3190.1 269725475 269063072 268487911 268385410 267757301 266711674 266254025 266034012 265366745 264292927
3198.8 264292927 263893108 263656845 262923908 261889572 261158314 260850067 260207253 259707031 259130344
3207.5 259130344 258255405 257627201 257153511 256727200 256290340 255821972 255245438 254643459 254120674 253929653
3217.2B53929653l53603p64370n66998n80005m83094o53381r85660o45276k41546j63288
3226.8B48492432m40293n31673l99361m29535n42087m55857o72512q89911n03426o23836
3236.4B43003941o30417j48373j71165m11282m26617o09684p45048l56140m30508j93481
3246.1B38881226N8708q14209r96781m18319k1668j21441m29878k29492j91326o96640
3255.7B35020180q79479l80420l47462q83122p56931k21004j99871k41681j22394m54884
3265.4B30532932m67834R155m4784l12748l10917n40066m07028J11026l75080r11960
3275B27282696p24621l53603o6414j11714k38838m33273k71416j46770l27340l62358
3284.7B24246349m32052m64058n97172m53033n1575J17187Q5221j47858l67413p32059
$$ plain form
3217.2 253929653 253576050 252811680 252244682 251664677 251181583 250528202 249542542 248897266 248655720 248492432
3226.8 248492432 248052139 247520466 247121105 246691570 246149483 245693626 245021114 244131203 243627777 243003941
3236.4 243003941 242373524 242225151 242053986 241642704 241216087 240606403 239861355 239505215 239074707 238881226
3246.1 238881226 238939934 238125725 237128944 236710625 236688957 236567516 236137638 235908146 235716820 235020180
3255.7 235020180 234140701 233760281 233412819 232529697 231772766 231551762 231351891 231110210 230987816 230532932
3265.4 230532932 230065098 230074253 230029469 229716721 229405804 228865738 228458710 228569736 228194656 227282696
3275 227282696 226558075 226204472 226138058 226026344 225787506 225354233 225082817 224936047 224608707 224246349
3284.7 224246349 223814297 223350239 222753067 222300034 222248459 222365646 222450867 222303009 221935596 221203537
3294.3B21203537p44324j69830P763m07429k92778J05133k40631m27971l27911j98498
3303.9B18507061m42467q36239o2198j50318o97632J53789j83239r07840n30301l60603
3313.6B14490013j18980j84536o01311l66497Q0566q8672o76861o25687m59423n23491
3323.2B10925121l91884n84354k75078o8912n51834m17099m52958o52141n28317m33025
3332.9B06569519k36759l93925n80196l84388l09792p00893r13449o03122l33653J01815
3342.5B02215157l62416j020431j46218R8343k10361l16601o60877k43759J10263m13265
3352.2A99049835j226253p10926K43930j26514j20373k29587n38864m58622l80249
3360.8A95502377o6109l76167j25790K76642l0880j16177n50766n92995k87342j28650
$$ plain form
3294.3 221203537 220459213 220289383 220297146 219889717 219596939 219702072 219461441 219033470 218705559 218507061
3303.9 218507061 218064594 217228355 217166157 217015839 216318207 216471996 216288757 215380917 214850616 214490013
3313.6 214490013 214371033 214186497 213585186 213218689 213299255 213210583 212533722 211908035 211448612 210925121
3323.2 210925121 210533237 209948883 209673805 209604893 209053059 208635960 208183002 207530861 207002544 206569519
3332.9 206569519 206332760 205938835 205358639 204974251 204664459 203963566 203050117 202446995 202113342 202215157
3342.5 202215157 201852741 200832310 200686092 200784435 200574074 200257473 199596596 199352837 199463100 199049835
3352.2 199049835 197823582 197112656 197356586 197230072 197109699 196880112 196341248 195882626 195502377
3360.8 195502377 195436268 195060101 194934311 195210953 195180073 195063896 194513130 193920135 193632793 193504143
3370.5A93504143k24610j40400K09427n67379p03525J1310n6514k54708m12826k16828
3380.1A91148090J69411J83830k18982m87233n1422Q5678j11103m8751k98710k26364
3389.8A90144444L54290M48226j7280o21052j64013K06089l50570l89023k57550J79787
3399.4A89533348M32777l7326k01264l55053l16791M3754K85244J75286J53522r0217
3409.1A89623280m65298K84366L38936j05610L5630j40000K8591j9817q4076N14832
3418.7A90010834N12123j86196k81124J30196L01437L55645J68609K63596L83987J08414
3428.3A91767521J32770J47820n3959J29852M58317O9523j15738K55642N41115O34174
3438A93967037K35195K13013M73156N35450M20246J42956j05286K74639J314640M16451
$$ plain form
3370.5 193504143 193279533 193139133 193348560 192781181 192077656 192088966 192032452 191777744 191364918 191148090
3380.1 191148090 191317501 191501331 191282349 190795116 190743694 190829372 190718269 190669518 190370808 190144444
3389.8 190144444 190498734 190946960 190929680 190308628 190144615 190350704 190000134 189611111 189353561 189533348
3399.4 189533348 189966125 189928799 189727535 189372482 189055691 189099445 189384689 189559975 189713497 189623280
3409.1 189623280 189157982 189442348 189781284 189675674 189711304 189571304 189599895 189580078 189496002 190010834
3418.7 190010834 190522957 190336761 190055637 190185833 190487270 190842915 191011524 191275120 191659107 191767521
3428.3 191767521 191900291 192048111 191994152 192124004 192582321 192651844 192536106 192791748 193332863 193967037
3438 193967037 194202232 194415245 194888401 195423851 195844097 195987053 195881767 196156406 197471046 197887497
3447.6A97887497n4741Q23078K62604K86598L69930Q1902K01092K89078N94043L84255
3457.3B01125336O65798J045093N44491L43018L91960K80476l6984M62914J333351
3466B06155453R74140L97816K86979L38612O72073O93226M02432K83622P16858J182347
3475.6B12103558R26609N57212K26231N87769J093311Q97407N22709N0316Q17471J253071
3485.2B19035664M09736M05674Q05798P29275M96101Q77609J022873O27651N44110
3493.9B24954491N04608J186371J196861J29204K20241N49374Q00915J564922J255322
3502.6B32362309L14807M09871P79857J056862J050911J228638N22327L5076J080303
3511.3B38840961R74961J238346J090736P10621J018448O69804J169510J247463Q80642
$$ plain form
3447.6 197887497 197832756 198655834 198918438 199205036 199574966 199656868 199857960 200147038 200741081 201125336
3457.3 201125336 201791134 202836227 203380718 203723736 204115696 204396172 204359188 204822102 206155453
3466 206155453 207129593 207527409 207814388 208153000 208825073 209518299 209920731 210204353 210921211 212103558
3475.6 212103558 213030167 213587379 213813610 214401379 215494690 216392097 216914806 216965122 217782593 219035664
3485.2 219035664 219445400 219851074 220656872 221386147 221882248 222759857 223782730 224410381 224954491
3493.9 224954491 225459099 226645470 227842331 227971535 228191776 228741150 229542065 231106987 232362309
3502.6 232362309 232677116 233086987 233866844 234923706 235974617 237203255 237725582 237760658 238840961
3511.3 238840961 239815922 241054268 242145004 242855625 243874073 244543877 245713387 246960850 247841492
3520B47841492P51533Q68073J048679M12922P15084J156197J589565J201000L61443
3528.6B55945988L88584J022739J569863J300258J448136O97918J240692J439418L7823
3537.3B65091419J445618J564388J384125J248856R09786J209507J438179K035141
3545B76327019Q10432J191158J047345P32956J218242J499214K570153M99077O28852
3553.7B86524448J540738J816444K233238P87544J545735J416340J202659J332569
3561.4B98399715K004738J995735O02799L132877J856518O99596J330243j50242K373008
3570.1C12244987J882725J592102J325512J887532K167415J535607K500076J047630
3577.8C26183586J998863K563172J174774J486015J988907K138023J095963L037376
$$ plain form
3520 247841492 248593025 249461098 250509777 250922699 251637783 252793980 254383545 255584545 255945988
3528.6 255945988 256334572 257357311 258927174 260227432 261675568 262373486 263614178 265053596 265091419
3537.3 265091419 266537037 268101425 269485550 270734406 271644192 272853699 274291878 276327019
3545 276327019 277137451 278328609 279375954 280108910 281327152 282826366 285396519 285895596 286524448
3553.7 286524448 288065186 289881630 292114868 292902412 294448147 295864487 297067146 298399715
3561.4 298399715 300404453 302400188 303002987 306135864 307992382 308691978 310022221 309871979 312244987
3570.1 312244987 314127712 315719814 317045326 318932858 321100273 322635880 325135956 326183586
3577.8 326183586 328182449 330745621 331920395 333406410 335395317 337533340 338629303 341666679
3585.5C41666679K392464O48346K129059l16239L041230L870811K678719J247482P87163
3594.2C58145714L469810P48978J910515L394127J315422K812729J802406J496963
3601.9C75096664K423935J875878K277565L389015L539238K85110K818146R43680m48685
3610.6C92200546O438256L112716m90112M092102R55467L466225M273758J197319K049713
3619.3D17295990O96220J453019K468986K962494K933578K980233L637275L390618
3627D37818413O737327L963318p841568J973305L517799N301781L119698n29633L064117
3635.7D57124557M054757L259201J339645J739121L376007L809738K646675J093101
3643.4D78442802K924004M646797O816941J682662k920646N845375K351837j386757
$$ plain form
3585.5 341666679 344059143 344707489 346836548 346520309 349561539 353432350 356111069 357358551 358145714
3594.2 358145714 361615524 362364502 364275017 367669144 368984566 371797295 373599701 375096664
3601.9 375096664 377520599 379396477 381674042 385063057 388602295 388887405 391705551 392649231 392200546
3610.6 392200546 398638802 401751518 401261406 405353508 406308975 409775200 414048958 415246277 417295990
3619.3 417295990 417992210 419445229 421914215 424876709 427810287 430790520 434427795 437818413
3627 437818413 444555740 448519058 440677490 442650795 446168594 451470375 454590073 454060440 457124557
3635.7 457124557 461179314 464438515 465778160 467517281 470893288 474703026 477349701 478442802
3643.4 478442802 481366806 486013603 492830544 494513206 491592560 497437935 499789772 498403015
3651.1D98403015j517715L845062M671059M568290O410332n287285N72128N036240
3658.8E16701126J847954K382698J513519K969399K125091J906243K328987J184082
3666.5E32959099M855652L702278J057548J993409n392952J368827P779007J0148659
3674.3E58471527L217087j7805786L07388P675247N772858j056595q31833J837807
3682E57587700K346191K538758J003418K40593M037818Q247910o326065o104508Q445702
3690.6E72017517l916473k067910N181199J263847K010193J442604J54495J100578
3698.4E77186050l5400K152748L341332m111939k486229M515228J873665K93999Q60939
3707E83590393L109474N636292o052246K702026P038460j3815422J141700M247818
$$ plain form
3651.1 498403015 496885300 500730362 505401421 509969711 516380043 511092758 511664886 516701126
3658.8 516701126 518549080 520931778 522445297 525414696 527539787 529446030 531775017 532959099
3666.5 532959099 537814751 541517029 542574577 544567986 539175034 540543861 548322868 558471527
3674.3 558471527 561688614 543882828 544190216 551865463 557638321 556581726 555749893 557587700
3682 557587700 559933891 562472649 563476067 563716660 567754478 576002388 569676323 563571815 572017517
3690.6 572017517 568101044 566033134 571214333 572478180 574488373 575930977 576085472 577186050
3698.4 577186050 577150650 579303398 582644730 578532791 576046562 580561790 582435455 582729454 583590393
3707 583590393 586699867 592336159 586283913 588985939 596024399 582208977 583350677 587598495
3714.8E87598495j20964j8158K748299K694397k588921K58523N892677j020127n400657
3723.4E90043564M369163K410851l21846k912407j389198L861160J367950N127297
3731.2F02556534j512222q427125R368477M157715r337120j334839J476517n47752
3738.9E96400185J811447L855858l869744J336136J2718887l223075k0728760P958374
3746.6E96259308O262283P537079L46413j2840805J0275039k737350r980202N243721
3754.3F00365486M384346L439675n946236P56721O979065o100502l860092K970200
3762F02988663J790466M69704L573799j158295n186691K439117N570870J849670r659233
3770.7F02678070M30756L778763M28161Q19740o30760J07918L79448L602524J556473
$$ plain form
3714.8 587598495 587477531 587459373 590207672 592902069 590313148 590571671 596464348 595444221 590043564
3723.4 590043564 594412727 596823578 596501732 593589325 592200127 596061287 597429237 602556534
3731.2 602556534 601044312 592617187 601985664 606143379 596806259 595471420 596947937 596400185
3738.9 596400185 598211632 602067490 598197746 599533882 612252769 609029694 588300934 596259308
3746.6 596259308 602521591 610058670 610405083 597564278 607839317 605101967 595121765 600365486
3754.3 600365486 604749832 608189507 602243271 602999992 609979057 603878555 600018463 602988663
3762 602988663 604779129 605248833 608822632 607664337 602477646 604916763 610487633 612337303 602678070
3770.7 602678070 603108826 606887589 607315750 608135490 607504730 607612648 607992096 611594620 613151093
3779.4F13151093q194504J239280K133446R65576K958603k334823k117348M56467Q17070
3788F09074860J456756P9003n69954l60070N07813k73666J340484M132805k877655
3796.7F12510376l799477J970482L549156P115784k899628j2415924J253586K210426
3804.4F09494781M614220O646538p199173o621742L672523K098885j53733M77677o3477
3813.1F12966499N54200N732193J648521j4114265K175331N560951N564842N501175
3820.8F25589447j6697006k801476N377236K352829J961670m3106m154053j13335J576462
3829.5F13048668K958527K523345q462677J103592P625161n158234j678963R792481
3837.2F21751900l779526o670799O815147m864654k524605O177711j442947m206085
$$ plain form
3779.4 613151093 604956589 606195869 608329315 609294891 612253494 609918671 607801323 608257790 609074860
3788 609074860 610531616 610610619 610040665 609680595 610188408 609914742 611255226 615388031 612510376
3796.7 612510376 608710899 610681381 614230537 621346321 618446693 606030769 607284355 609494781
3804.4 609494781 614109001 620755539 613556366 606934624 610607147 612706032 612552299 613029976 612966499
3813.1 612966499 613520699 619252892 620901413 606787148 608962479 614523430 620088272 625589447
3820.8 625589447 608892441 606090965 611468201 613821030 615782700 615739594 611585541 611472206 613048668
3829.5 613048668 616007195 618530540 610067863 611171455 618796616 613638382 611959419 621751900
3837.2 621751900 617972374 611301575 618116722 613252068 610727463 616905174 615462227 611256142
3844.9F11256142J616020J626816L17306J352463j238785J080628O043548k125091
3852.7F19929047M001312j7474671k775535J1564293K70805k746162J459961J850242
3860.4F16079292K788887m572487j40876P814445m203605q164521K379494M347687
3868.1F16328316P038765l884392j0175133K318268M387283L979912q365288j755371
3875.8F09872360L457299K39524K763100N080261m279289r064484M818955K833290
3883.5F15721016J230812N846901j2031250j782837L832588N21050M407158J506385
3891.2F19251823p324791n84754K648735j491509Q69789J036186J900406M194908q801612
3899.9F11699181K617187L710137n475350L551788k678756k316819P72934O02227J721344
$$ plain form
3844.9 611256142 612872162 614498978 614816284 616168747 614929962 616010590 622054138 619929047
3852.7 619929047 623930359 606455688 603680153 615244446 615515251 612769089 614229050 616079292
3860.4 616079292 618868179 614295692 614154816 621969261 617765656 609601135 611980629 616328316
3868.1 616328316 623367081 619482689 609307556 611625824 616013107 619993019 611627731 609872360
3875.8 609872360 613329659 613569183 616332283 621412544 617133255 608068771 612887726 615721016
3883.5 615721016 616951828 622798729 610767479 608984642 612817230 613338280 617745438 619251823
3891.2 619251823 611927032 611342278 613991013 612499504 613369293 614405479 616305885 620500793 611699181
3899.9 611699181 614316368 618026505 612551155 616102943 613424187 611107368 611880302 612482529 614203873
3908.6F14203873l56598j71738q72192o7940Q00133J2970J082191K511254k212105
3917.3F14929848n234642L291320J555939l440780J756553J169739Q39462n93834l228454
3926F11045151P33185J306686Q56018n73006p34291K220459j065712k175636K89803
3934.6F11902657m94042O83632J276894n15595q72002k82554J538582J554489l504677
3943.3F11287384j408195J343956R07707J585998j577530L23716R30137l158684N17769
3952F10752258Q59833m32968j15624J41755J135444k00119j0299m59214m15077J78795
3961.6F11434784j435890j48583P90482Q2283J81618P5416J94893M02489m40369L7003
3971.3F11174126Q15391m41322j102524k63023Q63571n1079o92863j89934k49252P02018
$$ plain form
3908.6 614203873 613847275 613675537 612803345 612735405 613535538 613548508 614630699 617141953 614929848
3917.3 614929848 609695206 612986526 614542465 611101685 612858238 614027977 614867439 614273605 611045151
3926 611045151 611778336 613085022 613941040 613368034 612633743 614854202 613788490 611612854 611902657
3934.6 611902657 611408615 612092247 613369141 612853546 611981544 611698990 613237572 614792061 611287384
3943.3 611287384 609879189 611223145 612130852 613716850 612139320 612463036 613393173 610234489 610752258
3952 610752258 611612091 611179123 611063499 611205254 612340698 612140579 612130280 611671066 611255989 611434784
3961.6 611434784 609998894 609850311 610640793 610723076 610904694 610980110 611175003 611577492 611137123 611174126
3971.3 611174126 611989517 611548195 610445671 610182648 611046219 610995140 610302277 610112343 609863091 610565109
3980.9F10565109J130982R5634o03409L12882j16348m22554J51786q41407L79028K53258
3990.6F10904961m78020L35045j66130L30848N5886j03302n6229m44412p1602P8773
4000.2F10385818
$$ plain form
3980.9 610565109 611696091 611791725 611188316 611501198 611384850 610962296 611114082 610272675 610651703 610904961
3990.6 610904961 610426941 610761986 610595856 610926704 610982590 610879288 610823059 610378647 610307045 610385818
4000.2 610385818
##END=$$ End of the data block
