##TITLE=$$ Begin of the data block
##JCAMP-DX=5.00 $$ ACD/SpecManager v 10.08
##SPECTROMETER/DATA SYSTEM=Varian
##DATE=15 Jan 2013 10:20:32
##DATA TYPE=INFRARED SPECTRUM
##DATA CLASS=XYDATA
##ORIGIN=
##OWNER=
##NPOINTS=3735
##FIRSTX=399.26403809
##LASTX=4000.35498047
##MAXX=4000.35498047
##MINX=399.26403809
##MAXY=67.86346436
##MINY=15.48768997
##XFACTOR=1.0000000000
##YFACTOR=0.000000100000000
##FIRSTY=35.51871109
##DELTAX=0.96440572
##XUNITS=1/CM
##YUNITS=TRANSMITTANCE
##XYDATA=(X++(Y..Y))
$$ plain form
399.3 355187111 357300835 358227196 355828476 351946869 357559891 361425781 358270302 351370354 351077805
407.9 351077805 356424446 364714203 366798248 357530670 350659409 344503822 344662590 349358177 353226357
416.6 353226357 358878670 374517441 373674202 349199867 345159760 347271385 345883331 339732819
424.3 339732819 341195412 350401268 350468025 346055222 344494896 348345604 349865112 349771423 344197655
433 344197655 340559769 347046623 345387611 344449654 346973801 348297806 347548714 345422440 346631203
441.7 346631203 344624634 346770592 349857941 349913864 345479698 344292641 347586327 344104996 346548119
450.4 346548119 349240303 349951515 352533722 349334641 343836288 339531136 342249794 347884293 350391464
459.1 350391464 345776253 339933815 340576324 338349266 338465462 341163521 344524727 344965858 342669373
$$ packed form
399.3C55187111K113724R26361k398720l881607N613022L865890l155479o899948k92549
407.9C51077805N346641Q289757K084045r267578o871261o155587J58768M695587L868180
416.6C53226357N652313J5638771q43239k4474335m040107K111625j388054o150512
424.3C39732819J462593R205856O6757m412803j560326L850708J519508r3689n573768
433C44197655l637886O486854j659012r37957K524147J324005p49092k126274J208763
441.7C46631203k006569K145958L087349N5923m434166j187057L293686l481331K443123
450.4C46548119K692184P11212K582207l199081n498353m305152K718658N634499K507171
459.1C50391464m615211n842438O42509k227058J16196K698059L361206M41131k296485
$$ plain form
467.7 342669373 340022659 338576546 342448578 345039406 339971237 331883469 330966225 331423454 334293900
476.4 334293900 334126892 328871613 329240570 329994431 332060623 329727974 326732483 328022461 327190895
485.1 327190895 330353584 330999146 329424858 327247353 327209663 327902527 326092072 327089043 326201553
493.8 326201553 325609970 323687134 325533142 327919846 325324097 326433258 327071648 328582039 328496475
502.5 328496475 327907639 327924576 324681854 322005119 318950977 322101631 325129662 322173576 319464302
511.1 319464302 320578957 321319618 318778591 317351875 316822929 318027878 317555962 317741985 320146675
519.8 320146675 318802319 315696735 313681183 315940056 316391983 314693165 313533363 311897697 312636280
528.5 312636280 312291965 311730804 312200336 311952801 311152496 310713081 309748516 309217415 311071510 311117706
$$ packed form
467.7C42669373k646714j446113L872032K590828n068169q087768r17244M57229K870446
476.4C34293900j67008n255279L68957P53861K066192k332649k995491J289978q31566
485.1C27190895L162689O45562j574288k177505l7690O92864j810455R96971q87490
493.8C26201553n91583j922836J846008K386704k595749J109161O38390J510391q5564
502.5C28496475n88836J6937l242722k676735l054142L150654L028031k956086k709274
511.1C19464302J114655P40661k541027j426716n28946J204949m71916J86023K404690
519.8C20146675j344356l105584k015552K258873M51927j698818j159802j635666P38583
528.5C12636280l44315n61161M69532k47535q00305m39415r64565n31101J854095M6196
$$ plain form
538.1 311117706 310967503 310533161 309544086 309587383 309026241 309103317 309084740 309183140 307065430 304615841
547.8 304615841 304925385 305249634 304993286 303707695 303266430 303143883 303158302 302737656 302073879 301890411
557.4 301890411 299731083 299242306 299243069 297527618 296902542 297389355 298803539 300049248 300060081 299582787
567.1 299582787 299716263 300709476 300880146 299772263 300491161 301194515 300769653 301239090 300128174
575.8 300128174 299004288 298698711 298076534 297137222 296891327 298989944 299633389 298936672 297858200
584.4 297858200 297250671 297370300 297734146 299196510 300525703 300947266 298950653 297961292 299779663
593.1 299779663 300984764 301265888 301269379 301210384 300419827 301977501 302990799 301321716 300597000 299808826
602.8 299808826 299237747 298964329 299752541 299330883 297742882 296700230 295152493 295364799 295414200
$$ packed form
538.1C11117706j50203m34342r89075M3297n61142P7076j8577R8400k117710k449589
547.8C04615841L09544L24249k56348j285591m41265j22547J4419m20646o63777j83468
557.4C01890411k159328m88777P63j715451o25076M86813J414184J245709J0833m77294
567.1B99582787J33476R93213J70670j107883P18898P03354m24862M69437j110916
575.8C00128174j123886l05577o22177r39312k45895K098617O43445o96717j078472
584.4B97858200o07529J19629L63846J462364J329193M21563j996613r89361J818371
593.1B99779663J205101K81124L491n8995p90557J557674J013298j669083p24716p88174
602.8B99808826n71079k73418P88212m21658j588001j042652j547737K12306M9401
$$ plain form
611.4 295414200 295178833 295165195 295251026 295573769 294610519 293155937 291485329 292685051 294661579
620.1 294661579 294635181 294403782 294817181 296421490 297167530 297404995 297857647 299240570 301344490
628.8 301344490 301823120 302217503 303555374 304700050 305482388 307212772 309109650 311070499 313745766
637.5 313745766 314860477 315378571 316643753 317646103 318365536 318987732 319912834 321535683 323250580
646.2 323250580 323726997 324038010 325068665 326019173 327101784 328028870 328578758 328724785 328473244
654.8 328473244 328274040 328398819 328748245 329243774 329242973 328307266 327980614 327706680 327308006 327118187
664.5 327118187 326460571 327096939 327563210 324555321 327290993 329135475 329526215 330463867 332450409
673.2 332450409 333997498 334001923 333637466 334266129 335785751 337115059 337805862 339146423 340559425
$$ packed form
611.4B95414200k35367j3638Q5831L22743r63250j454582j670608J199722J976528
620.1B94661579k6398k31399M13399J604309P46040K37465M52652J382923K103920
628.8C01344490M78630L94383J337871J144676P82338J730384J896878J960849K675267
637.5C13745766J114711N18094J265182J002350P19433O22196R25102J622849J714897
646.2C23250580M76417L11013J030655R50508J082611R27086N49888J46027k51541
654.8C28473244j99204J24779L49426M95529q01r35707l26652k73934l98674j89819
664.5C27118187o57616O36368M66271l007889K735672J844482L90740R37652J986542
673.2C32450409J547089M425l64457O28663J519622J329308O90803J340561J413002
$$ plain form
681.8 340559425 342226639 344561920 345704880 347188492 349039993 349620705 349901695 350147438 350964012
690.5 350964012 351756783 352259865 352901230 353686790 355472946 356880035 356798286 356401596 357057076 357876244
700.2 357876244 357866402 358720169 360146446 360614052 360525017 361350060 363122330 364967766 366613884 367212029
709.8 367212029 366886902 366877289 367796097 368035698 368143234 369793930 370985031 371816711 372718010 373138542
719.5 373138542 373286972 373371315 374066963 374674377 374974174 375588036 377071037 378657608 379809341
728.1 379809341 380800018 382130318 384072304 384569321 384828835 385529823 385734711 386861725 388568687
736.8 388568687 389433594 389120064 389794731 389916115 389019775 389829063 390780792 391897583 393324127
745.5 393324127 394361076 394869576 395171356 394969368 394477768 395363922 396407585 397290268 398177338
$$ packed form
681.8C40559425J667214K335281J142960J483612J851501N80712K80990K45743Q16574
690.5C50964012P92771N03082O41365P85560J786156J407089q1749l96690O55480Q19168
700.2C57876244r842Q53767J426277M67606q9035Q25043J772270J845436J646118N98145
709.8C67212029l25127r613R18808K39601J07536J650696J191101Q31680R01299M20532
719.5C73138542J48430Q4343O95648O07414K99797O13862J483001J586571J151733
728.1C79809341R90677J330300J941986M97017K59514P00988K04888J127014J706962
736.8C88568687Q64907l13530O74667J21384q96340Q09288R51729J116791J426544
745.5C93324127J036949N08500L01780k01988m91600Q86154J043663Q82683Q87070
$$ plain form
754.2 398177338 400064125 401674156 402176247 403336487 404081917 406548691 408390083 408730507 410057793
762.8 410057793 410835114 412142067 412112732 411956558 412941895 413758240 414641685 414517899 414566612 413888588
772.5 413888588 413150940 413513374 413696327 413400345 412829552 413198586 413978844 414369354 414687119 415765648
782.1 415765648 416393471 416165314 416233368 416111641 416122742 415950928 416649666 417837982 418452301 419264297
791.8 419264297 419789963 420065231 419874802 419587975 418551140 416821327 415497360 414232979 413207397
800.5 413207397 412843971 412266769 410724258 409209175 407171974 404967422 402955170 401459274 400552101
809.1 400552101 398282089 395737495 393287315 391563072 390863800 389744911 388496513 387133560 386037407
817.8 386037407 385640907 386034737 386185646 386334801 387270432 388282471 390319519 393087158 395801239
$$ packed form
754.2C98177338J886787J610031N02091J160240P45430K466774J841392L40424J327286
762.8D10057793P77321J306953k9335j56174R85337Q16345Q83445j23786M8713o78024
772.5D13888588p37648L62434J82953k95982n70793L69034P80258L90510L17765J078529
782.1D15765648O27823k28157O8054j21727J1101j71814O98738J188316O14319Q11996
791.8D19264297N25666K75268j90429k86827j036835j729813j323967j264381j025582
800.5D13207397l63426n77202j542511j515083k037201k204552k012252j495896r07173
809.1D00552101k270012k544594k450180j724243o99272j118889j248398j362953j096153
817.8C86037407l96500L93830J50909J49155R35631J012039K037048K767639K714081
$$ plain form
826.5 395801239 398893738 402600212 405882912 408958931 412949219 415739441 418341675 421387062
834.2 421387062 424072762 427441788 430771103 432775574 434404373 437467117 439904900 442410927
841.9 442410927 444169502 444859467 447000923 448693428 450629730 451586494 451996498 452822456 454394569
850.6 454394569 457407837 458790321 459857674 461433296 463597336 464761734 465639915 467815933 469198990
859.3 469198990 471191788 472539482 473428116 474192963 475229187 475790863 474778557 474979973 475024109
868 475024109 474458504 472632599 471082382 470075912 468676376 468151627 467246437 466203079 464238434
876.7 464238434 463616028 462915535 460698547 459014282 457490044 457778931 457015114 455808372 455125351
885.3 455125351 454251671 454262085 453700371 452970543 451197853 449907341 449828835 449878197 449693336 449392014
$$ packed form
826.5C95801239L092499L706474L282700L076019L990288K790222K602234L045387
834.2D21387062K685700L369026L329315K004471J628799L062744K437783K506027
841.9D42410927J758575O89965K141456J692505J936302R56764M10004Q25958J572113
850.6D54394569L013268J382484J067353J575622K164040J164398Q78181K176018J383057
859.3D69198990J992798J347694Q88634P64847J036224N61676j012306K01416M4136
868D75024109n65605j825905j550217j006470j399536n24749r05190j043358j964645
876.7D64238434o22406p00493k216988j684265j524238K88887p63817j206742o83021
885.3D55125351q73680J0414n61714p29828j772690j290512p8506M9362j84861l01322
$$ plain form
895 449392014 449630318 449709892 450929718 451579094 451052895 449774132 448615837 448774300 448966789 450335197
904.6 450335197 451722374 453603668 455991707 458425941 460754242 461586761 463045616 463436775 462773132
913.3 462773132 461668663 460465813 459271355 456662521 454315529 451717644 449001923 446142426
921 446142426 443933678 441429291 437237701 433351860 429539070 425968094 422214737 418714905 415109406
929.7 415109406 411577454 409291306 406889687 404939804 403019485 400875778 399737206 399067955 397765961
938.4 397765961 396439400 395213432 393752632 393433533 392603683 391015701 390036774 389516296 389261627
947.1 389261627 389069061 389774361 389820595 389283218 388853226 387952805 386896858 385479012 384438553
955.7 384438553 383177910 381995354 380330124 377622337 375023956 372504730 370364113 367638016
$$ packed form
895D49392014K38304P9574J219826O49376n26199j278763j158295J58463J92489J368408
904.6D50335197J387177J881294K388039K434234K328301Q32519J458855L91159o63643
913.3D62773132j104469j202850j194458k608834k346992k597885k715721k859497
921D46142426k208748k504387m191590l885841l812790l570976l753357l499832l605499
929.7D15109406l531952k286148k401619j949883j920319k143707j138572o69251j301994
938.4C97765961j326561j225968j460800l19099q29850j587982r78927n20478k54669
947.1C89261627j92566P05300M6234n37377m29992r00421j055947j417846j040459
955.7C84438553j260643j182556j665230k707787k598381k519226k140617k726097
$$ plain form
963.4 367638016 364942474 362820129 360736694 358740578 356594467 354830055 352614059 350146408
971.2 350146408 347579231 344379349 341391983 338199615 334215469 329938126 326262131 322231598
978.9 322231598 317469749 313208427 308483868 303772850 299047337 293324642 287840767 282144127
986.6 282144127 277352371 272993717 268418674 264897442 260776863 256967964 253453503 250213127
994.3 250213127 247273808 244041023 240980549 237736549 234800053 231479454 229205971 227077255
1002 227077255 224736366 223135204 221006832 219226303 217366085 216453552 214674263 212396107 210856419
1010.7 210856419 208851128 207779980 205642147 203906212 202257080 200046806 198411884 196302414
1018.4 196302414 194500237 192370777 190894852 188939552 186654739 184350033 181937389 180894470
$$ packed form
963.4C67638016k695542k122345k083435j996116k146111j764412k215996k467651
971.2C50146408k567177l199882k987366l192368l984146m277343l675995m030533
978.9C22231598m761849m261322m724559m711018m725513n722695n483875n696640
986.6B82144127m791756m358654m575043l521232m120579l808899l514461l240376
994.3B50213127k939319l232785l060474l244000k936496l320599k273483k128716
1002B27077255k340889j601162k128372j780529j860218r12533j779289k278156j539688
1010.7B10856419k005291j071148k137833j735935j649132k210274j634922k109470
1018.4A96302414j802177k129460j475925j955300k284813k304706k412644j042919
$$ plain form
1026.1 180894470 179992428 179346046 177780533 176390324 175132084 174750309 175071468 174094238 174232101
1034.8 174232101 174144745 174527760 175764236 177495575 179089489 180004368 181556950 182733822 183726234
1043.5 183726234 183709030 184137497 184499741 184183216 183266678 181617126 181062889 179196663 178134193
1052.2 178134193 177497711 176579437 176055202 175016975 174671497 173787155 174790783 175284557 175568981
1060.9 175568981 177077084 178526211 180699100 181862392 184265480 186316986 188349705 189249840
1068.6 189249840 189098072 190733967 191717358 193244724 193484478 193936367 194862900 195247307 195750580
1077.2 195750580 195548744 196849632 197091274 197980461 199626637 200540924 201322041 201671696 203263950
1085.9 203263950 204361553 206029892 207588120 208468418 209270477 210378475 212020626 212783356 214254856
$$ packed form
1026.1A80894470r02042o46382j565513j390209j258240l81775L21159r77230J37863
1034.8A74232101q7356L83015J236476J731339J593914R14879J552582J176872R92412
1043.5A83726234j7204M28467L62244l16525r16538j649552n54237j866226j062470
1052.2A78134193o36482r18274n24235j038227l45478q84342J003628M93774K84424
1060.9A75568981J508103J449127K172889J163292K403088K051506K032719R00135
1068.6A89249840j51768J635895R83391J527366K39754M51889R26533L84407N03273
1077.2A95750580k01836J300888K41642Q89187J646176R14287P81117L49655J592254
1085.9B03263950J097603J668339J558228Q80298Q02059J107998J642151P62730J471500
$$ plain form
1094.6 214254856 215776367 217649975 218355865 218938389 220846233 221946850 223158722 223658829 225435123
1103.3 225435123 227416973 228943386 230532570 231144886 232626991 233442345 233842659 233938999 234649334
1112 234649334 235733852 236252480 237974186 239383774 240269337 240204906 240100269 240058537 239617481 239662991
1121.6 239662991 239545517 239860458 240133190 240728092 240927639 241833363 243699818 245182495 247324924
1130.3 247324924 248957977 250981979 252975063 254992981 257150059 259167824 261852417 263921509
1138 263921509 266025734 268123035 270238400 271460915 272230396 273601952 274384918 275347862 275848160
1146.7 275848160 276090984 276433144 276776676 277283363 277753239 278412247 278528080 278555565 277836781 277112389
1156.3 277112389 276603222 275594349 274890518 273938217 273627129 273020000 272835503 273760662 274976559
$$ packed form
1094.6B14254856J521511J873608P05890N82524J907844J100617J211872N00107J776294
1103.3B25435123J981850J526413J589184O12316J482105Q15354M00314R6340P10335
1112B34649334J084518N18628J721706J409588Q85563o4431j04637m1732m41056M5510
1121.6B39662991j17474L14941K72732N94902J99547R05724J866455J482677K142429
1130.3B47324924J633053K024002J993084K017918K157078K017765K684593K069092
1138B63921509K104225K097301K115365J222515P69481J371556P82966R62944N00298
1146.7B75848160K42824L42160L43532N06687M69876O59008J15833K7485p18784p24392
1156.3B77112389n09167j008873p03831r52301l11088o07129j84497R25159J215897
$$ plain form
1165 274976559 276927128 278319721 280212784 282028542 283910999 286958733 290169888 293172321 295697670
1173.7 295697670 298852825 302421722 305367718 308058090 310843773 313427544 315847721 318414421
1181.4 318414421 320992775 322810097 324350510 326813202 329166679 330613213 331577339 332439194 332789116
1190.1 332789116 333186684 333909416 333688393 332789459 331908798 331562309 331621246 331010056 330006714 329156609
1199.7 329156609 327756615 325956383 324569054 323506050 322608337 321945305 321190491 320239067 319631634
1208.4 319631634 319271660 318740425 318484058 318235283 317473850 316968040 316609993 316298828 316090431 315316944
1218 315316944 314761620 314962101 314996700 314459324 313837204 313190517 312361412 311422443 310372410 309430923
1227.7 309430923 308382759 307599812 307194920 306436634 305377693 304275475 303792248 303370380 302577095
$$ packed form
1165B74976559J950569J392593J893063J815758J882457L047734L211155L002433K525349
1173.7B95697670L155155L568897K945996K690372K785683K583771K420177K566700
1181.4C18414421K578354J817322J540413K462692K353477J446534R64126Q61855L49922
1190.1C32789116L97568P22732k21023q98934q80661l46489N8937o11190j003342q50105
1199.7C29156609j399994j800232j387329j063004q97713o63032p54814r51424o07433
1208.4C19631634l59974n31235k56367k48775p61433n05810l58047l11165k08397p73487
1218C15316944n55324K00481L4599n37376o22120o46687q29105r38969j050033r41487
1227.7C09430923j048164p82947m04892p58286j058941j102218m83227m21868p93285
$$ plain form
1236.4 302577095 302201118 302175159 301932030 301349239 300928822 300650883 300541191 300112038 299767551 299722652
1246 299722652 298967133 298293667 297798653 297622375 297469826 296764927 296532440 296639862 296569805 296354961
1255.7 296354961 296042538 295508595 295853252 296522923 296076756 295839615 296203575 296806202 297312565 297830830
1265.3 297830830 298122292 298364258 299068336 299620209 300545044 301623020 302503910 303301735 304272518
1274 304272518 305476761 306441746 307438335 308567867 309767303 310728073 311678467 312726974 313893147
1282.7 313893147 315371304 317115078 318990154 320410080 321657753 322702103 323706093 324792671
1290.4 324792671 325911026 327175102 328102570 329025879 330050125 330826073 331720238 332869301 333484154
1299 333484154 333740273 334070015 334406853 334570312 334412727 334392281 334264374 334256706 334262161 334079247 333703690
$$ packed form
1236.4C02577095l75977k5959k43129n82791m20417k77939j09692m29153l44487m4899
1246B99722652p55519o73466m95014j76278j52549p04899k32487J07422p0057k14844
1255.7B96354961l12423n33943L44657O69671m46167k37141L63960O02627N06363N18265
1265.3B97830830K91462K41966P04078N51873R24835J077976Q80890P97825R70783
1274C04272518J204243R64985R96589J129532J199436R60770R50394J048507J166173
1282.7C13893147J478157J743774J875076J419926J247673J044350J003990J086578
1290.4C24792671J118355J264076R27468R23309J024246P75948Q94165J149063O14853
1299C33484154K56119L29742L36838J63459j57585k0446j27907p668N455j82914l75557
$$ plain form
1309.7 333703690 332992020 332500000 331829529 330991516 330260696 330036736 330091095 330061455 330626221 331414261
1319.3 331414261 332573166 333824272 334937668 335924263 336504478 336863899 336945038 337476349 337835464
1328 337835464 338046570 338055115 337531509 337365837 336976891 336489067 336021423 335622826 335393906 335369034
1337.6 335369034 335387268 335128479 335838699 336909904 337887802 338802376 340174904 341570358 341764946
1346.3 341764946 341951065 342103195 342653084 342923470 342716675 342735176 342227745 341726494 341459122 341585999
1355.9 341585999 341598930 341462135 340672264 339669571 338861732 337862396 337667122 337157593 337241821 337153130
1365.6 337153130 336488838 336308022 335674934 335172958 334464035 333705254 333463936 333899384 334013596 333132591
1375.2 333132591 333138733 333019981 333137589 333004036 333010979 332805786 331728516 330841293 329115067 327502174
$$ packed form
1309.7C33703690p11670m92020o70471q38013p30820k23960N4359k9640N64766P88040
1319.3C31414261J158905J251106J113396R86595N80215L59421Q1139N31311L59115
1328C37835464K11106Q545n23606j65672l88946m87824m67644l98597k28920k4872
1337.6C35369034J8234k58789P10220J071205R77898R14574J372528J395454J94588
1346.3C41764946J86119J52130N49889K70386k06795J8501n07431n01251k67372J26877
1355.9C41585999J2931j36795p89871j002693q07839r99336j95274n09529Q4228q8691
1365.6C37153130o64292j80816o33088n01976p08923p58781k41318M35448J14212q81005
1375.2C33132591O142j18752J17608j33553O943k05193j077270q87223j726226j612893
$$ plain form
1384.9 327502174 326172676 325014725 323131676 321353760 320260658 318414078 316665783 314449177
1392.6 314449177 312430992 309850636 306612682 304884396 303230953 301975021 298353329 295160179
1400.3 295160179 293858719 291760597 289433861 287338428 285266705 283011532 281261959 279341812
1408 279341812 277389755 276157837 274389133 272961349 271873074 270782261 269757576 268723679 268124065
1416.7 268124065 266963348 266820984 265364819 265121861 266398201 266669712 267405128 267005272 267661705
1425.4 267661705 268718185 269170761 270356598 271117001 272396469 273035374 274868412 276814919 278545475
1434.1 278545475 280824680 282091980 284275322 285383968 288163452 290558395 292248287 294308167
1441.8 294308167 295631638 297739010 299455338 301805077 303327065 304360828 305578995 307181358
$$ packed form
1384.9C27502174j329498j157951j883049j777916j093102j846580j748295k216606
1392.6C14449177k018185k580356l237954j728286j653443j255932l621692l193150
1400.3B95160179j301460k098122k326736k095433k071723k255173j749573j920147
1408B79341812j952057j231918j768704j427784j088275j090813j024685j033897n99614
1416.7B68124065j160717j42364j456165k42958J276340K71511P35416l99856O56433
1425.4B67661705J056480M52576J185837P60403J279468O38905J833038J946507J730556
1434.1B78545475K279205J267300K183342J108646K779484K394943J689892K059880
1441.8B94308167J323471K107372J716328K349739J521988J033763J218167J602363
$$ plain form
1449.5 307181358 309882793 311291637 313242569 314921150 317194271 319209080 320427208 323721199
1457.2 323721199 323294601 326309853 327683716 329961548 332146378 333757057 336295967 337495117
1464.9 337495117 340238991 342008476 344618378 347502327 350408363 354139786 356497231 359416771
1472.6 359416771 361577034 364974670 367829208 369936142 373573647 376813660 379540215 381535072
1480.3 381535072 383499603 385395546 387210732 388766670 390328941 392194901 393035202 393945007 395936356
1489 395936356 395845375 394832993 395778885 396272240 394978256 393419609 392564888 388168793 388280258
1497.7 388280258 387598534 384358978 383680496 382459488 381402283 380418053 380608368 380204697 374909630
1506.4 374909630 372178421 372195473 373290558 373158913 373996277 373267059 371486359 371150894 370559921
$$ packed form
1449.5C07181358K701435J408844J950932J678581K273121K014809J218128L293991
1457.2C23721199m26598L015252J373863K277832K184830J610679K538910J199150
1464.9C37495117K743874J769485K609902K883949K906036L731423K357445K919540
1472.6C59416771K160263L397636K854538K106934L637505L240013K726555J994857
1480.3C81535072J964531J895943J815186J555938J562271J865960Q40301R09805J991349
1489C95936356r0981j012382R45892M93355j293984j558647q54721m396095J11465
1497.7C88280258o81724l239556o78482j221008j057205r84230J90315m03671n295067
1506.4C74909630k731209J7052J095085j31645Q37364p29218j780700l35465n90973
$$ plain form
1515.1 370559921 370875206 369446678 366682243 367262650 368834953 368651466 366512947 367356339 368433456
1523.7 368433456 370163918 370179253 370880814 371771317 371900444 373046646 374272537 375264854 375952492
1532.4 375952492 376837387 375671310 377067757 378613281 379583817 381526413 379621239 376344643 378118629
1541.1 378118629 379408836 379186554 380629616 381944427 380841331 382348709 383167152 384109879 383399467
1549.8 383399467 381806068 382730904 382797890 383693771 381448822 380813942 382026672 382878265 377155838
1558.5 377155838 368415794 374167404 373279610 373567848 372119408 370547066 366705551 362887802 361608543
1567.1 361608543 359174309 357731209 348522873 346051025 344001541 340117187 337054138 333890572
1574.9 333890572 332053757 317625065 315945473 312844849 308423405 304618015 299245872 295429916
$$ packed form
1515.1C70559921L15285j428528k764435N80407J572303j83487k138519Q43392J077117
1523.7C68433456J730462J5335P01561Q90503J29127J146202J225891R92317O87638
1532.4C75952492Q84895j166077J396447J545524R70536J942596j905174l276596J773986
1541.1C78118629J290207k22282J443062J314811j103096J507378Q18443R42727p10412
1549.8C83399467j593399R24836O6986Q95881k244949o34880J212730Q51593n722427
1558.5C77155838q740044N751610q87794K88238j448440j572342l841515l817749j279259
1567.1C61608543k434234j443100r208336k471848k049484l884354l063049l163566
1574.9C33890572j836815j4428692j679592l100624m421444l805390n372143l815956
$$ plain form
1582.6 295429916 289117222 285173588 279503841 275109901 270805588 265485611 262415581 256432457
1590.3 256432457 253290291 247705250 244012432 240050297 235275612 232694550 227905483 225843372
1598 225843372 221157780 218991108 215469055 212382050 211041889 207117233 205777168 202265186 201615486
1606.7 201615486 199042740 197845364 196349525 193459682 194093590 191640205 192116489 190358906 190411282
1615.4 190411282 190216389 185573063 187702541 186555328 187697487 186311684 187869339 188450947 186720257
1624 186720257 187870827 187361717 189831028 188543568 189797649 189935360 190481377 192159119 192542381
1632.7 192542381 195204029 195322800 198883343 197087536 199467983 201134205 201963730 204600067 204992981
1641.4 204992981 208006039 209102364 211712818 213578110 213466644 216815014 216505775 219821873 220362358
$$ packed form
1582.6B95429916o312694l943634n669747m393940m304313n319977l070030n983124
1590.3B56432457l142166n585041l692818l962135m774685k581062m789067k062111
1598B25843372m685592k166672l522053l087005j340161l924656j340065l511982o49700
1606.7B01615486k572746j197376j495839k889843O33908k453385M76284j757583N2376
1615.4A90411282j94893m643326K129478j147213J142159j385803J557655N81608j730690
1624A86720257J150570n09110K469311j287460J254081J37711N46017J677742L83262
1632.7A92542381K661648J18771L560543j795807K380447J666222Q29525K636337L92914
1641.4B04992981L013058J096325K610454J865292j11466L348370l09239L316098N40485
$$ plain form
1650.1 220362358 223773918 226375866 224960346 226651154 226640682 230772247 231986923 234838924 236051922
1658.8 236051922 237867031 240373287 242569599 246340256 247085915 250964928 253204556 256600952
1666.5 256600952 259834480 262126217 265693741 267896595 273412437 275519943 279787426 283794956
1674.2 283794956 286943684 290709114 293816013 298944778 302808590 308119392 311803341 316474609
1681.9 316474609 321792221 323717995 331217537 333082123 338718605 343204498 347992249 353496628
1689.6 353496628 358084526 363548546 368393326 373609085 378636284 383867493 385962982 391791801
1697.3 391791801 398595200 404647751 409523430 410228920 417292786 422883186 427617187 430658722
1705 430658722 434204750 438390503 441827927 445858917 448395424 450872040 453908958 457033653 460626488
$$ packed form
1650.1B20362358L411560K601948j415520J690808j0472M131565J214676K852001J212998
1658.8B36051922J815109K506256K196312L770657P45659L879013K239628L396396
1666.5B56600952L233528K291737L567524K202854N515842K107506M267483M007530
1674.2B83794956L148728L765430L106899N128765L863812N310802L683949M671268
1681.9C16474609N317612J925774P499542J864586N636482M485893M787751N504379
1689.6C53496628M587898N464020M844780N215759N027199N231209K095489N828819
1697.3C91791801O803399O052551M875679P05490P063866N590400M734001L041535
1705D30658722L546028M185753L437424M030990K536507K476616L036918L124695L592835
$$ plain form
1713.7 460626488 462318001 463265762 466653137 469551582 466784248 469643593 473316269 475646210
1721.4 475646210 477709923 479213333 479740601 481140671 483156395 484748344 486760483 488880348
1729.1 488880348 488998833 489732971 493504677 497591476 496853409 493510780 497818947 502036705 504376259
1737.8 504376259 507608643 508553162 507452087 512479286 516546707 518352432 521165657 525120697
1745.5 525120697 528735542 531644974 534864616 537374115 542858849 546113930 547446861 552694893
1753.3 552694893 556605072 560344696 564179268 565353012 567909546 571575661 574587479 578792763
1761 578792763 579607239 579711075 583566856 586032562 588120461 590225258 592268753 591508293 594085655
1769.7 594085655 599295311 600302620 598967323 597477417 601457710 604257698 603530045 605761986
$$ packed form
1713.7D60626488J691513R47761L387375K898445k767334K859345L672676K329941
1721.4D75646210K063713J503410N27268J400070K015724J591949K012139K119865
1729.1D88880348J18485P34138L771706M086799p38067l342629M308167M217758K339554
1737.8E04376259L232384R44519j101075N027199M067421J805725K813225L955040
1745.5E25120697L614845K909432L219642K509499N484734L255081J332931N248032
1753.3E52694893L910179L739624L834572J173744K556534L666115L011818M205284
1761E78792763Q14476J03836L855781K465706K087899K104797K043495p60460K577362
1769.7E94085655N209656J007309j335297j489906L980293K799988p27653K231941
$$ plain form
1777.4 605761986 607520638 609682808 610412903 610303383 612007294 614081764 616238976 615900459 616011848
1786 616011848 617645607 618844795 619366226 621090279 622325020 623115540 622626724 621753616 625412788
1794.7 625412788 626941338 626742096 628264046 630478287 631318321 630002289 632252579 632693939 633158646
1803.4 633158646 634862022 635661850 637114220 637965622 638348961 639193039 641125565 640430908 640332336
1812.1 640332336 641489563 641956253 643423691 644109116 645791779 645965958 646168365 647330017 647206421
1820.8 647206421 648094788 647908783 649083481 650568619 649051437 649222488 651274643 653848267 654525909
1829.4 654525909 651906815 652084045 654124222 654443359 654744949 655179138 655581284 656009979 655686646
1838.1 655686646 657302628 658114624 658969040 659507370 660922623 662558212 656815643 658043137 660292358
$$ packed form
1777.4F05761986J758652K162170P30095j09520J703911K074470K157212l38517J11389
1786F16011848J633759J199188N21431J724053J234741P90520m88816q73108L659172
1794.7F25412788J528550j99242J521950K214241Q40034j316032K250290M41360M64707
1803.4F33158646J703376P99828J452370Q51402L83339Q44078J932526o94657r8572
1812.1F40332336J157227M66690J467438O85425J682663J74179K02407J161652j23596
1820.8F47206421Q88367j86005J174698J485138j517182J71051K052155K573624O77642
1829.4F54525909k619094J77230K040177L19137L01590M34189M02146M28695l23333
1838.1F55686646J615982Q11996Q54416N38330J415253J635589n742569J227494K249221
$$ plain form
1846.8 660292358 660516586 660423279 661249619 662665024 662645721 663222351 663169327 663846436 664115753 663915329
1856.4 663915329 664542770 664236832 664865875 665275192 665847168 666032028 666657181 667355347 667442780 668201523
1866.1 668201523 667767334 668704758 667533264 665595932 666819077 667977448 668870850 669233856 670288544
1874.8 670288544 670209961 670131149 670167007 670053177 670194321 670059662 670866318 670472794 670917740 671511459
1884.4 671511459 671565704 672017975 672067337 673536682 673554077 671977921 672135086 672944031 673030167 673561401
1894.1 673561401 674206772 673446198 673873672 673708344 673876495 674235992 674312057 674492798 674199982 674844971
1903.7 674844971 674552917 674697189 674945602 675212326 675714951 675614395 675618134 674883881 675734558 675827637
1913.3 675827637 675735626 675863800 676099548 678263702 677019043 675849152 676413193 676580658 676971359
$$ packed form
1846.8F60292358K24228r3307Q26340J415405j9303N76630n3024O77109K69317k00424
1856.4F63915329O27441l05938O29043M09317N71976J84860O25153O98166Q7433P58743
1866.1F68201523m34189R37424j171494j937332J223145J158371Q93402L63006J054688
1874.8F70288544p8583p8812L5858j13830J41144j34659Q06656l93524M44946N93719
1884.4F71511459N4245M52271M9362J469345J7395j576156J57165Q08945Q6136N31234
1894.1F73561401O45371p60574M27474j65328J68151L59497P6065J80741k92816O44989
1903.7F74844971k92054J44272K48413K66724N02625j00556L739p34253Q50677R3079
1913.3F75827637r2011J28174K35748K164154j244659j169891N64041J67465L90701
$$ plain form
1922 676971359 676298141 675921936 676394653 677012558 676784286 677233429 677309570 677179184 677281647 676971207
1931.7 676971207 677541809 677029419 676868057 676724777 676930008 677626419 677641678 678108826 677729568 678634644
1941.3 678634644 678503418 676317368 676481781 677109375 677314682 676921768 677221985 676985474 676939011 677414932
1951 677414932 677682724 677864609 677225800 676949615 676479263 676300049 675997314 675986252 676325226 676421890
1960.6 676421890 677164230 676957245 676947021 676855087 676871872 676998825 676088257 675557861 675508728 676091080
1970.2 676091080 676079483 676364899 676775970 676864853 676864166 676399307 676591034 676088791 675869293 675861511 675921478
1980.8 675921478 675936127 675534439 675931473 675886383 676056595 675852661 676011124 675868454 674811935 675253067
1990.5 675253067 675387115 674781418 674167480 674709396 675253983 675612030 675962601 675321045 675477829 674804306
$$ packed form
1922F76971359o73218l76205M72717O17905k28272M49143P6141j30386J02463l10440
1931.7F76971207N70602n12390j61362j43280K05231O96411J5259M67148l79258R05076
1941.3F78634644j31226k186050J64413O27594K05307l92914L00217k36511m6463M75921
1951F77414932K67792J81885o38809k76185m70352j79214l02735j1062L38974R6664
1960.6F76421890P42340k06985j0224r1934J6785J26953r10568n30396m9133N82352
1970.2F76091080j1597K85416M11071Q8883o87m64859J91727n02243k19498p782N9967
1980.8F75921478J4649m01688L97034m5090J70212k03934J58463j42670j056519M41132
1990.5F75253067J34048o05697o13938N41916N44587L58047L50571o41556J56784o73523
$$ plain form
2000.1 674804306 674197540 673814621 673503418 673904343 673814468 674272919 674291153 674549179 674423523 673799667
2009.8 673799667 673555984 673092422 672959518 672335434 672073288 672011642 672249680 672306824 672216263 672497711
2019.4 672497711 672281036 672385406 671611786 671244507 671204910 670909424 670973816 670716248 670747147 670485458
2029.1 670485458 670858459 670633316 670261230 670429230 669883728 669531403 668892975 668757095 668684387 668841934
2038.7 668841934 668658829 668519516 668984375 668583450 668830719 668395233 668073883 667838058 667335815 667403412
2048.4 667403412 667089615 667507095 667516785 667776794 667565994 666999130 667062149 666650391 666703873 666429214
2058 666429214 666618652 666498260 666412811 666725082 666536102 666717300 666391449 666323929 665664520 665294342
2067.6 665294342 665346909 665270844 665482712 665064774 665339203 665084991 665115738 665347137 665375748 665535278
$$ packed form
2000.1F74804306o06766l82919l11203M00925q9875M58451J8234K58026j25656o23856
2009.8F73799667k43683m63562j32904o24084k62146o1646K38038N7144r0561K81448
2019.4F72497711k16675J04370p73620l67279l9597k95486O4392k57568L0899k61689
2029.1F70485458L73001k25143l72086J68000n45502l52325o38428j35880p2708J57547
2038.7F68841934j83105j39313M64859m00925K47269m35486l21350k35825n02243O7597
2048.4F67403412l13797M17480R690K60009k10800n66864O3019m11758N3482k74659
2058F66429214J89438j20392q5449L12271j88980J81198l25851o7520o59409l70178
2067.6F65294342N2567p6065K11868m17938K74429k54212L0747K31399K8611J59530
$$ plain form
2077.3 665535278 664574661 664187012 664041519 664443741 664344177 663962784 663872757 663452835 664059372 663841782
2086.9 663841782 663468628 663373108 663462219 663386993 662631226 662348862 662278442 662731018 662485428 662620316
2096.6 662620316 662714157 662092590 661791458 661352081 661396942 660934219 661253204 661396255 660947647 660943985
2106.2 660943985 660545883 660434723 659863205 659916611 659638367 659377747 659651489 659441147 659576569 659219284
2115.9 659219284 659319305 658807144 658539124 658854980 658499603 658309021 658007050 658421326 658052368 657964859
2125.5 657964859 658234558 658097992 658427505 658200531 658271790 658097229 658207626 657756958 657210007 657563019
2135.1 657563019 657491074 657692947 657364349 657552185 657715225 657638626 657488174 656986542 657372055 657297363
2144.8 657297363 657345963 657054901 657038269 657604294 657807617 657997818 657459793 657321930 657126694 657197266
$$ packed form
2077.3F65535278r60617l87649j45493M02222r9564l81393r0027m19922O06537k17590
2086.9F63841782l73154r5520Q9111p5226p55767k82364p0420M52576k45590J34888
2096.6F62620316R3841o21567l01132m39377M4861m62723L18985J43051m48608l662
2106.2F60943985l98102j11160n71518N3406k78244k60620K73742k10342J35422l57285
2115.9F59219284J00021n12161k68020L15856l55377j90582l01971M14276l68958q7509
2125.5F57964859K69699j36566L29513k26974P1259j74561J10397m50668n46951L53012
2135.1F57563019p1945K01873l28598J87836J63040p6599j50452n01632L85513p4692
2144.8F57297363M8600k91062j6632N66025K03323J90201n38025j37863j95236P0572
$$ plain form
2154.4 657197266 657294083 657378159 657671890 657275848 657473907 657478180 657632446 657661667 657755051 657913895 657383041
2165 657383041 657583923 657455368 657347717 657251816 657484207 658037872 657991409 658099594 658126602 658348007
2174.7 658348007 657976990 657738266 657782059 657629318 657658615 657741089 658123169 657897568 657972565 657974319 658110275
2185.3 658110275 658352432 658041306 658117371 657938690 658252563 658371124 658427277 658411484 658348236 658643723
2194.9 658643723 658381500 658856430 658941422 658926620 658812866 658744583 659086456 658742065 659039612 658849945
2204.6 658849945 659246140 659751816 659385757 659260101 658926926 659363327 659333420 659071655 658936005 659250641
2214.2 659250641 659816818 659809723 660077209 659743881 659630203 659438019 659353104 659477921 659448395 659730759
2223.9 659730759 659590225 659818115 659761658 659778214 659597168 659563141 660023422 659528809 659183502 658814468
$$ packed form
2154.4F57197266R6817Q4076K93731l96042J98059M273J54266K9221R3384J58844n30854
2165F57383041K00882j28555j07651r5901K32391N53665m6463J08185K7008K21405
2174.7F58348007l71017k38724M3793j52741K9297Q2474L82080k25601P4997J754J35956
2185.3F58110275K42157l11126P6065j78681L13873J18561N6153j5793o3248K95487
2194.9F58643723k62223M74930Q4992j4802j13754o8283L41873l44391K97547j89667
2204.6F58849945L96195N05676l66059j25656l33175M36401k9907k61765j35650L14636
2214.2F59250641N66177p095K67486l33328j13678j92184q4915J24817k9526K82364
2223.9F59730759j40534K27890n6457J6556j81046l4027M60281m94613l45307l69034
$$ plain form
2233.5 658814468 659052124 659265900 659336929 659643250 659448013 659378052 659076538 659218750 659022903 659129639
2243.2 659129639 659401703 659218216 659181137 658673019 658956833 658958054 659132385 659072800 658520126 658562469
2252.8 658562469 658295059 658747940 658824539 658944626 659109192 659253006 659349289 658815994 659056168 658673706
2262.4 658673706 658375778 658058090 658091278 658403473 658153610 658391800 658227997 658781281 658748474 658789749
2272.1 658789749 658918381 658157120 658368073 657996826 657784882 657503357 657751312 658331757 658108063 658020477
2281.7 658020477 657601013 657905273 657646179 657266769 657147980 656985855 656937637 656340027 656658859 656694031
2291.4 656694031 656929398 656990128 656686859 656641388 656212540 656146393 655455551 655537415 655575867 655493469 655601959
2302 655601959 654960022 655172348 655408859 655761566 655140457 654581985 654348984 653514709 653534470 653228760
$$ packed form
2233.5F58814468K37656K13776P1029L06321j95237o9961l01514J42212j95847J06736
2243.2F59129639K72064j83487l7079n08118K83814J221J74331n9585n52674M2343
2252.8F58562469k67410M52881P6599J20087J64566J43814R6283n33295K40174l82462
2262.4F58673706k97928l17688L3188L12195k49863K38190j63803N53284l2807M1275
2272.1F58789749J28632p61261K10953l71247k11944k81525K47955N80445k23694q7586
2281.7F58020477m19464L04260k59094l79410j18789j62125m8218n97610L18832L5172
2291.4F56694031K35367O0730l03269m5471m28848o6147o90842Q1864L8452q2398J08490
2302F55601959o41937K12326K36511L52707o21109n58472k33001q34275J9761l05710
$$ plain form
2311.6 653228760 653467941 653409348 653217697 652842636 652733688 653185501 652376862 652263107 651240768 650721741
2321.3 650721741 650770798 650240631 650605087 650595169 650918808 650451660 650324097 649790421 649955139 650443268
2330.9 650443268 649535599 649736481 649042892 649267273 648685989 647779236 648157501 648322525 648886642 647545013
2340.6 647545013 647431793 648129883 648283539 647999649 647497330 647621689 647148972 647452545 648146515 648381577
2350.2 648381577 647432098 646947937 646725922 645915375 646167145 645666504 645261993 644001541 644082031 645139999
2359.8 645139999 644337921 643357925 643771515 644781342 643294296 643603821 643236084 642007980 642185822
2368.5 642185822 642707062 643652344 643133316 643164368 642530746 642517090 643011398 642556610 642838058 642830429
2378.2 642830429 642913208 642478256 642423325 642583237 642078629 641931000 641647873 641417007 640842514 640423126
$$ packed form
2311.6F53228760K39181n8593j91651l75061j08948M51813q08639j13755j022339n19027
2321.3F50721741M9057n30167L64456r918L23639m67148j27563n33676J64718M88129
2330.9F50443268r07669K00882o93589K24381n81284r06753L78265J65024N64117j341629
2340.6F47545013j13220O98090J53656k83890n02319J24359m72717L03573O93970K35062
2350.2F48381577r49479m84161k22015q10547K51770n00641m04511j260452Q0490J057968
2359.8F45139999q02078r79996M13590J009827j487046L09525l67737j228104J77842
2368.5F42185822N21240R45282n19028L1052o33622j3656M94308m54788K81448p629
2378.2F42830429Q2779m34952n4931J59912n04608j47629k83127k30866n74493m19388
$$ plain form
2387.8 640423126 640387573 640571213 640694504 640433807 640287094 639822922 639679222 639215355 638880997 638670044
2397.4 638670044 638092613 637964668 637420311 637270813 637194481 637121201 636940002 636647758 636481667 635462151
2407.1 635462151 635061569 634811211 634716454 634628525 634004936 633674622 633255730 633261414 633183594 632952118
2416.7 632952118 632745934 632516289 631674614 631019249 631180496 630238152 629736633 629638634 629505043 629532356
2426.4 629532356 628972969 628459663 628018684 627845993 626951561 626243095 626059685 626050491 626015739 625132294
2436 625132294 624979439 624789543 624722519 624635963 624089546 623716049 622963600 622555199 621884575 621440544
2445.7 621440544 621123695 620762482 620567856 620193977 620273895 619614410 618872375 618316040 617854080 617660255
2455.3 617660255 617237473 616960335 616480904 616152916 615628204 615212402 614708328 614177055 614091377 613718071
$$ packed form
2387.8F40423126l5553J83640J23291k60697j46713m64172j43700m63867l34358k10953
2397.4F38670044n77431j27945n44357j49498p6332p3280j81199k92244j66091j019516
2407.1F35462151m00582k50358r4757q7929o23589l30314m18892N684p7820k31476
2416.7F32952118k06184k29645q41675o55365J61247r42344n01519r7999j33591K7313
2426.4F29532356n59387n13306m40979j72691q94432p08466j83410r194l4752q83445
2436F25132294j52855j89896o7024q6556n46417l73497p52449m08401o70624m44031
2445.7F21440544l16849l61213j94626l73879P9918o59485p42035n56335m61960j93825
2455.3F17660255m22782k77138m79431l27988n24712m15802n04074n31273q5678l73306
$$ plain form
2465 613718071 613392372 612711830 612320900 611791801 611324272 611147575 610358696 610048256 609488983 609019966
2474.6 609019966 608702660 608334923 608046532 607407532 607042542 606618462 606341820 605548210 604758835 604367104
2484.2 604367104 603849487 603385086 602562866 602178078 601622086 601227188 600871620 600165825 600128593 599890518
2493.9 599890518 599332924 598679008 598316422 597758484 596971130 596342201 595703239 595278931 594672813 594626465
2503.5 594626465 594421806 593643761 592832451 592151413 591572876 590700951 590477142 590309296 590012703 589372063
2513.2 589372063 588694267 588792038 588500252 587782745 587004242 586583252 585907249 585460587 585291176 584406395
2522.8 584406395 583846855 583701897 583733788 583042297 582341652 582130508 581702385 581178551 580388680 579929428
2532.5 579929428 579011421 578415756 578384552 578246346 578053665 577121544 576622124 576362305 576224442 575680428
$$ packed form
2465F13718071l25699o80542l90930n29099m67529j76697p88879l10440n59273m69017
2474.6F09019966l17306l67737k88391o39000l64990m24080k76642p93610p89375l91731
2484.2F04367104n17617m64401q22220l84788n55992l94898l55568p05795l7232k38075
2493.9E99890518n57594o53916l62586n57938p87354o28929o38962m24308o06118m6348
2503.5E94626465k04659p78045q11310o81038n78537q71925k23809j67846k96593o40640
2513.2E89372063o77796R7771k91786p17507p78503m20990o76003m46662j69411q84781
2522.8E84406395n59540j44958L1891o91491p00645k11144m28123n23834p89871m59252
2532.5E79929428r18007n95665l1204j38206j92681r32121m99420k59819j37863n44014
$$ plain form
2542.1 575680428 574709358 574180374 573608780 573351250 572975082 572783432 572261848 571623917 571223297 570454636
2551.7 570454636 570190430 569799576 569653854 569314842 568298607 567541542 567311630 567240677 566728096 566430779
2561.4 566430779 565819016 565477791 565218353 564502640 564042740 563366737 562904930 562159767 561667595 561473808
2571 561473808 561196098 561054077 560426216 560043640 559817696 559681816 559089470 558467941 558096237 557460213
2580.7 557460213 557138519 556170120 555310173 555063934 555122223 555046921 554317245 553765030 553375969 553054008
2590.3 553054008 552179947 551569519 551333427 550782547 550399628 549936142 549612389 548840904 548036308 547670288
2600 547670288 547536011 547255096 546592331 546348953 545625229 544570351 543877678 543555832 543164253 542541275
2609.6 542541275 542166710 541588707 541328011 541081848 540570564 539882431 539150543 538582420 537780342 537304497
$$ packed form
2542.1E75680428r71070n28984n71594k57530l76168j91650n21584o37931m00620p68661
2551.7E70454636k64206l90854j45722l39012j016235p57065k29912p0953n12581k97317
2561.4E66430779o11763l41225k59438p15713m59900o76003m61807p45163m92172j93787
2571E61473808k77710j42021o27861l82576k25944j35880n92346o21529l71704o36024
2580.7E57460213l21694r68399q59947k46239N8289p5302p29676n52215l89061l21961
2590.3E53054008q74061o10428k36092n50880l82919m63486l23753p71485q04596l66020
2600E47670288j34277k80915o62765k43378p23724j054878o92673l21846l91579o22978
2609.6E42541275l74565n78003k60696k46163n11284o88133p31888n68123q02078m75845
$$ plain form
2619.3 537304497 536750908 536319771 536135101 535712624 535071487 534339409 533848000 533041077 532180328 531210365
2628.9 531210365 530563431 530435562 530040970 529466934 528758659 528430290 528050232 527613297 527182846 526596336
2638.5 526596336 525902405 525065079 524720116 524085159 523400574 522767792 521976166 521450081 521013985 520814972
2648.2 520814972 520215721 519737740 519440804 518894501 518420334 517852287 517223663 516547546 515975113 515505447
2657.8 515505447 515517120 515190582 514562950 514190903 513602295 513190765 512424431 511769905 511359177 511098099
2667.5 511098099 510871353 510439301 510325508 509942627 509604645 508643265 507930145 507825775 507250519 507232246
2677.1 507232246 506839905 506297760 505799408 505279274 504941826 504545059 504420929 503835220 503533707 502952156
2686.8 502952156 502217636 502221642 502012215 501514549 500763931 500566597 500325012 499614754 498995018 498448792
$$ packed form
2619.3E37304497n53589m31137j84670m22477o41137p32078m91409q06923q60749r69963
2628.9E31210365o46934j27869l94592n74036p08275l28369l80058m36935m30451n86510
2638.5E26596336o93931q37326l44963o34957o84585o32782p91626n26085m36096j99013
2648.2E20814972n99251m77981k96936n46303m74167n68047o28624o76117n72433m69666
2657.8E15505447J1673l26538o27632l72047n88608m11530p66334o54526m10728k61078
2667.5E11098099k26746m32052j13793l82881l37982r61380p13120j04370n75256j8273
2677.1E07232246l92341n42145m98352n20134l37448l96767j24130n85709l01513n81551
2686.8E02952156p34520M006k09427m97666p50618j97334k41585p10258o19736n46226
$$ plain form
2696.4 498448792 498035164 497671242 497602615 497590828 497476006 496633949 495902443 495662766 495297241 495128021
2706 495128021 494570732 494354630 494098663 493559952 493097343 492534027 492478180 492074814 491379967 490659523
2715.7 490659523 490330429 490630150 490586548 489946480 489289474 489067078 488781509 488771400 488588448 488187790
2725.3 488187790 487962837 487466812 487023697 486758919 486825447 486447678 486009483 485879898 485847664 485730400
2735 485730400 485138931 485095329 484609032 484048347 483969498 483747253 483584251 483093071 483040543 482657166
2744.6 482657166 482128601 482259254 482399940 482076645 481403389 481297493 481036987 480747299 480243454 479845390
2754.3 479845390 480132828 479940033 479565506 479167404 478819351 478315697 478105545 477864838 477161331 476959267
2763.9 476959267 476818085 476864014 476446457 475880661 475707855 475443344 475278931 474756508 474209061 473619232
$$ packed form
2696.4D98448792m13628l63922o8627j1787j14822q42057p31506k39677l65525j69220
2706D95128021n57289k16102k55967n38711m62609n63316n5847m03366o94847p20444
2715.7D90659523l29094K99721m3602o40068o57006k22396k85569j0109j82952m00658
2725.3D88187790k24953m96025m43115k64778O6528l77769m38195j29585l2234j17264
2735D85730400n91469m3602m86297n60685p8849k22245j63002m91180n2528l83377
2744.6D82657166n28565J30653J40686l23295o73256j05896k60506k89688n03845l98064
2754.3D79845390K87438j92795l74527l98102l48053n03654k10152k40707p03507k02064
2763.9D76959267j41182M5929m17557n65796j72806k64511j64413n22423n47447n89829
$$ plain form
2773.5 473619232 473395958 473071327 472363892 471816826 470993042 470549889 470157814 469857712 469415894 468648415
2783.2 468648415 468285599 468099670 467730789 466851730 466551781 466560097 466262970 465727882 464787827 464061508
2792.8 464061508 463383484 462771301 462063560 461389771 460643463 459861298 459124641 458298340 457988167 457476501
2802.5 457476501 456773415 455855522 455044823 454536209 453960114 453849678 453199005 452239723 451302032 450365829
2812.1 450365829 449474182 448308067 447561264 447028809 446498833 445527954 444592094 443880386 442975502
2820.8 442975502 442156448 441306953 440747566 439607162 438178864 437360916 436726418 435799217 434749336
2829.5 434749336 433926811 432791634 431969337 431005173 429842720 428671417 426957893 425752945 424812546
2838.2 424812546 423717613 422048798 420154686 418375359 416567802 414968452 412761765 410535126
$$ packed form
2773.5D73619232k23274l24631p07435n47066q23784m43153l92075l00102m41818p67479
2783.2D68648415l62816j85929l68881q79059k99949Q316k97127n35088r40055p26319
2792.8D64061508o78024o12183p07741o73789p46308p82165p36657q26301l10173n11666
2802.5D57476501p03086r17893q10699n08614n76095j10436o50673r59282r37691r36203
2812.1D50365829q91647j166115p46803n32455n29976r70879r35860p11708r04884
2820.8D42975502q19054q49495n59387j140404j428298q17948o34498r27201j049881
2829.5D34749336q22525j135177q22297r64164j162453j171303j713524j204948r40399
2838.2D24812546j094933j668815j894112j779327j807557j599350k206687k226639
$$ plain form
2845.9 410535126 408557625 406506348 404239769 401987686 399953880 397964630 396459007 395367432
2853.6 395367432 395216103 394830971 394215012 394192390 394023285 394094429 393733559 393354988 392948456 392611008
2863.2 392611008 392413750 391476517 390593872 389404869 388472061 387672768 386424065 385695000 385426826
2871.9 385426826 384936790 383893433 382865410 381749306 381064987 380376396 379523659 379077873 378107071
2880.6 378107071 377315903 376741676 376281319 375539894 374365883 373220482 371593170 370549431 369831085
2889.3 369831085 368960037 367996407 366963997 366191177 365129128 364104691 362974510 361584663 360450706
2897.9 360450706 359796638 358956985 358159561 357823448 357111282 356420250 355564690 354902382 354206810 352905006
2907.6 352905006 352013168 351037941 349824982 348721123 347647629 346252556 344873199 343499184 341912613
$$ packed form
2845.9D10535126j977501k051277k266579k252083k033806j989250j505623j091575
2853.6C95367432j51329l85132o15959k2622j69105P1144l60870l78571m06532l37448
2863.2C92611008j97258r37233q82645j189003r32808p99293j248703p29065k68174
2871.9C85426826m90036j043357j028023j116104o84319o88591q52737m45786r70802
2880.6C78107071p91168n74227m60357p41425j174011j145401j627312j043739p18346
2889.3C69831085q71048r63630j032410p72820j062049j024437j130181j389847j133957
2897.9C60450706o54068q39653p97424l36113p12166o91032q55560o62308o95572j301804
2907.6C52905006q91838r75227j212959j103859j073494j395073j379357j374015j586571
$$ plain form
2916.3 341912613 340635338 339170036 338214226 337339821 335709763 333992462 332965660 333017197 333206253
2925 333206253 333377571 333148880 333097572 333298683 333348351 333573494 333422394 333719444 334050789 334314690
2934.6 334314690 334729652 335151329 335862274 336190758 336931610 338040543 338959618 339378815 339510765
2943.3 339510765 340047112 340779457 341644058 342319641 343375778 344290199 344808998 345412292 345773430
2952 345773430 346079941 346094475 346432152 346964836 347424126 347980080 349039993 350085335 350261459 351023712
2961.6 351023712 351510429 351829529 352449875 352874832 353996811 354952278 355844498 356483688 356770401
2970.3 356770401 357490005 358458519 359267120 359679260 360291977 360838623 361446533 361922302 362135429 362680740
2979.9 362680740 363118362 363361168 363512306 363943901 364373741 364617271 364627304 364547920 364791336 364841843
$$ packed form
2916.3C41912613j277275j465302r55810q74405j630058j717301j026802N1537J89056
2925C33206253J71318k28691n1308K01111M9668K25143j51100K97050L31345K63901
2934.6C34314690M14962M21677P10945L28484P40852J108933R19075M19197J31950
2943.3C39510765N36347P32345Q64601O75583J056137R14421N18799O03294L61138
2952C45773430L06511J4534L37677N32684M59290N55954J059913J045342J76124P62253
2961.6C51023712M86717L19100O20346M24957J121979R55467Q92220O39190K86713
2970.3C56770401P19604R68514Q08601M12140O12717N46646O07910M75769K13127N45311
2979.9C62680740M37622K42806J51138M31595M29840K43530J0033p9384K43416N0507
$$ plain form
2989.6 364841843 365273056 365784683 365801964 365613365 365247498 364909668 364615250 364486465 364067421 363480339
2999.2 363480339 363010483 362632370 362275047 361729088 361309547 360770798 360156364 359661903 359078674 358134651
3008.8 358134651 357259102 356644096 356082535 356051788 355661087 354941826 354338989 353538208 352915535 352245865
3018.5 352245865 351638680 351105995 350384789 349397964 348414001 347867508 347412338 346515198 345459633
3027.2 345459633 344754219 344253998 343835678 342718163 341439896 340905838 340459785 339654808 338008842
3035.9 338008842 336891212 336553726 335864944 335120506 334461632 333789482 333045921 332592125 331637039
3044.5 331637039 330037117 328596268 327780075 327605057 327020378 326475945 325678062 324561806 323719444
3053.2 323719444 322720642 321905785 321052437 320197830 319320240 318513298 317784100 316936264 316274529 315538807
$$ packed form
2989.6C64841843M31213N11627J7281j88599l65867l37830k94418j28785m19044n87082
2999.2C63480339m69856l78113l57323n45959m19541n38749o14434m94461n83229r44023
3008.8C58134651q75549o15006n61561l0747l90701p19261o02837q00781o22673o69670
3018.5C52245865o07185n32685p21206r86825r83963n46493m55170q97140j055565
3027.2C45459633p05414n00221m18320j117515j278267n34058m46053q04977j645966
3035.9C38008842j117630l37486o88782p44438o58874o72150p43561m53796r55086
3044.5C31637039j599922j440849q16193j75018n84679n44433p97883j116256q42362
3053.2C23719444r98802q14857q53348q54607q77590q06942p29198q47836o61735p35722
$$ plain form
3062.9 315538807 314600830 313479042 313015251 312556686 311794872 311462193 310577545 309407597 308459606
3071.5 308459606 308002663 307352352 306521206 306502304 306014271 305026073 304140186 303269596 302445030 301808510
3081.2 301808510 301241760 300452499 299935436 299367599 298445015 297419262 296907883 296560898 295732365
3089.9 295732365 295047932 294243393 293347301 292652912 292251682 291721344 290793209 290266209 289547920 288601723
3099.5 288601723 288134651 287707882 286910152 285979576 285170841 284449883 283879833 283313007 282473984 281510468
3109.1 281510468 280725746 279846039 278894463 277935143 277431393 277625580 277193279 276533718 275952930 274891834
3118.8 274891834 273841743 272971878 272435112 271879654 271255512 270633278 269812241 268837776 267909088
3127.5 267909088 267313919 266695118 266012650 265239525 264386730 263497028 262742233 262203522 261495628 260678406
$$ packed form
3062.9C15538807r37977j121788m63791m58565p61814l32679q84648j169948r47991
3071.5C08459606m56943o50311q31146j8902m88033r88198q85887q70590q24566o36520
3081.2C01808510n66750p89261n17063n67837r22584j025753n11379l46985q28533
3089.9B95732365o84433q04539q96092o94389m01230n30338r28135n27000p18289r46197
3099.5B88601723m67072m26769p97730r30576q08735p20958n70050n66826q39023r63516
3109.1B81510468p84722q79707r51576r59320n03750J94187m32301o59561n80788j061096
3118.8B74891834j050091q69865n36766n55458o24142o22234q21037r74465r28688
3127.5B67909088n95169o18801o82468p73125q52795q89702p54795n38711p07894q17222
$$ plain form
3137.1 260678406 259819870 259413910 258928146 258049679 257497902 256833019 255934105 255094166 254493828 253909168
3146.8 253909168 253329659 252516785 251621151 251106701 250233955 249293003 248507805 247923431 247233124 246469955
3156.4 246469955 246043301 245391636 244870014 243712730 242552319 242204266 241709290 241155472 240329628
3165.1 240329628 239844933 239264450 238287735 237144108 236036625 235766029 235119267 234431076 234040699
3173.8 234040699 233435345 232872524 232239571 231693439 230762119 229903183 229284229 228524246 227718887 226897316
3183.4 226897316 226538162 226380501 225841827 225060043 224501476 223812256 222925224 222004356 221210594 220702477
3193 220702477 219894218 219459648 219242706 218746395 218284473 217573719 216621075 215638504 215081139 214492054
3202.7 214492054 214276180 214392567 213688030 212636795 211542625 211074600 210947914 210389194 209899673
$$ packed form
3137.1B60678406q58536m05960m85764q78467n51777o64883q98914q39939o00338n84660
3146.8B53909168n79509q12874q95634n14450q72746r40952p85198n84374o90307p63169
3156.4B46469955m26654o51665n21622j157284j160411l48053m94976n53818q25844
3165.1B40329628m84695n80483r76715j143627j107483k70596o46762o88191l90377
3173.8B34040699o05354n62821o32953n46132r31320q58936o18954p59983q05359q21571
3183.4B26897316l59154j57661n38674p81784n58567o89220q87032r20868p93762n08117
3193B20702477q08259m34570k16942m96311m61922p10754r52644r82571n57365n89085
3202.7B14492054k15874J16387p04537j051235j094170m68025j26686n58720m89521
$$ plain form
3211.4 209899673 209559574 209325695 208863850 208162632 207670689 207203560 206521988 206182098 205796356 205143700
3221 205143700 204852524 204133072 203211803 202401123 201616306 201361313 201319790 201097641 200503063 199953232
3230.7 199953232 199621220 199149551 198302422 197592888 197184582 196502800 195992775 195398998 194894352 194892712
3240.3 194892712 194889278 194691372 194360294 194289780 193594742 192389774 191622562 191346207 191440487 190850449
3249.9 190850449 190096073 189791565 189861698 189974804 189181194 188430748 188238354 188221397 187912712 186998825
3259.6 186998825 186660843 186773853 186493073 185986004 185075893 184452515 184656982 184785576 184120960 183192711
3269.2 183192711 182983799 183100166 183213596 182802258 181819229 181763134 181715698 180942879 180427208 180415478
3278.9 180415478 180505333 180064850 179548264 179430828 179674969 179622784 179182224 178807354 178251915 177862816
$$ packed form
3211.4B09899673l40099k33879m61845p01218m91943m67129o81572l39890l85742o52656
3221B05143700k91176p19452r21269q10680p84817k54993m1523k22149n94578n49831
3230.7A99953232l32012m71669q47129p09534m08306o81782n10025n93777n04646j640
3240.3A94892712l434j97906l31078p0514o95038j204968p67212k76355R4280n90038
3249.9A90850449p54376l04508P0133J13106p93610p50446j92394j6957l08685r13887
3259.6A86998825l37982J13010k80780n07069r10111o23378K04467J28594o64616r28249
3269.2A83192711k08912J16367J13430m11338r83029n6095m7436p72819n15671j1730
3278.9A80415478Q9855m40483n16586j17436K44141n2185m40560l74870n55439l89099
$$ plain form
3288.5 177862816 177499714 177142715 176704788 176343021 176463337 176249619 176325436 176277103 175447197 174942245
3298.2 174942245 174619942 174730015 175136051 174885063 174122467 173664932 173727436 173672657 173710384 173504105
3307.8 173504105 172801991 172602558 172439804 171923695 171533928 171275997 170922623 170508251 170401001 170128059
3317.4 170128059 169593468 169177399 169044704 169038830 168396530 168196354 168491039 168047829 167580185 167211761
3327.1 167211761 166666050 165850754 165099258 164505825 163923836 163944530 163962269 163671761 163230305 162742729
3336.7 162742729 162516804 162398281 162176208 161346149 160633945 160384750 160044842 159893589 159638367 159226351
3346.4 159226351 159193344 159170513 158819370 158876543 158741236 158143139 158155403 158153019 158220263 158037271 157127199
3357 157127199 157206869 157805805 157570486 157116842 156902761 156857119 157003527 157100420 157126904 157198267 157059898
$$ packed form
3288.5A77862816l63102l56999m37927l61767J20316k13718P5817m8333q29906n04952
3298.2A74942245l22303J10073M06036k50988p62596m57535O2504n4779L7727k06279
3307.8A73504105p02114j99433j62754n16109l89767k57931l53374m14372j07250k72942
3317.4A70128059n34591m16069j32695n874o42300k00176K94685m43210m67644l68424
3327.1A67211761n45711q15296p51496n93433n81989K0694J7739k90508m41456m87576
3336.7A62742729k25925j18523k22073q30059p12204k49195l39908j51253k55222m12016
3346.4A59226351l3007k2831l51143N7173j35307n98097J2264k384O7244j82992r10072
3357A57127199P9670N98936k35319m53644k14081m5642J46408R6893K6484P1363j38369
$$ plain form
3367.6 157059898 156722755 156304312 155921535 155703259 155515518 155309839 155424681 155730906 155705061 155416098
3377.2 155416098 155367594 155727921 155843201 156132307 156406603 155672626 155373316 155307798 154876900 155569324
3386.9 155569324 156494989 156623421 156507225 156234865 156034679 155989122 155705509 155712137 156066713 155969667
3396.5 155969667 155794010 155962429 156106071 156056404 155759563 155703230 156015663 156015730 156116438 156463366 156512022
3407.1 156512022 156515198 156428623 156496983 156938705 157383804 157667446 157878885 157931147 157524080 157639322
3416.8 157639322 158452063 159121914 159463215 159399223 159365454 159130678 159167690 159970894 160566044 160713768
3426.4 160713768 160863113 161035709 161159325 161535301 161599998 161749191 162370510 162433128 162349586 162652569
3436.1 162652569 163397961 164041767 164549580 164974499 165028057 165240269 165074348 165414772 166366863 166846790
$$ packed form
3367.6A57059898l37143m18443l82777k18276j87741k05679J14842L06225k5845k88963
3377.2A55416098m8504L60327J15280K89106K74296p33977k99310o5518m30898O92424
3386.9A55569324R25665J28432j16196k72360k00186m5557k83613O628L54576r7046
3396.5A55969667j75657J68419J43642m9667k96841n6333L12433O7J00708L46928M8656
3407.1A56512022L176q6575O8360M41722M45099K83642K11439N2262m07067J15242
3416.8A57639322Q12741O69851L41301o3992l3769k34776L7012Q03204N95150J47724
3426.4A60713768J49345J72596J23616L75976O4697J49193O21319O2618q3542L02983
3436.1A62652569P45392O43806N07813M24919N3558K12212j65921L40424R52091M79927
$$ plain form
3445.7 166846790 167362537 167556286 167506237 168022995 169087868 169507809 169566784 170106831 170654945 171238041
3455.3 171238041 171314182 171647415 172612514 173769684 175075550 175560207 175456219 175359402 175864830 176675224
3465 176675224 177381687 177772446 177753201 178520718 179320831 179862881 180584431 181166439 181830902 182409458
3474.6 182409458 182962666 183852444 184875317 185271873 185878239 186591244 186689281 187241821 188047848 189169846
3484.3 189169846 190124283 190745926 191323719 191724758 192519188 193345051 194224987 194603195 195173874 196250877
3493.9 196250877 197111607 198201084 198529663 199071560 200126495 201015930 202059078 202969952 204041328
3502.6 204041328 204228420 204309692 205605431 206776466 207400570 208566723 209695721 210144978 211160030
3511.3 211160030 211736717 212279015 213114243 213726883 214602890 215705776 217350769 218368320 219051437
$$ packed form
3445.7A66846790N15747J93749n0049N16758J064873M19941N8975N40047N48114N83096
3455.3A71238041P6141L33233R65099J157170J305866M84657j03988r6817N05428Q10394
3465A76675224P06463L90759j9245P67517Q00113N42050P21550N82008O64463N78556
3474.6A82409458N53208Q89778J022873L96556O06366P13005R8037N52540Q06027J121998
3484.3A89169846R54437O21643N77793M01039P94430Q25863Q79936L78208N70679J077003
3493.9A96250877Q60730J089477L28579N41897J054935Q89435J043148R10874J071376
3502.6B04041328J87092Q1272J295739J171035O24104J166153J128998M49257J015052
3511.3B11160030N76687N42298Q35228O12640Q76007J102886J644993J017551O83117
$$ plain form
3520 219051437 220114079 221356621 222462292 222727890 223425140 224495506 226220646 227495651 227864304
3528.6 227864304 228894463 230264320 231771622 232737083 233608704 234494362 235927906 237251129 237970943
3537.3 237970943 239356976 240045567 241433716 243094769 244148083 245625839 247206516 248945904
3545 248945904 249645824 250596485 251928368 253632851 254959946 256321888 258674335 259180832 260281582
3553.7 260281582 261893349 263822498 265648460 266414528 268563919 270375156 271974335 272992020
3561.4 272992020 275003910 277210541 278074341 281366234 282451744 283344269 284330482 284213314 287580967
3570.1 287580967 289965248 291796684 293629436 295587902 296936703 298386707 300774612 301923714
3577.8 301923714 304726448 306998558 307954197 310112000 312847729 314611931 315524731 319791126 322804375
$$ packed form
3520B19051437J062642J242542J105671K65598O97250J070366J725140J275005L68653
3528.6B27864304J030159J369857J507302R65461Q71621Q85658J433544J323223P19814
3537.3B37970943J386033O88591J388149J661053J053314J477756J580677J739388
3545B48945904O99920R50661J331883J704483J327095J361942K352447N06497J100750
3553.7B60281582J611767J929149J825962P66068K149391J811237J599179J017685
3561.4B72992020K011890K206631Q63800L291893J085510Q92525R86213j17168L367653
3570.1B87580967K384281J831436J832752J958466J348801J450004K387905J149102
3577.8C01923714K802734K272110R55639K157803K735729J764202R12800M266395L013249
$$ plain form
3586.5 322804375 323124123 325046730 324854469 327459297 330734673 333583450 335135994 337141380 340889206
3595.2 340889206 340803909 343271637 347038269 348252258 351308670 352971191 353998985 357614594 360854111
3603.9 360854111 362943039 365949898 368972092 369642220 373490601 374398689 374005318 380363998 382993813
3612.5 382993813 383108940 387709465 388425941 391994934 396312141 397840652 400644798 401465607 403882446
3621.2 403882446 407816505 411089973 413777428 416740723 419897690 423165779 430244179 433266182
3628.9 433266182 425263824 429073715 434157181 439627686 443022194 443505707 446606598 450530128
3636.6 450530128 453904305 456703796 459612846 462005081 464598427 467733803 470328140 473075562
3644.4 473075562 477125587 483617096 483575516 481351776 488191566 490922470 489778366 489360428 495353088
$$ packed form
3586.5C22804375L19748J922607j92261K604828L275376K848777J552544K005386L747826
3595.2C40889206q5297K467728L766632J213989L056412J662521J027794L615609L239517
3603.9C60854111K088928L006859L022194O70128L848381R08088l93371O358680K629815
3612.5C82993813J15127M600525P16476L568993M317207J528511K804146Q20809K416839
3621.2D03882446L934059L273468K687455K963295L156967L268089P078400L022003
3628.9D33266182q002358L809891N083466N470505L394508M83513L100891L923530
3636.6D50530128L374177K799491K909050K392235K593346L135376K594337K747422
3644.4D73075562M050025O491509m1580k223740O839790K730904j144104m17938N992660
$$ plain form
3653 495353088 500737228 505372429 511890564 506286774 508140678 514059486 516279755 518915329 520269051
3661.7 520269051 522952919 525021248 527630043 530004463 530768852 536030655 539871712 541001625
3669.4 541001625 542740974 536367912 538164787 546421928 556498947 559035797 542833481 543835640
3677.1 543835640 551665764 557115707 554507637 554360619 557888985 560249977 562174988 563187256
3684.9 563187256 563785896 568629799 577068596 568979263 563653374 572458839 567854042 566424866
3692.6 566424866 571918411 573934212 576042595 576407890 576074905 576865730 577278786 580839424 585431404
3701.3 585431404 580903893 577515450 582156258 583772736 583965683 585219193 588724899 593678093
3709 593678093 585253677 588925400 596279526 582099838 585455322 590185966 590427399 591110687 593240929
$$ packed form
3653D95353088N384140M635201O518135n603790J853904N918808K220269K635574J353722
3661.7E20269051K683868K068329K608795K374420P64389N261803L841057J129913
3669.4E41001625J739349o373062J796875Q257141J0077019K536850j6202316J002159
3677.1E43835640P830124N449943k608070j47018L528366K360992J925011J012268
3684.9E63187256N98640M843903Q438797q089333n325889Q805465m604797j429176
3692.6E66424866N493545K015801K108383L65295l32985P90825M13056L560638M591980
3701.3E85431404m527511l388443M640808J616478J92947J253510L505706M953194
3709E93678093q424416L671723P354126j4179688L355484M730644K41433O83288K130242
$$ plain form
3717.7 593240929 594630585 591807022 593198967 598543282 595720863 591404190 596418495 598655472
3725.4 598655472 598090820 595069504 594273911 597833633 598916092 604745560 603681488 595444565 604622917
3734 604622917 607428360 598034973 597060585 598523407 598937302 601511002 605367966 601710014 603640404
3742.7 603640404 615782509 608490868 590287857 599042435 604728355 612889366 612357597 599488335
3750.4 599488335 611315384 608996048 599059448 603572693 608170013 612158394 606241417 607769585
3758.2 607769585 614413033 607161713 604350662 608716240 610781784 611111526 615133667 613170166
3765.9 613170166 607463799 610582161 616381721 617481422 607449684 608500366 612449265 612946510
3773.6 612946510 612971764 612129517 613809853 614717216 617320137 618222656 610441208 611687088 613902321
$$ packed form
3717.7E93240929J389656k823563J391945N344315k822419m316673N014305K236977
3725.4E98655472n64652l021316p95593L559722J082459N829468j064072q236923R178352
3734F04622917K805443r393387r74388J462822M13895K573700L856964l657952J930390
3742.7F03640404J2142105p291641j8203011Q754578N685920Q161011n31769j2869262
3750.4E99488335J1827049k319336r936600M513245M597320L988381n916977J528168
3758.2F07769585O643448p251320k811051M365578K065544L29742M022141j963501
3765.9F13170166n706367L118362N799560J099701j0031738J050682L948899M97245
3773.6F12946510K5254q42247J680336R07363K602921R02519p781448J245880K215233
$$ plain form
3782.3 613902321 615286217 617761459 614771919 613202820 614083786 614604607 615785866 615839539 615956154
3790.9 615956154 616012459 616126938 616058769 617400475 621305771 617489166 612561684 615020790 619640083
3799.6 619640083 628123894 623929558 610079041 612739372 615466156 620726624 627778435 618563156
3807.3 618563156 611700668 616422272 619071999 619168701 619488716 619403267 620393677 626235542 626701546
3816 626701546 611528587 615252457 621162758 626043320 630288773 612236252 612486153 618070526
3823.7 618070526 619924126 622640572 622765388 619123268 618616562 619834175 623151779 625394897 616405106
3832.4 616405106 618208580 627235146 622052345 620236626 629926758 622386360 614118652 621835403
3840.1 621835403 618814964 617369308 624540672 623339806 618544998 620752335 622393723 622332726 624113503
$$ packed form
3782.3F13902321J383896K475242k989540j569099Q80966N20821J181259N3673J16615
3790.9F15956154N6305J14479o8169J341706L905296l816605m927482K459106M619293
3799.6F19640083Q483811m194336j3850517K660331K726784N260468P051811r215279
3807.3F18563156o862488M721604K649727R6702L20015q5449R90410N841865M66004
3816F26701546j5172959L723870N910301M880562M245453j8052521K49901N584373
3823.7F18070526J853600K716446J24816l642120n06706J217613L317604K243118q989791
3832.4F16405106J803474R026566n182801j815719R690132p540398q267708P716751
3840.1F21835403l020439j445656P171364j200866m794808K207337J641388o0997J780777
$$ plain form
3848.8 624113503 623504257 624782372 630968170 626769371 628123360 612131195 610588493 622219849
3856.5 622219849 622042770 619680176 622066193 624670830 627882423 622034912 621377106 628845978 622555809
3865.2 622555809 614939499 618914719 624720917 632415237 626258125 614369202 617765770 624207268
3872.9 624207268 629003601 619380989 618252449 621896324 621375237 623750038 628566017 624579506
3880.6 624579506 616286812 620880699 623225784 625053101 630582581 617712975 617759438 622064209
3888.3 622064209 622735214 627832451 628369598 619464760 618999634 622200432 621134529 621995697 622922363
3897 622922363 625421104 628618927 617678757 622171745 625564079 618902473 624174805 621672630
3904.7 621672630 619530525 620444031 620707741 622324715 621892166 622070541 621759224 622279625 622706871
$$ packed form
3848.8F24113503o09246J278115O185798m198799J353989j5992165j542702J1631356
3856.5F22219849j77079k362594K386017K604637L211593n847511o57806P468872o290169
3865.2F22555809p616310L975220N806198P694320o157112j1888923L396568O441498
3872.9F24207268M796333r622612j128540L643875n21087K374801M815979l986511
3880.6F24579506q292694M593887K345085J827317N529480j2869606M6463M304771
3888.3F22064209O71005N097237N37147q904838m65126L200798j065903Q61168R26666
3897F22922363K498741L197823j0940170M492988L392334o661606N272332k502175
3904.7F21672630k142105R13506K63710J616974m32549J78375l11317N20401M27246
$$ plain form
3913.4 622706871 621692810 622932434 625724068 622741394 617986259 622069054 623181534 618756866
3921.1 618756866 620588264 623315163 624826965 623025627 619384842 620191650 621464691 621935959 620918694
3929.8 620918694 620804939 623805084 622228050 619901123 621529808 621881065 621871300 621754532 621095963
3938.5 621095963 621085129 620673180 622130241 623819504 620053215 619235687 620772743 620932541 622258606
3947.2 622258606 621281204 621844902 621804085 618733063 620688896 621774826 620980110 620922432 620971909 621295395
3956.8 621295395 620730286 621399155 620655022 620319099 621258430 619839897 619567413 620532990 621215897
3965.5 621215897 621116180 620746727 620557632 620195312 620034981 620148430 620384216 619659233 619295311 619550438
3975.1 619550438 619428864 619638329 620547485 620994263 620570984 620821915 620927658 620711823 620620956 620980988
$$ packed form
3913.4F22706871j014061J239624K791634k982674m755135M082795J112480m424668
3921.1F18756866J831398K726899J511802j801338l640785Q06808J273041M71268j017265
3929.8F20918694j13755L000145j577034k326927J628685L51257r765j16768o58569
3938.5F21095963j0834m11949J457061J689263l766289q17528J537056J59798J326065
3947.2F22258606r77402N63698m0817l071022J955833J085930p94716n7678M9477L23486
3956.8F21295395n65109O68869p44133l35923R39331j418533k72484R65577O82907
3965.5F21215897r9717l69453j89095l62320j60331J13449K35786p24983l63922K55127
3975.1F19550438j21574K09465R09156M46778m23279K50931J05743k15835r0867L60032
$$ plain form
3984.8 620980988 621279716 620644417 620406303 620336075 620562057 620461197 620390129 620725632 620811386 621272545
3994.4 621272545 620508842 620158691 620602379 619997406 619743462 620122757
4000.2 620122757
$$ packed form
3984.8F20980988K98728o35299k38114p0228K25982j00860p1068L35503Q5754M61159
3994.4F21272545p63703l50151M43688o04973k53944L79295
4000.2F20122757
##END=$$ End of the data block
