##TITLE=$$ Begin of the data block
##JCAMP-DX=5.00 $$ ACD/SpecManager v 10.08
##SPECTROMETER/DATA SYSTEM=Varian
##DATE=15 Jan 2013 10:02:22
##DATA TYPE=INFRARED SPECTRUM
##DATA CLASS=XYDATA
##ORIGIN=
##OWNER=
##NPOINTS=3735
##FIRSTX=399.26403809
##LASTX=4000.35498047
##MAXX=4000.35498047
##MINX=399.26403809
##MAXY=75.74362183
##MINY=22.77458763
##XFACTOR=1.0000000000
##YFACTOR=0.000000100000000
##FIRSTY=46.25551987
##DELTAX=0.96440572
##XUNITS=1/CM
##YUNITS=TRANSMITTANCE
##XYDATA=(X++(Y..Y))
399.3D62555199K576484P379456k66037j4383125m481240J77918M077797O753616K557106
$$ 462555199 465131683 472511139 472245102 457861977 453380737 453558655 457636452 464390068 466947174
407.9D66947174o04706o567650o374092J917038L033905m06608r26171n561142k922515
$$ 466947174 466342468 459774818 453400726 455317764 458351669 457945061 457018890 451457748 448535233
416.6D48535233L206520M215545n249901P617722J1199913j195145r678878k785225
$$ 448535233 451741753 455957298 450707397 458325119 469525032 468329887 458651009 455865784
424.3D55865784o92559k479896L343086O041832l491974k291260K85302M522590N694008
$$ 455865784 455173225 452693329 456036415 462078247 458586273 456295013 456580315 461102905 466796913
433D66796913o244774q330726k659302K714577J225547J093941J496163k074051j67504
$$ 466796913 460552139 452221413 449562111 452276688 453502235 454596176 456092339 454018288 453850784
441.7D53850784l42941O5537j230393L28331J279640q58803K092362k163315j959953
$$ 453850784 453507843 453573380 452342987 452671318 453950958 453092155 455184517 453021202 451061249
450.4D51061249J079559R95064J817970J61095l39012m696083n227738j783294M827919
$$ 451061249 452140808 453135872 454953842 455114937 454775925 450079842 444852104 443068810 447896729
459.1D47896729O861076j577034p338295k082787M467163N633393l12119l959579j879273
$$ 447896729 454757805 453180771 445842476 443759689 448226852 453860245 453548126 449588547 447709274
467.7D47709274L38898j632462j992950p55501m830017n00870P235871L74260l065529
$$ 447709274 448048172 446415710 444422760 443667259 438837242 438336372 445572243 445946503 442880974
476.4D42880974J359367l09830L49198k595825n930024j284217K975654K180519k51617
$$ 442880974 444240341 443930511 444279709 441683884 435753860 434469643 437445297 439625816 439374199
485.1D39374199m6768j240921p75490K88658o05774j909218o98204P85561n45044n91698
$$ 439374199 439327431 438086510 437311020 437599678 436993904 435084686 434386482 435172043 434626999 434035301
494.7D34035301j316986J236344R19151k019081P5149k190895m206772j157074L251953
$$ 434035301 432718315 433954659 434873810 432854729 432929878 430738983 426532211 425375137 428627090
503.4D28627090L275719r1820j64451K3002j030922M88015j364250j275139J659011
$$ 428627090 431902809 431810989 431646538 431669540 430638618 431126633 429762383 428487244 430146255
512.1D30146255n25550o41632k063294m677200j236763O80237Q58230L61405L17840
$$ 430146255 429620705 428979073 426915779 422238579 421001816 421682053 422540283 422901688 423219528
520.8D23219528L15514r66187J27030L94249J63383j646118k265816j189270n12924
$$ 423219528 423535042 422568855 422695885 423090134 423253517 421607399 419341583 418152313 417639389
529.5D17639389J318245J042328o54869r24340J454087R10492j828118J95961P05910
$$ 417639389 418957634 419999962 419345093 418420753 419874840 420785332 418957214 419153175 419859085
538.1D19859085q81233q05702j676751j323547j9455j398773o79588O50291K33460
$$ 419859085 418977852 418172150 416495399 415171852 415152397 413753624 413074036 413724327 413957787
546.8D13957787J208000j336441k847443p45811K73857j138191j159249J442719J9989
$$ 413957787 415165787 413829346 410981903 410236092 410509949 409371758 408212509 409655228 409675217
555.5D09675217j07727k96364j563568k75231m78592j236496j287803P36236M91638
$$ 409675217 409567490 409271126 407707558 407432327 406953735 405717239 404429436 405165672 405657310
564.2D05657310P43790J347847K12402R00002m71191n3330o7367k75956q40187k993087
$$ 405657310 406401100 407748947 407961349 408861351 408390160 408336830 408269463 407993507 407153320 404160233
573.8D04160233m31786K14462J107331J597824L52974k03438q29926J052094k0409
$$ 404160233 403728447 403942909 405050240 406648064 407001038 406797600 405967674 407019768 406999359
582.5D06999359r90791j378327j405830Q19740P97539J347466J341095P88078K08816
$$ 406999359 406008568 404630241 403224411 404044151 404841690 406189156 407530251 408318329 408527145
591.2D08527145k167358j670837J621284K275810k70767o63948M93851R06486k19002
$$ 408527145 406359787 404688950 406310234 408586044 408315277 407651329 408145180 409051666 408832664
599.9D08832664j17034R63974k28920m97170r31663j403809o91681l40843k79961r55200
$$ 408832664 408715630 409679604 409450684 408953514 408021851 406618042 405926361 405585518 405305557 404350357
609.5D04350357l78799J448288J270446j349334k098961j131554m31595P26662L86543
$$ 404350357 403971558 405419846 406690292 405340958 403241997 402110443 401678848 402405510 402792053
618.2D02792053p96966q43163R29527K689171J890564l11546r43833k3460J122131
$$ 402792053 401995087 401151924 402081451 404770622 406661186 406349640 405405807 405382347 406504478
626.9D06504478J541443J333008R22356n82352P29065K452889J882972K563782J836319
$$ 406504478 408045921 409378929 410301285 409718933 410447998 412900887 414783859 417347641 419183960
635.5D19183960J148186J262092O50559N49736J061554K145271J793480J028252J261100
$$ 419183960 420332146 421594238 422244797 422794533 423856087 426001358 427794838 428823090 430084190
644.2D30084190R14460K30217P24906J351929J581078J066360m14238l15132M03938
$$ 430084190 430998650 431228867 431953773 433305702 434886780 435953140 435538902 435223770 435627708
652.9D35627708L21465n71823k66419J495972O02722M91829P64389r74808p46307k00195
$$ 435627708 435949173 435377350 435110931 436606903 437209625 437701454 438465843 437491035 436744728 436544533
662.5D36544533n38483m33845M58755J025467q57430m681968M392700L367500N87044
$$ 436544533 436006050 435572205 436030960 437056427 436198997 431517029 435909729 439277229 439864273
671.2D39864273N53093L90663m12445Q33206J410294J800117R88312N49660J543274
$$ 439864273 440417366 440808029 440395584 441228790 442639084 444439201 445427513 445977173 447520447
679.9D47520447J744499J549721J202316J727295J45111m43573J512756R07898J014710
$$ 447520447 449264946 450814667 452016983 453744278 453889389 453445816 454958572 455866470 456881180
688.6D56881180J702575J716233Q83026O828J196175R43832p3051j000405q09402R83849
$$ 456881180 458583755 460299988 461183014 461189842 462386017 463329849 463256798 462256393 461446991 462430840
698.2D62430840J407318R55047K55013J213989L039894K054787m81034m65850Q33206
$$ 462430840 463838158 464793205 465048218 466262207 469302101 471356888 470875854 470410004 471243210
706.9D71243210j6213L0060J353951J411628N97763J112595J899414J310692R77058
$$ 471243210 471226997 471257057 472611008 474022636 474620399 475732994 477632408 478943100 479920158
715.6D79920158K03858J15166j95084k90871P50313J53732O91491J869239K060967
$$ 479920158 480124016 480239182 480044098 479753227 480503540 480657272 481348763 483218002 485278969
724.3D85278969J744690Q24013L69377O75735R76753N05677r0943n87272J934356K745934
$$ 485278969 487023659 487847672 488217049 488892784 489869537 490375214 490284271 489696999 491631355 494377289
733.9D94377289k35367M93355J642647J283645Q27217L23181p18574j388702K62336
$$ 494377289 494141922 494635277 496277924 497561569 498388786 498711967 497993393 496604691 496867027
742.6D96867027J20621j74217J140480J534691J561165J918182J595001P85942M96941
$$ 496867027 496987648 496813431 497953911 499488602 501049767 502967949 504562950 505348892 505845833
751.3E05845833j0605J3084p00187N8288J772156J886444K274704J326103J055374
$$ 505845833 505835228 505848312 505148125 505206413 506978569 508865013 511139717 512465820 513521194
760E13521194J178055J962624J975822n80482l24478O30188J083717O50139O21490
$$ 513521194 514699249 516661873 518637695 518057213 517732735 518362923 519446640 520096779 520718269
768.6E20718269K172814J783027M26712p99751p69424j77460l22227q93822q8158M59213
$$ 520718269 522891083 524674110 525100822 524301071 523531647 523354187 523031960 522138138 522049980 522509193
778.3E22509193K14959R28955P68814Q93554j3732K25791R51806l62168m31442j25656
$$ 522509193 522724152 523653107 524421921 525315475 525301743 525527534 526479340 526117172 525685730 525560074
787.9E25560074Q61511L52135l1777L23525J190948J700936m49791k43454j044312
$$ 525560074 526421585 526773720 526741943 527065468 528256416 529957352 529507561 529264107 528219795
796.6E28219795j558037j338424j329575n20592j329193M70314L53852n65796m40483
$$ 528219795 526661758 525323334 523993759 523473167 522143974 522614288 522968140 522402344 521961861
805.3E21961861j729660j847229k277527k551308l170509j782875p27806j320610q39959
$$ 521961861 520232201 518384972 516107445 513556137 510385628 508602753 507874947 506554337 505714378
814E05714378q97522n10749p49970q22716m30603j47552q82340r34105J249619J544723
$$ 505714378 504816856 504306107 503556137 502733421 502302818 502155266 501272926 500338821 501588440 503133163
823.6E03133163J737709K093926K888451L705520L062592K640724K352982L012008
$$ 503133163 504870872 506964798 509853249 513558769 516621361 519262085 521615067 524627075
831.3E24627075K331810K261925K576675K723770L342438L131142L210983J910095
$$ 524627075 526958885 529220810 531797485 534521255 537863693 540994835 544205818 546115913
839E46115913K489930J977119R07440J807862K017974J545182M1313J966324K287216
$$ 546115913 548605843 550582962 551490402 553298264 555316238 556861420 556902733 558869057 561156273
847.7E61156273J646995J890068J646615J635208m42391J269074K172432J437683M68750
$$ 561156273 562803268 564693336 566339951 567975159 567532768 568801842 570974274 572411957 572880707
856.4E72880707r9678J485443J241646K098388J866303J954346N85403m74930N19829
$$ 572880707 572781029 574266472 575508118 577606506 579472809 581427155 582012558 581537628 582057457
865.1E82057457j102219q82682j127663j132393j658630o02761N01252j271782n67398
$$ 582057457 580955238 580072556 578944893 577812500 576153870 575551109 576052361 574780579 574213181
873.8E74213181j966095k392159k067184k312508j355286p87887k60201j100921n15175
$$ 574213181 572247086 569854927 567787743 565475235 564119949 563332062 563071861 561970940 561455765
882.4E61455765l41606k92664m15649j26725K84882j654167r61113n86701l35960j7929
$$ 561455765 561114159 560821495 560405846 560279121 560564003 558909836 557948723 557362022 557026062 557008133
892.1E57008133K29034J524735L47214J84288J336937J564369J81083o78215j309928
$$ 557008133 557237167 558761902 559109116 559293404 560630341 562194710 562375793 561697578 560387650
900.8E60387650j147233K44637j75018Q43544K307625L386192K491531K181626L363189
$$ 560387650 559240417 559485054 559310036 560153580 562461205 565847397 568338928 570520554 573883743
909.4E73883743J019554o752n12313j35804j16501j218452j322823j896133j245651
$$ 573883743 574903297 574896545 574384232 574248428 574131927 572913475 571590652 569694519 568448868
918.1E68448868j479607j920471k907219l356514l220596l884239l253785l552475
$$ 568448868 566969261 565048790 562141571 558785057 555564461 551680222 548426437 544873962
925.8E44873962m200553m117394k895660k844010l086471j838379k251625k692147
$$ 544873962 540673409 536556015 533660355 530816345 527729874 525891495 523639870 520947723
933.6E20947723k598610j389045n53055j117325p01179n73388n57708k93579m34990
$$ 520947723 518349113 516960068 516407013 515289688 514588509 514015121 513457413 513163834 512728844
942.2E12728844j191788j280174j145592r81140l78876l53165L56484L55415K16561
$$ 512728844 511537056 510256882 509111290 508130150 507751274 507398109 507754593 508110008 508326569
950.9E08326569L37219K04048p0114j561203j811752j847382k199440k716332k804794
$$ 508326569 508663788 508867836 508797722 507236519 505424767 503577385 501377945 498661613 495856819
959.6D95856819j860123j721611j517753j639328j972923j907082j295204j222077
$$ 495856819 493996696 492275085 490757332 489118004 487145081 485237999 483942795 482720718
967.3D82720718k454834k640609k118988k209397k670555k309570k368698l279076
$$ 482720718 480265884 477625275 475506287 473296890 470626335 468316765 465948067 462668991
975D62668991l319931l553505m002914m400940m989891m981079m811631n317611n426216
$$ 462668991 459349060 455795555 451792641 447391701 442401810 437420731 432609100 427291489 421865273
983.7D21865273n246735n423622n328713m999008m859238m158859m319496n197754
$$ 421865273 416618538 411194916 405866203 400867195 396007957 391849098 387529602 382331848
991.4C82331848m615974m457894l721923l788224m003830l622093l762245k373238
$$ 382331848 377715874 373257980 369536057 365747833 361744003 358121910 354359665 351986427
999.1C51986427l801346m277458k747192k690849k420922k651710k460861k766762
$$ 351986427 348185081 343907623 341160431 338469582 336048660 333396950 330936089 328169327
1006.8C28169327k151146j668701j096802j244660k323341j866398k465076j818810
$$ 328169327 326018181 324349480 323252678 322008018 319684677 317818279 315353203 313534393
1014.6C13534393j934700k069072k510491l738880k812576k695332j701012k236938
$$ 313534393 311599693 309530621 307020130 303281250 300468674 297773342 296072330 293835392
1022.3B93835392k424603k232208k452392j483860j855812j182480j694947j225853
$$ 293835392 291410789 289178581 286726189 285242329 283386517 282204037 280509090 279283237
1030B79283237q13922q39081j004944j664944M06475L22800Q03432R94606J293660
$$ 279283237 278469315 277630234 276625290 274960346 275366821 275689621 276493053 277487659 278781319
1038.7B78781319J727848R13639J788349J384392J424579L13893j43585m60282j181812
$$ 278781319 280509167 281422806 283211155 284595547 286020126 286334019 286190434 285730152 284548340
1047.4B84548340K92892m44355j097736p36561j119079k609978j025505N4817q94604
$$ 284548340 284841232 284396877 283299141 282562580 281443501 278833523 277808018 277862835 276968231
1056B76968231L08457o30227p2765J8559Q54530J589622J220074L146973K455540K375354
$$ 276968231 277276688 276646461 276573696 276592255 277446785 279036407 280256481 283403454 285858994 288234348
1065.7B88234348J480389J155643J803513J274204R49040R90333J430226m67320J78223
$$ 288234348 289714737 290870380 292673893 293948097 294897137 295887470 297317696 296850376 297028599
1074.4B97028599P21512Q05282J184368M95797J678257O45065L67565P95918J019744
$$ 297028599 297750111 298555393 299739761 300235558 301913815 302558880 302926445 303722363 304742107
1083C04742107M55761P27330J485557M6787J921444K597275K318211J252079J097927
$$ 304742107 305197868 305925198 307410755 307457542 309378986 311976261 314294472 315546551 316644478
1091.7C16644478K425861J208058K076225J524086J165314J972847J670456J661186
$$ 316644478 319070339 320278397 322354622 323878708 325044022 327016869 328687325 330348511
1099.4C30348511K363395K358933Q70361K431412K242393J021882P63168Q57544K191315
$$ 330348511 332711906 335070839 335941200 338372612 340615005 341636887 342400055 343257599 345448914
1108.1C45448914J116981Q64868J001969Q32481L13454N74913J850357J371040J311073
$$ 345448914 346565895 347430763 348432732 349265213 349578667 350153580 352003937 353374977 354686050
1116.8C54686050N41687J21270l59307k49748N81017j35689l50113l43J405983J390419
$$ 354686050 355227737 355349007 354989700 354739952 355320969 355185280 354835167 354834824 356240807 357631226
1126.4C57631226J332931J239891P61833J913643K330475K989616K376557K292137
$$ 357631226 358964157 360204048 360965881 362879524 365209999 368199615 370576172 372868309
1134.1C72868309K707977K314606K612343K365608K222290J975899K226715J903954
$$ 372868309 375576286 377890892 380503235 382868843 385091133 387067032 389293747 391197701
1141.9C91197701J032676N73540L81927K75612M36325J799050J011924j90010O53878
$$ 391197701 392230377 392803917 393185844 393461456 393897781 395696831 396708755 396518745 397172623
1150.5C97172623Q51173J0872n39436k99912p99827p44858l05252o25038o16150m65737
$$ 397172623 398023796 398034668 397495232 397195320 396395493 395650635 395345383 394720345 394104195 393638458
1160.2C93638458j82838k14195r2659p935J033592J985970J333542J473579K383385
$$ 393638458 393455620 393241425 393148766 393140831 394174423 396160393 397493935 398967514 401350899
1168.9D01350899L038063K903747L289757L394165L124848K947921K771645K593460
$$ 401350899 404388962 407292709 410582466 413976631 417101479 420049400 422821045 425414505
1176.6D25414505J877251K155418K370377K625312K715912K584229K393684J773072
$$ 425414505 427291756 429447174 431817551 434442863 437158775 439743004 442136688 443909760
1184.3D43909760J591148J242027Q95233K84043K85263O86M8218O12106m26368m49867
$$ 443909760 445500908 446742935 447638168 447922211 448207474 448208160 448256378 448868484 448442116 447992249
1193.9D47992249K09846k02789r46198j520500j563034j045265j566162k235375j106300
$$ 447992249 448202095 447999306 447053108 445532608 443969574 442924309 441358147 439122772 438016472
1202.6D38016472j011200j435356m54979Q8539l85590q35151p56264r70535o55899
$$ 438016472 437005272 435569916 435114937 435203476 434817886 433982735 433226471 432255936 431600037
1211.3D31600037j39084l14522m44870k38571L53851O2218P438K91520j97449o71730
$$ 431600037 431460953 431146431 430701561 430462990 430816841 430879059 430886497 431178017 430980568 430308838
1220.9D30308838r23195o63109p64732n44357l40729q95462p25594k14882p3547o62460
$$ 430308838 429385643 428722534 427957802 427413445 427072716 426177254 425451660 425236778 425163231 424500771
1230.6D24500771q96988r29146j176796j025772j136437p28187k46277j86844l0212
$$ 424500771 423603783 422674637 421497841 420472069 419335632 418607445 418361168 418174324 418144112
1239.3D18144112L28025J99051p22770m89540k70043p44629q89091q21381n32455m25759
$$ 418144112 418472137 418671188 417948418 417458878 417188835 416444206 415555115 414733734 414201279 413775520
1248.9D13775520k43683j1100K21290J30387M1732k59208k88277q3694r18351p44361
$$ 413775520 413531837 413520737 413742027 413872414 413914146 413654938 413366661 413282967 412364616 411620255
1258.5D11620255k36474K36779M49676J54877P83462M49334O40983Q48999J12877K30904
$$ 411620255 411383781 411620560 412070236 412225113 413008575 413457909 414098892 414947891 415060768 415291672
1268.2D15291672P53364R13697N57479Q98095J212921J386757J098785R69238J520195
$$ 415291672 416045036 416958733 417516212 418414307 419627228 421013985 422112770 423082008 424602203
1276.9D24602203J031266N56297Q96645J312370P62977R87702J698341J706314K010842
$$ 424602203 425633469 426189766 427086411 428398781 429161758 430149460 431847801 433554115 435564957
1285.5D35564957J720314J529846J552658J487694J021347O99158O84585P37343R17320
$$ 435564957 437285271 438815117 440367775 441855469 442876816 443575974 444260559 444997902 445915222
1294.2D45915222O95572P91702R08394J090393O81038K35329J07574J40038M59328
$$ 445915222 446610794 447402496 448310890 449401283 450082321 450317650 450425224 450565262 451024590
1302.9D51024590M4784j63231o86378k96402L99933L86543r956j224633p89451m24309
$$ 451024590 451069374 450906143 450219765 449923363 450323296 450709839 450699883 449475250 448685799 448261490
1312.5D48261490o05888o70014o64864j0566M8637L46756N51033Q39577Q51936J040611
$$ 448261490 447655602 446985588 446320724 446310158 446358795 446705551 447256584 448096161 448948097 449988708
1322.2D49988708J323510N71975O27327O07644M32281j4725k9869Q5945m55932j93787
$$ 449988708 451312218 451884193 452511520 453119164 453551445 453536720 453506851 453592796 453136864 452943077
1331.8D52943077r2430m26788q41484k49749k1705k56920K5596l59687Q5563P90444
$$ 452943077 452850647 452423859 451582375 451332626 451310921 451054001 451079597 450719910 450805473 451595917
1341.5D51595917J495704J040841P58171J058044O20995Q56628p2517L05938K23084
$$ 451595917 453091621 454132462 454890633 455948677 456569672 457426300 457353783 457659721 457882805
1350.2D57882805m75617j40075n31159l0479k99950k73628j15662j87111l91387l64800
$$ 457882805 457407188 457267113 456735954 456705475 456405525 456131897 456016235 455829124 455437737 455072937
1359.8D55072937k88849j422539o27517q43506j0681M34074n30167k92739r26705n75943
$$ 455072937 454784088 453361549 452734032 451890526 451879845 452313919 451783752 451491013 450564308 449988365
1369.4D49988365k45399k33879o46592j335105m12369N6648N79338J97678j23444l86505
$$ 449988365 449742966 449509087 448862495 447527390 447115021 447171669 447751007 447948685 447825241 447438736
1379.1D47438736k62070l51028r61647j160240k195626j519317j082077j167031j666908
$$ 447438736 447176666 446825638 445863991 444703751 442508125 440988808 439906731 438739700 437072792
1387.8D37072792j687660q97560j552849j370201j919022k056579k914582l708839
$$ 437072792 435385132 434487572 432934723 431564522 429645500 427588921 424674339 420965500
1395.5D20965500j418152j703262j767884l252792k436867j439590k202377j311226
$$ 420965500 419547348 417844086 416076202 412823410 410386543 408946953 406744576 405433350
1403.2D05433350j928139l206177k642975j759643j441536j923752j801567j626358
$$ 405433350 403505211 400299034 397656059 395896416 394454880 392531128 390729561 389103203
1410.9C89103203j144715j340522j165619p04384r28459o20423j574859j010399j236038
$$ 389103203 387958488 386617966 385452347 384747963 383819504 383199081 381624222 380613823 379377785
1419.6C79377785N04455J154671k90031N22232M66728J197510J044197N33104J380653
$$ 379377785 379882240 381036911 380746880 381269112 381735840 382933350 383977547 384510651 385891304
1428.3C85891304O11610J376954J107749J601029J318054J385346K550659J254272
$$ 385891304 386502914 387879868 388987617 390588646 391906700 393292046 395842705 397096977
1436C97096977J673088K276001L125878K499771J804466J682777J211396J898613J121711
$$ 397096977 398770065 401046066 404171944 406671715 408476181 410158958 411370354 413268967 414390678
1444.7D14390678J965981J367187Q32978J416626J725273K169227R74198J481972J051712
$$ 414390678 416356659 417723846 418556824 419973450 421698723 423867950 424842148 426324120 427375832
1453.3D27375832J731376J306839k77786j10321R57222N427513K473183K578506K028427
$$ 427375832 429107208 430414047 430136261 430025940 430983162 436410675 438883858 441462364 443490791
1462D43490791J403885J989746P29447L146095K340355K496567K275848K702293K970505
$$ 443490791 444894676 446884422 447613869 450759964 453100319 455596886 457872734 460575027 463545532
1470.7D63545532K312432L918266J934318L880463L330269L120117K751732K345238
$$ 463545532 465857964 469776230 471710548 475591011 478921280 482041397 484793129 487138367
1478.4D87138367K516937J903381K130280K090912K464752J882477J349907J469612
$$ 487138367 489655304 491558685 493688965 495779877 498244629 500127106 501477013 502946625
1486.1E02946625R87701J139183P88231q7356J09558Q82454M85038m77485n96161q84361
$$ 502946625 503934326 505073509 505861740 505774384 505883942 506766396 507251434 506773949 506177788 505293427
1495.8E05293427l941727q71124k167054k721328j69259j003532j102257j323585l36647
$$ 505293427 501351700 500480576 498313522 495592194 495422935 494419403 493317146 491993561 491656914
1504.5D91656914n54428p065812m100418M283600J956635r37805K96135q46711j381759
$$ 491656914 491102486 484036674 479936256 484219856 486176491 485238686 485534821 484688110 483306351
1513.1D83306351j07155j034203j243896k616997o28624J228981N28374k595062l054162
$$ 483306351 483199196 482164993 480921097 478304100 477675476 478904457 479432831 476837769 473783607
1521.8D73783607K363511K288475J748619l4828P51075J132965R36814J253509R80530
$$ 473783607 476147118 478435593 480184212 480149384 480900459 482033424 482970238 484223747 485204277
1530.5D85204277R91669P63130j20087r19571K053795J127777L69683N17082n100479
$$ 485204277 486195946 486959076 486838989 485919418 487973213 489100990 489470673 489987755 484887276
1539.2D84887276N84984L499641J077576N63163J581307J216469L7574J507798J50489
$$ 484887276 485472260 488971901 490049477 490612640 492193947 493410416 493447990 494955788 495106277
1547.9D95106277P27463m577n27955J492272J00288N1422j623153Q96072J047478l82691
$$ 495106277 495833740 495829163 495301208 496793480 496893768 496945190 495322037 496218109 497265587 496882896
1557.5D96882896m769134p186775L909111j84326L18489j456376j370239k660331k482758
$$ 496882896 492113762 484926987 488836098 488651772 488970261 487513885 486143646 483483315 481000557
1566.2D81000557j125412l053474k643967q724213j397629j808204l682137l087120
$$ 481000557 479875145 476821671 474177704 465453491 464055862 462247658 458565521 455478401
1573.9D55478401l752479k383538j2600517j380691l296433m558411m261779o158410
$$ 455478401 451725922 449342384 436741867 435361176 432064743 427506332 423244553 417086143
1581.6D17086143m082298o040573l747711n765305m853897m750633o088257l893547
$$ 417086143 413003845 406963272 403215561 397450256 392596359 387845726 381757469 377863922
1589.3C77863922o260033l791160o427307l665047m367371n646438k868958n093841
$$ 377863922 371603889 367812729 361385422 357720375 353353004 347706566 344837608 339743767
1597C39743767k337151n274772k693863l888665l820037k628918m908867r19628l485050
$$ 339743767 337406616 332131844 329437981 325549316 321729279 319100361 314191494 313271866 309786816
1605.7C09786816j382313l439217j679764j555576l033733M37965k913837J95808k014103
$$ 309786816 308404503 304965286 303285522 301729946 298696213 299134178 296220341 296416149 294402046
1614.4B94402046j23024j61724n081615K288227q66642J093864j822796J152420K35997
$$ 294402046 294279022 294117298 289035683 291323910 290457268 291551132 289728336 290880756 291116753
1623.1B91116753j311894J564331m47864K458973j205388J622868N62973J181297J933289
$$ 291116753 289804859 291369190 290921326 293380299 292174911 293797779 294360752 295542049 297475338
1631.7B97475338N50575K696438j34067L444042j536312K729034J918163J406422L234100
$$ 297475338 298025913 300722351 300588284 304032326 302496014 305225048 307143211 308549633 311783733
1640.4C11783733P27768L010044Q48389K699623J555557q46977L177071j9036M543267
$$ 311783733 312511501 315521545 316369934 319069557 320625114 319778137 322955208 322936172 327479439
1649.1C27479439Q83789K786636K069893K670822o48880j792679M403992J126862K518539
$$ 327479439 328363228 331149864 333219757 335890579 335241699 333449020 337853012 338979874 341498413
1657.8C41498413R46350J762200K239990J371231L203049J195411M152832K396546
$$ 341498413 342444763 344206963 346446953 347818184 351021233 352216644 356369476 358766022
1665.5C58766022L453178L183518K655906M055786J719284N716210L033371M144783
$$ 358766022 362219200 365402718 368058624 372114410 373833694 379549904 382583275 386728058
1673.2C86728058L230667K911224M931679M047699N575256L373261M942741M427872
$$ 386728058 389958725 392869949 397801628 401849327 407424583 410797844 415740585 420168457
1680.9D20168457M820633M748192J858787P892838L507614O435280M560470M887467
$$ 420168457 424989090 429737282 431596069 439488907 442996521 449431801 453992271 458879738
1688.6D58879738N162697M769249O127929N183411N667725N054016M737549K727623
$$ 458879738 464042435 468811684 474939613 480123024 485790749 490844765 495582314 498309937
1696.4D98309937O425209O469574N329437L368149K575988Q259964N538979M242973
$$ 498309937 504735146 511204720 516534157 519902306 522478294 530738258 536277237 540520210
1704.1E40520210L674584L588257L237113L399086M022789K681466K532920K748948
$$ 540520210 544194794 547783051 551020164 554419250 558442039 561123505 563656425 566405373
1711.8E66405373L002891L056030R13811J131973L300438J144905k370948M660835
$$ 566405373 569408264 572464294 573378105 574510078 577810516 578955421 576584473 581245308
1719.5E81245308L660545K167053J437798R95293J732788K067528J830024J344872
$$ 581245308 584905853 587072906 588510704 589505997 591238785 593306313 595136337 596481209
1727.2E96481209J659736J861039J51176P73811K725716K000160k196426j936798N017586
$$ 596481209 598140945 600001984 600153160 600926971 603652687 605652847 603456421 601519623 606537209
1735.9F06537209M559326K881889K903328Q70590O13251M345207K363129M37622K266121
$$ 606537209 611096535 613978424 616881752 617752342 618365593 622710800 625073929 625511551 627777672
1744.6F27777672L798904L078690K327156K788467K523499M899597K531509J841278
$$ 627777672 631576576 634655266 636982422 639770889 642294388 647193985 649725494 651566772
1752.3F51566772M413834L091354L217850K765732Q38165K480698L576279K854995
$$ 651566772 655980606 659071960 662289810 665055542 665893707 668374405 671950684 674805679
1760F74805679K537155m08859J518326L735428J594925J627960J745682J504745j006393
$$ 674805679 677342834 676933975 678452301 682187729 683782654 685410614 687156296 688661041 687654648
1768.7F87654648J836166L744354J02997n44281K64435L702469J978302k85645J988602
$$ 687654648 689490814 693235168 693338165 692793884 693058319 696760788 698739090 698453445 700442047
1777.4G00442047R40170J528626J13220n29098J542587K289886K179413k8992N35126
$$ 700442047 701382217 702910843 703024063 702494965 704037552 706327438 708506851 708477859 709012985
1786G09012985J376267J069793J96991Q00095M20609j69602j320038N48935M063416
$$ 709012985 710389252 711459045 711656036 712456131 712876740 712707138 711387100 711936035 715999451
1794.7G15999451J252365K20794J248780J326904L64304j212006J823578M0741Q98971
$$ 715999451 717251816 717472610 718721390 720048294 720412598 719200592 721024170 721064911 721963882
1803.4G21963882J564942M81720J405487N43747P88727J109008Q83713j002044K95867
$$ 721963882 723528824 724010544 725416031 725959778 726748505 727857513 728741226 727739182 728035049
1812.1G28035049Q66318J08566J172181O08062J255188k2049N40238J349487M86527
$$ 728035049 728901367 729009933 730182114 730790176 732045364 732023315 732563553 733913040 734399567
1820.8G34399567P66220n62897J035767L11432j993943O94504J902618J588288j087189
$$ 734399567 735165787 734602890 735638657 735950089 733956146 734650650 736553268 738141556 737054367
1829.4G37054367j633530J786576K450866L13797p5836L39508r8877j76849k50397
$$ 737054367 735420837 737207413 739658279 739972076 739896240 740235748 740136871 739960022 739709625
1838.1G39709625J423111N96771Q14591P85599J160278J10550m708023K681427J714783
$$ 739709625 741132736 741729507 742544098 743329697 744489975 744600525 739892502 742573929 744288712
1846.8G44288712n51682j09405O08520J135788J66779J022720L25851N27573J65329
$$ 744288712 743737030 743627625 744236145 745371933 745538712 746561432 746887283 747414856 747580185
1855.5G47580185j31073M35715n35889j7471m05732M17176L83453N39627Q25653N40467
$$ 747580185 747449112 747884827 747348938 747331467 746925735 747342911 747726364 748265991 749091644 749632111
1865.1G49632111R75113n73578J27105j324844q82950J405792P74155L27148j99813
$$ 749632111 750607224 750033646 750160751 748835907 747952957 749358749 750132904 750460052 750260239
1873.8G50260239O56814J48010Q43277O03638j51443J51062m30756K41623m24652l2196
$$ 750260239 750917053 751065063 751908340 752511978 752360535 752511597 752080841 752322464 751897812 751865616
1883.4G51865616l52402J65100J170731L87878R96475o11419j083527P68128R31320
$$ 751865616 751513214 751678314 752849045 753236923 754233398 753621979 752538452 753306580 754237900
1892.1G54237900j87454k67106m17175q96988J170655L87878N87463O92368K61917
$$ 754237900 754050446 753783340 753366165 752469177 753639832 754027710 754615173 755307541 755569458
1900.8G55569458M76532p57904j37634l81623p3394k46430k20413M54559K17209Q42438
$$ 755569458 756045990 755288086 755150452 754768829 754695435 754449005 754228592 754683151 754900360 755742798
1910.4G55742798M77829Q46786k75726j30844k44446o11267K58026k353973q3313J448593
$$ 755742798 756220627 757067413 756791687 756660843 756416397 755805130 756063156 753709183 753625870 755074463
1920.1G55074463J365509O59561j093521K26822N57403N02549n39246p26929m77600
$$ 755074463 756439972 757099533 756006012 756232834 756790237 757292786 756753540 756026611 755549011
1928.8G55549011K18582N11628l68882L82843J68915O58035K78855L7231m959p04422
$$ 755549011 755767593 756279221 755910339 756293182 756462097 757120132 757398987 757436218 757431259 756726837
1938.4G56726837n38864r17282O89926m67148r07440J368332O01196k0752k4566P51342
$$ 756726837 756187973 755270691 755960617 755493469 754586029 755954361 756555557 756534805 756510239 757261581
1948.1G57261581k25906l73611l53318m66461j20315m88053L67050n2032P76367N80063
$$ 757261581 757035675 756662064 756308746 755842285 755721970 755233917 755600967 755548935 756325302 756905365
1957.7G56905365k84729k5482o70395j08872n34210l59878k02713K30560L48129n42221
$$ 756905365 756620636 756595154 755924759 755815887 755281677 754921799 754719086 754949646 755297775 754755554
1967.3G54755554O46210P02209M71421l44010p59430o43539l29743p0495m54941M69284
$$ 754755554 755401764 756103973 756575394 756231384 755471954 754828415 754498672 754428177 753973236 754442520
1977G54442520L09143L31345K82364K07519L0518l53928J3657q95615j55487K2431
$$ 754442520 754751663 755083008 755365372 755572891 755603409 755249481 755263138 754367523 754212036 754234467
1986.6G54234467l07312k5940J16806Q32748J56326k06985m41895K22016k20185q80661
$$ 754234467 753927155 753901215 754018021 754850769 755007095 754800110 754358215 754580231 754360046 753479385
1996.3G53479385j18408l41186R3231l15933J8768M01001K96783K97928k52609J0757
$$ 753479385 753360977 753019791 753113022 752797089 752815857 753216858 753513641 753811569 753558960 753569717
2005.9G53569717o36062l44849l86886l05939J75781j16730K16980O943M42886K3880
$$ 753569717 752933655 752588806 752201920 751895981 752071762 751955032 752172012 752178955 752621841 752645721
2015.6G52645721l00521n51835n61981j19323o36597n1651k02866O104N7525K23847
$$ 752645721 752345200 751793365 751231384 751112061 750475464 750423813 750220947 750227051 750284576 750508423
2025.2G50508423M60434j52512L12500k89230l08457p84759q36182j76925l37296L22342
$$ 750508423 750968857 750816345 751128845 750839615 750531158 749746399 748910217 748733292 748395996 748718338
2034.9G48718338K21939L67584L2044J89285N6610m28009m65469r03702J29471j97449
$$ 748718338 748940277 749307861 749339905 749529190 749585800 749157791 748692322 747788620 747918091 747720642
2044.5G47720642m425N1422k72598K92816R1934L97492n16968l91464j09024k70310
$$ 747720642 747716217 747767639 747495041 747787857 747879791 748277283 747760315 747368851 747259827 746989517
2054.1G46989517l65448n23376J99966k97317L27606L25546K58331J82801k61078K15759
$$ 746989517 746624069 746100693 746300659 746003342 746330948 746656494 746914825 747097626 746836548 747052307
2063.8G47052307n95550m5700l02964n13000j47553p1029O41555Q8730J87683j6861
$$ 747052307 746456757 746411057 746108093 745595093 745447540 745376511 746018066 746106796 746294479 746277618
2073.4G46277618R4681j47018m71268k15530m87824q0719j35650L54843j64643o6604
$$ 746277618 746372299 746225281 745754013 745538483 745050659 744969940 744834290 745189133 745024490 744957886
2083.1G44957886J92337l19062L26005k50321P4387k22016n42907k52304k6246L84293
$$ 744957886 745150223 744831161 745157166 744906845 744981232 744759216 744216309 743964005 743937759 744322052
2092.7G44322052o13937k25373J20468N05066N5161n95703m6158k53830n3635n35049
$$ 744322052 743708115 743482742 743603210 744108276 744163437 743567734 743521576 743267746 743214111 742679062
2102.4G42679062o8588J06582K6093J72806k82669K01034j48926j61285l96347q9417
$$ 742679062 742610474 742717056 742743149 742915955 742633286 742834320 742685394 742524109 742127762 742038345
2112G42038345l43704q69522j11313k12326L96729l5019J81656J67160l51334K53448
$$ 742038345 741694641 740825119 740713806 740501480 740898209 740863190 741044846 741212006 740860672 741114120
2121.6G41114120j27105J58310l20511j99509l76892l39584L74984k14080L14331J55639
$$ 741114120 740987015 741145325 740824814 740625305 740248413 739908829 740283813 740069733 740384064 740539703
2131.3G40539703K19040r536L4561J9226p21207k47955o35987K54136O58798K70462
$$ 740539703 740758743 740749207 740783768 740802994 740081787 739833832 739197845 739451981 740110779 740381241
2140.9G40381241J90658L8147Q2245o45981j11770p630L07160N4245k94342P6446l30047
$$ 740381241 740571899 740610046 740692291 740046310 739934540 739926910 740234070 740288315 739993973 740070419 739740372
2151.5G39740372K87399j00250j6098L9215J38092M68063j83105j7166l37067R2697
$$ 739740372 740027771 739927521 739911423 739950638 740088730 740556793 740373688 740356522 740019455 740112152
2161.2G40112152r0027j04675R8419k2507L90549k25067M45862J40228l49502j92643
$$ 740112152 740022125 739917450 740015869 739993362 740383911 740158844 740604706 740744934 740395432 740202789
2170.8G40202789J01242L07465n85709J73111L00980N60913J62811l93829J17035l47138
$$ 740202789 740304031 740611496 740025787 740198898 740499878 741060791 741223602 740829773 740946808 740599670
2180.5G40599670M5090K1362K79236L8834R2773J75324j31607N46798m15344q2092
$$ 740599670 740644760 740666122 740945358 740984192 741076965 741252289 741120682 741667480 741252136 741170044
2190.1G41170044J97143P4845O2332m22134J93710N0507K36282k90070l74222R3155
$$ 741170044 741367187 741442032 741504364 741082230 741275940 741326447 741562729 741272659 740898437 740991592
2199.8G40991592K50321K59933j53045M37317q7662m9210k40021p6675O80847l7689
$$ 740991592 741241913 741501846 741348801 741786118 741698456 741649246 741409225 741332550 742013397 741975708
2209.4G41975708m2572k01111K36817l04337l85284L77578K31705L43857m12827k4948
$$ 741975708 741933136 741732025 741968842 741664505 741279221 741656799 741888504 742232361 741819534 741794586
2219G41794586l7460L8452K01187k51617r156p1563L09601k31705J41678J84555k94953
$$ 741794586 741757126 741795578 741996765 741745148 741735992 741664429 741974030 741742325 741884003 742068558 741773605
2229.7G41773605r0713k42233N04303J46713L39813k62451o06690M87748N2871j81274
$$ 741773605 741682892 741440659 741944962 742091675 742431488 742169037 741562347 742050095 742102966 741921692
2239.3G41921692m64554n2032m7379K15683K83432j98593K45895j40381K1286l31039
$$ 741921692 741457138 741405106 741357727 741573410 741856842 741658249 741904144 741763763 741785049 741454010
2248.9G41454010j38702O7062p6828K28348j83182J79520k84043J28861K60925l4485
$$ 741454010 741315308 741382370 741305542 741533890 741350708 741530228 741246185 741375046 741635971 741601486
2258.6G41601486L17459l31802j59760l21579j93405k63748L1662K37045N646K30255
$$ 741601486 741918945 741587143 741427383 741105804 740912399 740648651 740680313 740917358 740923004 741153259
2268.2G41153259l61557L03345j34430l42331r4604k37503K96478k91519K07901J31378
$$ 741153259 740791702 741095047 740960617 740618286 740523682 740286179 740582657 740291138 740499039 740630417
2277.9G40630417J74408M4632n19562p1259j41220J62659m66003m33655j49918J3809
$$ 740630417 740804825 740849457 740329895 740258636 740117416 740280075 739814072 739380417 739230499 739244308
2287.5G39244308J47171j5411M76990j74027J32065j71280l97567j50757n09186P2327
$$ 739244308 739391479 739376068 739853058 739679031 739811096 739639816 739242249 739091492 738582306 738654633
2297.2G38654633j65940j04370o80389j40610M42734j23444J36871p8277j94626j061172
$$ 738654633 738488693 738384323 737703934 737563324 738006058 737882614 738019485 737941208 737746582 736685410
2306.8G36685410J0147K07138p94907j92184J02539K78778j302719k59476M80499l43628
$$ 736685410 736695557 736902695 736107788 735915604 736018143 736296921 734994202 734734726 735215225 734871597
2316.4G34871597n15518o08520L16009q30841k92511n46722j53275K52457o90994O29272
$$ 734871597 734356079 733747559 734063568 733232727 732940216 732393494 732240219 732492676 731801682 732430954
2326.1G32430954l94669m58908j317444o30188m03976k38266J499634m22363K60009
$$ 732430954 732036285 731577377 730259933 729629745 729225769 728987503 730487137 730064774 730324783
2334.8G30324783j054077k14538N17273k51542L79944j694031M8829l28522j84784
$$ 730324783 729270706 729056168 729573441 729321899 729701843 728007812 728056641 727728119 727543335
2343.4G27543335m07867k30332J350327L97339J090621K48261n8060q02078r82819
$$ 727543335 727135468 726905136 728255463 728652802 729743423 729991684 729933624 729131546 728148727
2352.1G28148727m32205r63058o0501j841355m57229p06177p91626Q32214J429825
$$ 728148727 727716522 726753464 726692963 724851608 724394379 723688202 722896576 723728790 725158615
2360.8G25158615Q28858k805863J2131n17655k7160J572418p858m84467m64020J811371
$$ 725158615 725987473 723181610 723193741 722676086 722648926 724221344 724213486 723729019 723264999 725076370
2370.4G25076370N06745j37635L10669K86560M7226o60095k32010j6327P34024J70746
$$ 725076370 725583115 725445480 725756149 726042709 726089935 725429840 725197830 725181503 725915527 726086273
2380.1G26086273L31269N31463K21253N03158o72684o95190k83203j66626j11466l8223
$$ 726086273 726417542 726949005 727170258 727673416 727000732 726305542 726022339 725855713 725744247 725706024
2389.7G25706024k42615n71365M93393J71280l75519l63846J8616J19629q09174q50753
$$ 725706024 725463409 724892044 725385437 725556717 725181198 724817352 724835968 724955597 724146423 723295670
2399.4G23295670p08847R5291K39868l6087l33252l75443K81067j06354j06811q47931
$$ 723295670 722586823 722682114 722921982 722885895 722552643 722177200 722458267 722351913 722245102 721397171
2409G21397171j142426n16204k93351n0277m22440q3160J76315K33154l5095k42996
$$ 721397171 720254745 719738541 719445190 719394913 718972473 718889313 719065628 719298782 719263687 719020691
2418.7G19020691k69852m92325n82733j094513m73556j97296p8583L9596j75628J03378
$$ 719020691 718750839 718258514 717675781 716581268 716107712 715910416 715831833 715871429 715695801 715799179
2428.3G15799179o3934R613o67267o52771o63300p24792p3395p36084k85950L48282
$$ 715799179 715735245 715744858 715077591 714424820 713761520 713036728 712963333 712227249 711941299 712289581
2438G12289581K18582l35769n45654k57187k55280j13449q70514p41425n41763k41546
$$ 712289581 712508163 712172394 711626740 711369553 711114273 711000824 710130310 709388885 708847122 708605576
2447.6G08605576Q3160m23889k11868l68348k27508l85895o027K29339p49588p06710
$$ 708605576 708688736 708264847 708052979 707684631 707457123 707071228 707065201 707294540 706544952 705838242
2457.2G05838242n70527l37677k55584k01340m63104l85742r3308l15704m0436l83759
$$ 705838242 705267715 704930038 704674454 704473114 704010010 703624268 703530960 703215256 703174820 702791061
2466.9G02791061l92685r65652r39484N7907l05633m78745k77862K24075k74200o04401
$$ 702791061 702398376 701432724 700493240 700551147 700245514 699766769 699488907 699712982 699438782 698834381
2476.5F98834381m54788n74951l90549p54089n47257m95605j27411k78778o79398l03268
$$ 698834381 698379593 697804642 697414093 696660004 696112747 695617142 695489731 695210953 694531555 694228287
2486.2F94228287m00620P3395k74200n07203o67648j003723n02167j53503q8883o34765
$$ 694228287 693827667 693901062 693626862 693119659 692452011 691448288 690946121 690792618 690703735 690068970
2495.8F90068970l51181m19998n38483k98996m27551l27759o68945m13514p03277o00128
$$ 690068970 689717789 689297791 688759308 688460312 688032761 687705002 687036057 686622543 685919266 685319138
2505.5F85319138k92283l25927N5999o61010o48957l12118j95999m57077o16379l97263
$$ 685319138 685026855 684700928 684756927 684095917 683446960 683134842 682938843 682481766 681865387 681468124
2515.1F81468124o07833l21808l92075j93863l81164l81546k24839n27038j07575l73916
$$ 681468124 680860291 680538483 680146408 679952545 679571381 679189835 678964996 678437958 678330383 677956467
2524.7F77956467n42450r19495p44018m23966n11627j9837j53045j7472n11627n15670
$$ 677956467 677414017 676494522 675750504 675326538 674814911 674795074 674642029 674624557 674112930 673597260
2534.4F73597260l30430n02014j0147k97928m53109q42286n82885k05078k03782k63595
$$ 673597260 673266830 672764816 672754669 672456741 672003632 671161346 670578461 670373383 670169601 669906006
2544F69906006q91342l91465m6768l71933p79266k38953j28021q23746l33328k54898
$$ 669906006 669014664 668623199 668576431 668204498 667425232 667186279 667058258 666234512 665901184 665646286
2553.7F65646286l52707n13153m47388n04760l59497k61307q26035m28009m12369m1656
$$ 665646286 665293579 664780426 664333038 663828278 663468781 663207474 662381439 661953430 661541061 661499405
2563.3F61499405k81906n16739j61667q06961l32565k42463l85208l85971j64108k96249
$$ 661499405 661217499 660700760 660539093 659732132 659399567 659157104 658771896 658385925 658221817 657925568
2573F57925568q71582k45667m49524j88675k65274p52182l77807l12119j75858l12271
$$ 657925568 657053986 656808319 656358795 656170120 655904846 655152664 654774857 654462738 654286880 653974609
2582.6F53974609m0512m77447p55158o71844p73239j69983j06125j46713n54886n45731
$$ 653974609 653934097 653456650 652701492 652029648 651256409 651086426 650980301 650833588 650278702 649732971
2592.2F49732971l63083k55203k65655p10602m72565m73328m87747q38775k95945l5095
$$ 649732971 649369888 649114685 648849030 648138428 647665863 647192535 646704788 645866013 645570068 645534973
2601.9F45534973o25229j11313l91311l35465m40216p34558o84509n17731l45306q59986
$$ 645534973 644909744 644798431 644407120 644071655 643631439 642896881 642212372 641694641 641349335 640489349
2611.5F40489349l10058m92707o87904m37317m26788l01209r10377o61163n34325k59476
$$ 640489349 640179291 639686584 638998680 638561363 638134575 637833366 636922989 636261826 635727501 635468025
2621.2F35468025l29895o96907m90227n56373j76087l79486k55470m96712r39789o91452
$$ 635468025 635138130 634441223 633950996 633394623 633218536 632839050 632583580 632086868 631147079 630455627
2630.8F30455627n08079j98822p92961p24831n72319m91409l51906n68924k8381j30654
$$ 630455627 629947548 629748726 628955765 628230934 627658615 627167206 626815300 626246376 626217995 626087341
2640.5F26087341m17671o39572p81632q46290o83518m51774l38783p1717o91833n42069
$$ 626087341 625669670 625030098 624248466 623402176 622718658 622266884 621928101 621856384 621164551 620622482
2650.1F20622482m78019n89905l81279o52313j27106k59323p58553p07626l34435l94668
$$ 620622482 620144463 619554558 619173279 618520966 618393860 618134537 617375984 616668358 616333923 615939255
2659.8F15939255m82216j65100m60091m04549k95448j85737o99349n98144j5908m72183
$$ 615939255 615457039 615291939 614831848 614427299 614131851 613946114 613246765 612648621 612632713 612160530
2669.4F12160530l20473o08711p21626m98772N036J38549l34777j11733o09283l77999
$$ 612160530 611840057 611231346 610509720 610010948 610015984 610154533 609819756 609708023 609098740 608720741
2679F08720741m56581q42247n35621l92800o2179m79546k8038J85013m79889p69043
$$ 608720741 608264160 607421913 606886292 606493492 606431313 605951767 605923729 606108742 605628853 604859810
2688.7F04859810m80576j93596p20901n00946m98467l53965k68937j15737O980p17659
$$ 604859810 604379234 604185638 603464737 602963791 602465324 602111359 601842422 601726685 601733665 601016006
2698.3F01016006k43606l96347n44129k39944k18468n4588l12119k44407o23551k86827
$$ 601016006 600772400 600376053 599831924 599591980 599373512 599318924 599006805 598762398 598138847 597852020
2708E97852020p5989o71157o05011n43022n32876m44984k72980l18603J58119j98936
$$ 597852020 597776031 597104874 596499863 595956841 595423965 594978981 594706001 594387398 594545517 594346581
2717.6E94346581o00281m3373j15776J6822o14547n58663K0027l48854o54106n51338
$$ 594346581 593746300 593702927 593587151 593603973 592989426 592430763 592450790 592101936 591447830 590896492
2727.3E90896492K6207l80478l90739j88256k66647k8648r2202k18925n25894j80016
$$ 590896492 590922699 590542221 590151482 589963226 589696579 589667931 589575729 589356804 588830910 588650894
2736.9E88650894k63634n20057k17705L27263J61781p68699n21126m06266K03438L38440
$$ 588650894 588387260 587867203 587649498 587976761 588138542 587369843 586848717 586442451 586645889 586984329
2746.5E86984329l22113n11513q60862j35651m4899m17099l72696j05285j67008l29018
$$ 586984329 586662216 586150703 585289841 585154190 585109291 584692192 584319496 584214211 584047203 583718185
2756.2E83718185K30828k83509k52151l38974p64389m47731l60870q0529l00789m15001
$$ 583718185 583949013 583665504 583413353 583074379 582309990 581862259 581501389 581420860 581120071 580705070
2765.8E80705070k93960O4316l13950p08542k34947j94778J03378l33214l01056k67906
$$ 580705070 580411110 580475426 580161476 579452934 579217987 579023209 579126587 578793373 578492317 578224411
2775.5E78224411p79839p94334p12624k09045n70526k06261k60582o28509j41716p23191
$$ 578224411 577444572 576650238 575937614 575728569 575158043 574951782 574691200 574062691 573920975 573197784
2785.1E73197784n03082k38228j90735k06031n95169q67081r08051m12559m64058k89230
$$ 573197784 572694702 572456474 572265739 572059708 571464539 570597458 569689407 569276848 568812790 568523560
2794.8E68523560n18532n92995j24779n07774r14955q48770n92499r63326p86895o21376
$$ 568523560 568005028 567412033 567287254 566779480 565864525 565015755 564423256 563459930 562673035 562051659
2804.4E62051659o02379k32086m43116n80864q38775p13883j017875r10111m01954
$$ 562051659 561449280 561217194 560774078 560193214 559354439 558640556 557622681 556712570 556310616
2813.1E56310616r28689j018791q08334l76206q16612j081505o33277o73829o57730
$$ 556310616 555381927 554363136 553554802 553178596 552361984 551280479 550647202 549973373 549315643
2821.8E49315643q47664p32002j000671j131706j069260p84683n20935j071549p89032
$$ 549315643 548467979 547735977 546735306 545603600 544534340 543749657 543228722 542157173 541368141
2830.4E41368141p14454p61796q81271r76486j123581j504746j059608j401939j069413
$$ 541368141 540653687 539891891 539010620 538034134 536910553 535405807 534346199 532944260 531874847
2839.1E31874847q14552j601524j876526j952133j598130j909790j895027j685257
$$ 531874847 531060295 529458771 527582245 525630112 524031982 522122192 520227165 518541908
2846.8E18541908k115593k302246j771621j115876j698150k006722j339035l82271
$$ 518541908 516426315 514124069 512352448 511236572 509538422 507531700 506192665 505810394
2854.6E05810394n22499o92062j98937m9438M90913j78108q86116q34579l60108m7150
$$ 505810394 505287895 504595833 504396896 504347458 504838371 504660263 503774147 502939568 502579460 502532310
2864.2E02532310p55043o73484r72634j233444j015129q99735n75332n95017n65414
$$ 502532310 501777267 501103783 500131149 498897705 497882576 496982841 496407509 495812492 495247078
2872.9D95247078q53272j040267q93708o06651r12209j096916o86264p34596m92973
$$ 495247078 494393806 493353539 492459831 491853180 490940971 489844055 489157791 488423195 487930222
2881.6D87930222o83938q06274r24797r90334p63168j127396q62388r39331r86824
$$ 487930222 487246284 486440010 485515213 484524879 483761711 482634315 481771927 480832596 479845772
2890.2D79845772q32901j125565r94682q92029r02405q12111o10122q99315o60248
$$ 479845772 479012871 477887306 476892624 476000595 475098190 474286079 473675957 472776642 472116394
2898.9D72116394o03981q58498n45768r90563p02133n91698j114769j247406r88159
$$ 472116394 471512413 470653915 470108147 469117584 468415451 467823753 466708984 465461578 464473419
2907.6D64473419o21948j063690r13239r80644r84077j178780j709976q63686r47723
$$ 464473419 463851471 462787781 461874542 460893898 459909821 458731041 457021065 456157379 455209656
2916.3D55209656j551819j607704j361656j048851j477051j502953r21020n60074l53012
$$ 455209656 453657837 452050133 450688477 449639626 448162575 446659622 445738602 445178528 444825516
2925D44825516l12767p95899k89230O88858M31061m55780n77927L37792L09944K57568
$$ 444825516 444512749 443716850 443427620 444116478 444547539 444091759 443513832 443851624 444161568 444419136
2934.6D44419136M82521L43666L96919L60794O68526P83539Q41446O83021P43599R64966
$$ 444419136 444901657 445245323 445642242 446003036 446671562 447455101 448296547 448979568 449723167 450688133
2944.2D50688133O96564R09653R10797P74154L81966M32968P76024M34151O64062P21665
$$ 450688133 451384697 452294350 453205147 453979301 454361267 454794235 455570259 456004410 456668472 457390137
2953.9D57390137L93944K24380O82755P49244K80419N72967L85285N30967R19838N25475
$$ 457390137 457784081 458008461 458691216 459440460 459720879 460293846 460679131 461210098 462129936 462655411
2963.5D62655411O14776R94721R02901P17048J89514J39847J055565J078796R05762
$$ 462655411 463270187 464264908 465167809 465884857 466074371 466214218 467269783 468348579 469254341
2972.2D69254341P95670P38601Q14057M84428N46341N87425R21784N85289K49367L25393
$$ 469254341 470050011 470788612 471602669 472087097 472633438 473220863 474142647 474727936 474977303 475302696
2981.8D75302696j48773L08342L68652L85247M55207O2294l1204k365K81410M6234
$$ 475302696 475153923 475462265 475830917 476216164 476671371 476733665 476702461 476700096 476981506 477027740
2991.5D77027740O2447m64287o94389J32446J69792K25449l57590o35071j84898n99136
$$ 477027740 477090187 476625900 475931511 476063957 476233749 476459198 476101608 475466537 475281639 474682503
3001.1D74682503p87392l16086n37643p81479m92706p11403k88620k89574p04689o00777
$$ 474682503 473895111 473579025 473041382 472259903 471767197 471055794 470767174 470477600 469772911 469172134
3010.8D69172134p80372o29235o07299m38156p56150m51660l1509j093788q87452o03561
$$ 469172134 468391762 467762527 467155228 466717072 465960922 465509262 465477753 464383965 463496513 462892952
3020.4D62892952j016884j103859p66945n57899q24089q36258q63419m91447o40450
$$ 462892952 461876068 460772209 460005264 459447365 458623276 457787018 456923599 456432152 455791702
3029.1D55791702p04612n98565j146278j044731o61583n42946j139488r73778o55022
$$ 455791702 455087090 454488525 453342247 452297516 451635933 451092987 449953499 448979721 448324699
3037.8D48324699j061287p31925p63550j019516r72023r43985r80606q53844r96742
$$ 448324699 447263412 446531487 445767937 444748421 443776398 442832413 441851807 440997963 440001221
3046.5D40001221j138535p54738o80809m37126o49528q81310r72252j436424j175575
$$ 440001221 438862686 438107948 437427139 436990013 436340485 435459175 434486923 433050499 431874924
3055.1D31874924q17070m99649l42408q05053j415825r36547n32417p96585o19812
$$ 431874924 431057854 430558205 430215797 429410744 427994919 427058372 426525955 425729370 425109558
3063.8D25109558j180954j268082o96563l59612n77240r94568p83004q01583l83529
$$ 425109558 423928604 422660522 421963959 421604347 421027107 420032539 419249535 418447952 418064423
3072.5D18064423m31443q94928j241722j121483k14805l38440o81458j125297q69293
$$ 418064423 417632980 416738052 415496330 414374847 414160042 413821602 413140144 412014847 411145554
3081.2D11145554o17981q41179n39284j037216q15239p90138q45642m13552o67686
$$ 411145554 410527573 409686394 409147110 408109894 407294655 406504517 405658875 405245323 404577637
3089.9D04577637n78919q45260r53598q25768o44531p60651j000747o23208o35871
$$ 404577637 403998718 403153458 402199860 401374092 400729561 399968910 398968163 398344955 397709084
3098.5C97709084o22292p92198p78923j021233j107292m24805m84962m91257o44073
$$ 397709084 397086792 396294594 395515671 394494438 393387146 392962341 392477379 391986122 391342049
3107.2C91342049r03283q18214o25648q56095j428642j066513n66063m95567p12738
$$ 391342049 390438766 389620552 388994904 388138809 386710167 385643654 385077591 384582024 383869286
3115.9C83869286m45252k85988r76639j284141j108666j015930j169586q04138o44493
$$ 383869286 383424034 383138046 382161407 380877266 379768600 378752670 377583084 376778946 376134453
3124.6C76134453o99310n60570n38826l58086j048050j437683q36639l91350p82318
$$ 376134453 375435143 374874573 374335747 373977661 372929611 371491928 370655289 370263939 369481621
3133.3C69481621j167565p47337q60367r09500o92253n77087p83310q23403n67512
$$ 369481621 368314056 367566719 366706352 365796852 365104599 364527512 363744202 362920799 362353287
3141.9C62353287r05037j049729j404609j000405k91557q60367r77134o77643r35250
$$ 362353287 361448250 360398521 358993912 357993507 357701950 356841583 355864449 355186806 354251556
3150.6C54251556q55941l14598r14917j160775q03337j076927r47266r19914r64928
$$ 354251556 353395615 353081017 352166100 351005325 350201988 349125061 348177795 347257881 346292953
3159.3C46292953q81423k49253k07138r35249r98726j122856q80432q21724r67407
$$ 346292953 345411530 345162277 344955139 344019890 343021164 341898308 341017876 340196152 339228745
3168C39228745j256104r86748l52134q08640p18346q48770r53102p19681o38427o81992
$$ 339228745 337972641 336985893 336633759 335825119 335106773 334258003 333304901 332585220 331946793 331264801
3177.6C31264801j118813q37173j073952q18176m10423n19371n86853j272850o05088
$$ 331264801 330145988 329308815 328234863 327416687 327006264 326486893 325900040 324627190 324022102
3186.3C24022102l47328r84840j022606r41353r80797r99203n45215p49474o84890
$$ 324022102 323674774 322689934 321667328 320725975 319745178 318745975 318200760 317451286 316766396
3195C16766396n45006p63836o12946n50537n69172p81383m33407n53436r10950j238976
$$ 316766396 316221390 315457554 314844608 314294071 313724899 312943516 312510109 311956673 311045723 309806747
3204.6C09806747j379890n10406l75939k33002l56788n52674m56523j008053j010228
$$ 309806747 308426857 307916451 307540512 307307510 306950722 306398048 305941525 304933472 303923244
3213.3C03923244q38832p52468q17032n13707k98881n21813n00259p57961o64196p13120
$$ 303923244 303084412 302331944 301514912 301001205 300702324 300180511 299680252 298922291 298258095 297544975
3222.9B97544975o07319m21810p32631r63078p65362k25353n85499m89750k90851n96791
$$ 297544975 296937656 296515846 295783215 294820137 294054775 293829422 293243923 292754173 292463322 291866531
3232.6B91866531l12423k21081l03841q91533j019191o96202p92713p15732p08714
$$ 291866531 291554108 291333027 291029186 290137653 289118462 288422260 287629547 286913815 286205101
3241.3B86205101o46191m17976k71626p47756n60418J564m32491o04763n40390l97987
$$ 286205101 285558910 285140934 284869308 284121552 283561134 283562698 283130207 282525444 281985054 281587067
3250.9B81587067n62973p18251m23908l40004k53029o42223o09169l0537m78763j016274
$$ 281587067 281024094 280305843 279881935 279541931 279288902 278646679 278037510 278006973 277528210 276511936
3260.5B76511936p46670l00941j75705m17976m82808k92186l98274n43174l63331j71318
$$ 276511936 275765266 275464325 275288620 274870644 274387836 274095650 273697376 273154202 272790871 272619553
3270.2B72619553o63319q76331k57950l18699n48554l18450k67945m40292j83067P0323
$$ 272619553 271956234 271079903 270821953 270503254 269954700 269636250 269368305 268928013 268744946 268815269
3279.8B68815269m43019o79150o99444m76723j70860l88298n58452o37379j96228K22568
$$ 268815269 268372250 267693100 266993656 266516933 266346073 265957775 265399323 264761944 264565716 264788284
3289.5B64788284j39599n34725n53245k52762J86806J14212n09262p15619n14335l80116
$$ 264788284 264648685 264113960 263560715 263307953 263494759 263608971 263099709 262384090 261869755 261489639
3299.1B61489639o84452o07319j39331j77498k06871n82028m04148Q0814l28598m88929
$$ 261489639 260805187 260197868 260058537 259881039 259674168 259092140 258687992 258768806 258440208 257951279
3308.8B57951279m99478n96656l25470q4286n09148o35395n40924n53894n7392j85719
$$ 257951279 257451801 256855145 256529675 256445389 255936241 255300846 254759922 254206028 254148636 253962917
3318.4B53962917l85189n22709o63585m59576n01594k46335k90794n95245o19526m64783
$$ 253962917 253577728 253055019 252391434 251931858 251430264 251183929 250893135 250297890 249678364 249213581
3328.1B49213581n36995o48918l96843n42774p70168j093388q30383k80857j90411
$$ 249213581 248676586 248027668 247630825 247088051 246317883 245224495 244394112 244113255 243922844
3336.7B43922844k32334n73044m09985r20086q50486J37481k31075o37054o65341l27110
$$ 243922844 243690510 243117466 242707481 241787395 240936909 241074390 240843315 240206261 239540920 239213810
3346.4B39213810l64227o15425m91047l85437j9493m11377p26471l03040K45323j12571
$$ 239213810 238849583 238234158 237743111 237357674 237338181 236926804 236200333 235897293 236142616 236030045
3356B36030045o32420J26762J80874k23980m95987o37817o45485l19786N46322j71547
$$ 236030045 235397625 235524387 235705261 235481281 234985294 234347477 233701992 233382206 233928528 233756981
3365.7B33756981r27715l32108J77498j08585q43659m35791K80476J54228k77901j36471
$$ 233756981 232829266 232497158 232674656 232566071 231722412 231286621 231567097 231721325 231443424 231306953
3375.3B31306953j63021o21376j24759J11789l08952l56026k05917k02637J5869L32051
$$ 231306953 231143932 230522556 230397797 230509586 230200634 229844608 229638691 229436054 229451923 229783974
3384.9B29783974M8313M4098o3820k54593O7463r1477q8977j47267k80647K37789k63863
$$ 229783974 229832287 229876385 229812565 229557972 229625435 229533958 229444981 229297714 229017067 229254856 228990993
3395.6B28990993q14285L2196M00448j28651j88293K37732K46029k17667o21376j91250
$$ 228990993 228176708 228208904 228609352 228480701 228292408 228530140 228776169 228558502 227937126 227745876
3405.2B27745876N13039J44539P4825M00066m3125o9103M00772K31400l13454Q0338
$$ 227745876 228258915 228403454 228478279 228878345 228835220 228766117 229166889 229398289 229084835 229165173
3414.8B29165173N94596K34948m0245J56059M77695J90258j70078p877L64093N10541
$$ 229165173 229759769 229994717 229954472 230110531 230588226 230778484 230608406 230600529 230964622 231475163
3424.5B31475163J29394L3283L30105N90115K03190l5916K90528L55510N46379N56469
$$ 231475163 231604557 231637840 231967945 232558060 232761250 232725334 233015862 233371372 233917751 234474220
3434.1B34474220N32761J09081l16639K61784P79037O11420L9005L44067N93700L87230
$$ 234474220 235006981 235116062 234799423 235061207 235840244 236451664 236490669 236834736 237428436 237815666
3443.8B37815666N80826N50041P87792M57917L89061O70852L10116M10805O14853Q51688
$$ 237815666 238396492 238946533 239734325 240192242 240581303 241252155 241562271 241973076 242587929 243439617
3453.4B43439617N84698K43091P96566J232853Q60253L72066M23775Q8634J24760R41334
$$ 243439617 244024315 244267406 245063972 246296825 247157078 247529144 247952919 248041553 248166313 249107647
3463.1B49107647J147060O99959O28777P28626L69606Q23822Q17986O45484J222954
$$ 249107647 250254707 250954666 251583443 252312069 252681675 253505497 254323483 254968967 256191921
3471.7B56191921N93968L77750Q72784Q45432Q70953P28931P89051J086121J102218
$$ 256191921 256785889 257163639 258036423 258881855 259752808 260481739 261270790 262356911 263459129
3480.4B63459129J151123N00222J05934J103534O63319M97513J394329O78005O95152
$$ 263459129 264610252 265110474 265216408 266319942 266983261 267480774 268875103 269553108 270248260
3489.1B70248260J166478R87434Q26264O16683J144639J314773Q24127M91066N76172
$$ 270248260 271414738 272402172 273228436 273845119 274989758 276304531 277128658 277619724 278195896
3497.8B78195896J177311J443825J048431Q61149J004200J124573R06982P41902J042118
$$ 278195896 279373207 280817032 281865463 282726612 283730812 284855385 285762367 286504269 287546387
3506.5B87546387R78870J294079Q79707L90435J506404J136532J034432R46998P27444
$$ 287546387 288525257 289819336 290699043 291089478 292595882 293732414 294766846 295713844 296441288
3515.1B96441288J695080J446037J157837J194954Q31165N29824J085529J489487P56645
$$ 296441288 298136368 299582405 300740242 301935196 302766361 303296185 304381714 305871201 306627846
3523.8C06627846J483898J687870J208401J345710R55697O08959J519356J921882J136646
$$ 306627846 308111744 309799614 311008015 312353725 313309422 313918381 315437737 317359619 318496265
3532.5C18496265J119290Q30574J118736J124725J148072K341003J571007R59206J288147
$$ 318496265 319615555 320446129 321564865 322689590 323837662 326178665 327749672 328708878 329997025
3541.2C29997025J718254J647453J291389J075440J158829K158889J199570J914902
$$ 329997025 331715279 333362732 334654121 335729561 336888390 339047279 340246849 342161751
3548.9C42161751K010765J063232J464882R77326K425460K149315J712990J976853
$$ 342161751 344172516 345235748 346700630 347677956 350103416 352252731 353965721 355942574
3556.6C55942574J479721K014427J554870J732293J422271J677628J452255J997414
$$ 355942574 357422295 359436722 360991592 362723885 364146156 365823784 367276039 369273453
3564.3C69273453L519287Q20656J877632N35431L63273L588410K083053K062645K276879
$$ 369273453 372792740 373613396 375491028 376026459 376389732 379978142 382061195 384123840 386400719
3573C86400719J882362J250420K082138K923012J600456K386017K397537K227897K046242
$$ 386400719 388283081 389533501 391615639 394538651 396139107 398525124 400922661 403150558 405196800
3581.7D05196800K017708J771851J649856L815155J446839M96902K690544J118126
$$ 405196800 407214508 408986359 410636215 414451370 415898209 416395111 419085655 420203781
3589.4D20203781L300743L157387K599297J704711K149239L494186N18952K582664
$$ 420203781 423504524 426661911 429261208 430965919 433115158 436609344 437128296 439710960
3597.1D39710960L609314K000351L658181J975173J304055K849731K295304K590637
$$ 439710960 443320274 445320625 448978806 450953979 452258034 455107765 457403069 459993706
3604.8D59993706L166313K551002R28650L519059J349487J010437O635017K390938
$$ 459993706 463160019 465711021 466639671 470158730 471508217 472518654 479153671 481544609
3612.5D81544609l62472L958663J113205M332238M430046J754532L340873O12297J008721
$$ 481544609 481182137 485140800 486254005 490586243 495016289 496770821 500111694 500723991 501732712
3621.2E01732712L272972L763161L383026L265075K776528K846603N508385L53660
$$ 501732712 505005684 508768845 512151871 515416946 518193474 521040077 526548462 526902122
3628.9E26902122m760780N343170N511360N163842K138786N03082L833962L953132
$$ 526902122 522141342 527484512 532995872 538159714 540298500 540801582 544635544 548588676
3636.6E48588676K793618J898651K691612L023529K376213K232285K340126L109245
$$ 548588676 551382294 553280945 555972557 558996086 561372299 563604584 565944710 569053955
3644.4E69053955M096871N541915P22123j373673N547943J847763j298485J059456
$$ 569053955 573150826 578692741 579414864 578041191 583589134 585436897 584138412 585197868
3652.1E85197868N519791M491882L679734M046325m614563L522072N527496J867562
$$ 585197868 590717659 595209541 598889275 602935600 598321037 601843109 607370605 609238167
3659.8F09238167K410278J822853L108139J323777J527252K245331O36711M010925
$$ 609238167 611648445 613471298 616579437 617903214 619430466 621675797 622312508 626323433
3667.5F26323433K378006K0637Q22907m187737L720322P539787P374115r00497j4210320
$$ 626323433 628701439 628722076 629544983 625357246 629077568 636617355 643991470 643090973 628880653
3676.2F28880653L622628P856598M019775j777802J418076L000259J964112J989135
$$ 628880653 632503281 640359879 644379654 642601852 644019928 647020187 648984299 650973434
3683.9F50973434O57120J10245L460541N155792p873154j663513O799622m365769J422501
$$ 650973434 651630554 651740799 655201340 660357132 652483978 650820465 657620087 653254318 654676819
3692.6F54676819N342712J280442J400756J86386N31998J409607K80533K274628K236862
$$ 654676819 660019531 661299973 662700729 662887115 663419113 664828720 665109253 667383881 669620743
3701.3F69620743l576355j018448L873138J621781O72531P70569K086105K920456n913086
$$ 669620743 666044388 665025940 668899078 670520859 671193390 671963959 674050064 676970520 671057434
3709.9F71057434K860794K575913j0695115M771805M555359J054917Q08868J566925
$$ 671057434 673918228 676494141 665799026 670570831 675126190 676181107 676989975 678556900
3717.7F78556900Q34808k233276J814575L878327l391190k030945M762345K65197j887817
$$ 678556900 679391708 677158432 678973007 682851334 679460144 677429199 682191544 682456741 680568924
3726.3F80568924j214523J152420L405456P97043M169693j616821p029572N635758
$$ 680568924 679354401 680506821 683912277 684709320 688879013 687262192 680232620 685868378
3734F85868378r76563n367737K642136R32770j16654K794419L040390k787018L199844
$$ 685868378 684891815 679524078 682166214 683098984 682982330 685776749 688817139 686030121 689229965
3742.7F89229965R656983j0001679j1734466Q128891M482040L988876n893173p823944
$$ 689229965 698886948 688885269 677150803 685279694 689761734 693750610 687857437 680033493
3750.4F80033493R498901m054946m318543N828705M686203L005295l680420J754379
$$ 680033493 689532394 685477448 681158905 686987610 691673813 694679108 690998688 692753067
3758.2F92753067L609924o210785p03735L960419J265793J67999K801971k419281l730697
$$ 692753067 696362991 690152206 689448471 693408890 694674683 694842682 697644653 695225372 691494675
3766.8F91494675K404785L226547o02646o823959K524109L286361N89295Q07876J49231
$$ 691494675 693899460 697126007 696523361 689699402 692223511 695509872 696099167 696907043 697056274
3775.5F97056274J230545J57395J469345j862183o071472L484116K702636J056901
$$ 697056274 698286819 698444214 699913559 698051376 691979904 695464020 698166656 699223557
3783.2F99223557P09381l019333m80347J685333J069260J92413k23846J26724k31934
$$ 699223557 699932938 696913605 696433258 698118591 699187851 699380264 699156418 699283142 699051208
3791.9F99051208m5471J72654J776733J986694l822098k271652K542114L555985L585434
$$ 699051208 699005737 699178391 700955124 702941818 699119720 696848068 699390182 702946167 706531601
3800.6G06531601p667313p190933M371338L194656L693238K852478q482895k534638
$$ 706531601 698864288 691673355 696044693 699239349 702932587 705785065 697302170 694767532
3808.3F94767532M785996K053909K77176P33871L01438N93719K875519k767715r982224
$$ 694767532 699553528 701607437 701884613 702618484 702919922 703513641 706389160 703621445 693639221
3817F93639221N173416N579605K768555j532211j4236832L277970N756301K398224
$$ 693639221 698812637 704392242 707160797 705628586 691391754 694669724 700426025 702824249
3824.7G02824249J582718q12607k312393O23932J529007K386551J21231o687698K931518
$$ 702824249 704406967 703594360 701281967 701905899 703434906 705821457 705942688 699254990 702186508
3833.4G02186508N064392n800705O62690N967178p403107k422790N394668l524856
$$ 702186508 707250900 701450195 702112885 708080063 700676956 698254166 703648834 700123978
3841.1G00123978N84106N366516k348099k774887K823334P82166m51966J326218p67517
$$ 700123978 700708084 706074600 703726501 700951614 703774948 704557114 704105148 705431366 704663849
3849.8G04663849J715698L881683n254821R23080j2734527J642150Q346100q68606
$$ 704663849 706379547 710261230 705006409 705929489 693194962 694837112 703183212 702314606
3857.5G02314606n26963K105561K035293J535187m060059M35105L163223m875183k228851
$$ 702314606 701787643 703893204 705928497 707463684 703403625 703838730 707001953 702126770 699897919
3866.2F99897919L613815L413391L033219o561814n920563M570084M966354J195221
$$ 699897919 703511734 706925125 709958344 703396530 697475967 702046051 707012405 708207626
3873.9G08207626p993621J084823L844528n3253J479416K609100m831161m247742L876267
$$ 708207626 700214005 701298828 705143356 705090103 706569519 709178619 704347458 700099716 703975983
3882.6G03975983K23541K274704M281387j0198364O75278L192062J632233L831787
$$ 703975983 704199524 706474228 710755615 700557251 701232529 704424591 706056824 709888611
3890.3G09888611k372818p761688J304397L391419k57721J392593N60227P72857P44400
$$ 709888611 707515793 699754105 701058502 704449921 704192200 705584793 706145020 706917877 707662277
3898.9G07662277o182022M420548O2255n190124L166504k139588m22439Q74329J185073
$$ 707662277 701480255 705900803 705963058 700772934 703939438 701799850 701377411 702251740 703436813
3907.6G03436813J386567j50147J57776O1111K37122p78961L44009J698456J116638
$$ 703436813 704823380 704673233 704831009 704892120 705129242 704350281 704694290 706392746 707509384
3916.3G07509384l146515k924576L213807n53437k072906K463150J372909j05285k537461
$$ 707509384 704362869 701438293 704652100 704098663 702025757 704488907 705861816 705756531 703219070
3925G03219070q96606K129822R15909L23486q95386p93686J030884j450119j535873
$$ 703219070 702322464 704452286 705368195 705691681 704796295 704002609 705033493 703583374 702047501
3933.7G02047501J117019J196442Q40530P63l85284k04773k80457J113816N14679l309174
$$ 702047501 703164520 704360962 705201492 705202255 704816971 704612198 704331741 705445557 705960236 702651062
3943.3G02651062q30688J704940J495209Q26111k016754n1041N8060j737747J124038
$$ 702651062 701820374 703525314 705020523 705846634 703829880 703778839 703836899 702099152 703223190
3952G03223190K28195L66059O06537k59857K34527m68750K52533L3035L36228m16870
$$ 703223190 703451385 703817444 704423981 704164124 704398651 703929901 704182434 704215469 704551697 704134827
3961.6G04134827j198578N85251J56326O65970p706j102600m95071n17960L98483R86100
$$ 704134827 702936249 703521500 703677826 704343796 704336090 703233490 702738419 702220459 702618942 703605042
3971.3G03605042J42364p31735M2801M50592J57852J5564J12152M97284Q5220l93524
$$ 703605042 703747406 703015671 703058472 703509064 703666916 703682480 703794632 704291916 704377136 703983612
3980.9G03983612o23245K51312M01001j40076m31060k56348R70535M38385k24991r58023
$$ 703983612 703360367 703611679 704012680 703872604 703441544 703185196 704155731 704594116 704369125 703411102
3990.6G03411102j058044j26038L39356Q44726K70615N72510n50003r32618R01566
$$ 703411102 702353058 702227020 702566376 703411102 703681717 704254227 703704224 702771606 703673172
3999.2G03673172J01318
$$ 703673172 703774490
4000.2G03774490
$$ 703774490
##END=$$ End of the data block
