##TITLE=$$ Begin of the data block
##JCAMP-DX=5.00 $$ ACD/SpecManager v 10.08
##SPECTROMETER/DATA SYSTEM=Varian
##DATE=15 Jan 2013 10:11:48
##DATA TYPE=INFRARED SPECTRUM
##DATA CLASS=XYDATA
##ORIGIN=
##OWNER=
##NPOINTS=3735
##FIRSTX=399.26403809
##LASTX=4000.35498047
##MAXX=4000.35498047
##MINX=399.26403809
##MAXY=67.75567627
##MINY=14.03853798
##XFACTOR=1.0000000000
##YFACTOR=0.000000100000000
##FIRSTY=32.17693329
##DELTAX=0.96440572
##XUNITS=1/CM
##YUNITS=TRANSMITTANCE
##XYDATA=(X++(Y..Y))
399.3C21769333m588280O0215K140942p165795j471443L993588o3229m243164m808407
407.9C05623760j227226L357429J66150R02862J593743Q32328O488362Q47206l675633
416.6C14908981j811371M273873m69551q545895N107441j407871l734875M072800k363014
425.3C10030518p91188N05772l308315j495190M843578L221417l515911j957035J629123
434C09162769P80316j749153N88417L01113R40819l262l115273m13799J16463j305237
443.6C05303173j450767K017917L238659K77615k501850m223729n50766p0743Q80737
452.3C02920246J176052p64198P47070o24580M01573L979855l96233k248535j813965
461C03377285m890175k691746J701107K14863M008389L747749M036522J106129n953656
$$ plain form
399.3 321769333 317181053 317241268 319382210 312216415 310744972 314738560 314675331 310432167 305623760
407.9 305623760 304396534 307753963 307920113 308822975 310416718 311249046 317737408 318584614 314908981
416.6 314908981 313097610 317371483 316901932 308356037 313463478 312055607 308320732 312393532 310030518
425.3 310030518 309239330 309745102 306436787 304941597 309785175 313006592 309490681 307533646 309162769
434 309162769 309943085 308193932 308782349 309083462 310024281 310021019 306905746 306491947 306608410 305303173
443.6 305303173 303852406 305870323 309108982 309386597 306884747 302661018 302110252 302039509 302920246
452.3 302920246 304096298 303332100 304079170 303454590 303856163 307836018 307439785 305191250 303377285
461 303377285 298487110 295795364 297496471 297711334 301719723 305467472 309503994 310610123 304656467
469.7C04656467k600021J8616J867103l390941l627053Q011l81660K95048J24321j291218
479.3B95678673k512589J79577r70077j625748j128655k248096L387699L75939l368493
488B87768230K04754K867585K498168k330074l997707j391411L078442L000335m03099
496.7B91295223n67531j544762P534K486210l26748j789742k17227k972508o20346
505.3B85750103O09589k956925K4052J156387K603111J144391j926880j647683j696529
514B83059616j278j039162j120777k83374j610680j80645L17402j11218J63479m00886
523.7B78792477o1837N67303k165832j886197r75914p62271J000022N10426J581173
532.4B76599350J876469K99091K55146r67369k855644j918335L25927K175J097946
$$ plain form
469.7 304656467 302056446 302075062 303942165 300551224 296924171 296932182 296550522 296845570 296969891 295678673
479.3 295678673 293166084 293345661 292375584 290749836 289621181 287373085 290760784 291136723 287768230
488 287768230 287972984 290840569 293338737 291008663 287010956 285619545 288697987 291698322 291295223
496.7 291295223 290727692 289182930 289190464 291676674 291349926 289560184 289342957 286370449 285750103
505.3 285750103 286359692 283402767 283426819 284583206 287186317 288330708 286403828 284756145 283059616
514 283059616 283058338 282019176 280898399 280615025 279004345 278823700 279141102 279029884 279193363 278792477
523.7 278792477 278730640 279297943 277132111 275245914 274270000 273507729 274507751 275018177 276599350
532.4 276599350 278475819 278774910 279030056 278062687 275207043 273288708 273614635 273616810 274714756
541B74714756J039619j206684j243724K35977J448536j878453k270050J67237q69580
549.7B70137634j408691j006813q72326J34506J953507K26745j457844k053623k243271
558.4B63409824k7485k73399m24003J32598Q46386P24087Q80318K227936k51828j437950
568B65806484k20203l71342M3335m55284j792660o75564P28226r8534N91355J071377
577.7B64627190Q65364o44284k158813n94826L33100J46102o85119J6861Q04386J144600
587.3B63854561Q30307m39873M76952N2280m51584K3327J052551K87323j752338M67224
597B64400730Q53119P74479M95701r11236j34888j4686L42655k07653j415711k497329
606.6B61685181j204357J1463r74217P05071N09376n29747j135387j167622N02739
$$ plain form
541 274714756 275754375 274547691 273303967 273539944 274988480 273110027 270839977 271007214 270137634
549.7 270137634 268728943 267722130 266849804 266984310 268937817 269164562 267706718 265653095 263409824
558.4 263409824 263382339 263108940 262684937 262817535 263663921 264388008 265268326 267496262 267244434 265806484
568 265806484 265586281 265214939 265258274 264802990 263010330 262334766 263062992 262964458 263555813 264627190
577.7 264627190 265492554 264848270 262689457 262094631 262427731 262573833 261888714 261905575 262709961 263854561
587.3 263854561 264684868 264244995 264721947 264774227 264322643 264345970 265398521 265685844 263933506 264400730
597 264400730 265253849 266028328 266524029 265612793 265477905 265463219 265805874 265598221 264182510 261685181
606.6 261685181 260480824 260492287 259518070 260223141 260732517 260202770 259067383 257899761 258402500
615.3B58402500j63650j374073m12388Q75396o15139R9659K410031J715889Q19435
624B61757660M15840P78561L89652L06339R59835J529732J533451M85802J194534K031040
633.6B71382446K073765J247959R44500J904068J117268M71687N17502P55558O80370
642.3B81095123N93472J233845J702785J813068K81353N06497J460304L54500L46203
651B89387150K06756M76056O59332J14899J33228P43179R61895k30942n37738q83599
660.6B91030216l97033K39639q44059j319351r13163J032601J564445K1839J090012
669.3B91505146O24466M51679j0643L47099O95706L6430K25888J307735J854954P37610
678.9B97776070J936607L410454J751671J186447P20463l66955M24003Q66070m35486
$$ plain form
615.3 258402500 258238850 256864777 256452389 257327785 256712646 256812305 259222336 260938225 261757660
624 261757660 262173500 262952061 263341713 263648052 264607887 266137619 267671070 268156872 269351406 271382446
633.6 271382446 273456211 274704170 275648670 277552738 278670006 279141693 279659195 280414753 281095123
642.3 281095123 281688595 282922440 284625225 286438293 286719646 287226143 288686447 289040947 289387150
651 289387150 289593906 290069962 290729294 290844193 290977421 291720600 292682495 292451553 291913815 291030216
660.6 291030216 290633183 290872822 290028763 288709412 287796249 288828850 290393295 290415134 291505146
669.3 291505146 292129612 292581291 292570648 292917747 293613453 293649883 293875771 295183506 297038460 297776070
678.9 297776070 299712677 303123131 304874802 306061249 306781712 306414757 306838760 307704830 307269344
687.6C07269344k6226J754208J922169J092910P56989J310482J733437R67407q52356
696.3C15928364n48821M54655l06702K41719J015625J388034J525727J096000J135903
705C21930504M91409J05171R37081R14459L08456J028176M48150l71170N02892R74274
714.6C27269402K083931J714706L00293M85382J131325J063843l02506o01845J30043
723.3C33274574N89066P87048K153778K092171N76630J262054J017799J139985J076622
732C43969727l62473o38809m38004Q02803J201744P02629R07059J637840J247101M64897
741.6C49494514L4791p88994N02891O05011M92134N30358m52729J310082K042160J986236
751.3C55756454J632576M87366M54025L01705Q80470J079559M23775O98204J098328
$$ plain form
687.6 307269344 307243118 308997326 310919495 312012405 312769394 314079876 315813313 316780720 315928364
696.3 315928364 315379543 315834198 315527496 315769215 316784840 318172874 319698601 320794601 321930504
705 321930504 322421913 322527084 323464165 324378624 324687080 325715256 326163406 325792236 326295128 327269402
714.6 327269402 329353333 331068039 331368332 331853714 332985039 334048882 333746376 333144531 333274574
723.3 333274574 333863640 334650688 336804466 338896637 339473267 340735321 341753120 342893105 343969727
732 343969727 343607254 342968445 342530441 343333244 344534988 345237617 346144676 347782516 349029617 349494514
741.6 349494514 349529305 348740311 349243202 349848213 350340347 350870705 350417976 351728058 353770218 355756454
751.3 355756454 357389030 357876396 358330421 358632126 359512596 360592155 361015930 361714134 362812462
760C62812462O59942J650658K743073K675666J539231p46651l90396p76062p79724
768.6C69388199R32655O91567K27394k06948O44265O30302L38249R03054J24321n59540
778.3C73113518j190529q91228n65338J17340J332855J787987J082916J90354J191826
787C76169701J120872K95944n12352q21533J946L05900L78113K69814N73501O5613
796.6C77847519j46599j51405r22966j408081j810112j557160j167755m79698j243744
805.3C68959999j805572j457558q46062k15225j648674j961212k457047k003174j330757
814C55234718k436676p89642K74620p9727j35155n0278M93851Q34351J316261J370201
823.6C56032524J459847J509819K653427K909126K412949L904647M048501L813514
$$ plain form
760 362812462 363472404 365123062 367866135 370541801 372081032 371334381 370943985 370167923 369388199
768.6 369388199 370320854 371012421 371239815 371032867 371677132 372307434 372645683 373548737 373673058 373113518
778.3 373113518 371922989 371031761 370466423 370583763 371916618 373704605 374787521 374977875 376169701
787 376169701 377290573 377586517 377074165 376252632 376254578 376560478 376938591 377208405 377781906 377847519
796.6 377847519 377700920 377549515 376626549 375218468 373408356 371851196 370683441 370203743 368959999
805.3 368959999 367154427 365696869 364850807 364635582 362986908 361025696 358568649 356565475 355234718
814 355234718 352798042 352008400 352283020 352203293 352068138 352017860 352511711 353346062 354662323 356032524
823.6 356032524 357492371 359002190 361655617 364564743 366977692 370882339 374930840 378744354
831.3C78744354L636513K775917K044716K967834L266030J156349J129532J571274
839C97292519K079391K493973K696113K407837J569519J712189J119957Q01735P43980
847.7D12917213J568184P85447M08058J673317J727714J959496R70611K696495K610588
856.4D27317123J057434J893693P99789P32193N91507J906853K242622Q91266R3346
865.1D37525826K05535J248703r48410j547203j592903j981087k911415k412796l31649
873.8D27254601j141472j24016o41213o42318p18346j994209r7122l63694j458130
882.4D20074081k490921k145691q94546l9635J24703o25572J51710M59404M75655j424065
892.1D13665123j888351p22275p04155l59192o52161N33600J16081k1209j2627j334839
$$ plain form
831.3 378744354 382380867 385156784 387201500 390169334 393435364 394591713 395721245 397292519
839 397292519 399371910 401865883 404561996 406969833 408539352 410251541 411371498 412173233 412917213
847.7 412917213 414485397 415270844 415678902 417352219 419079933 421039429 422010040 424706535 427317123
856.4 427317123 428374557 430268250 431068039 431800232 432391739 434298592 436541214 437432480 437525826
865.1 437525826 437731361 438980064 438031654 436484451 434891548 432910461 429999046 427586250 427254601
873.8 427254601 426113129 425989113 425347900 424705582 423987236 421993027 421895905 421532211 420074081
882.4 420074081 417583160 415437469 414542923 414503288 414627991 414002419 414154129 414613533 415089188 413665123
892.1 413665123 411776772 411054497 410350342 409991150 409338989 409872589 409988670 409967461 409954834 408619995
901.7D08619995r76677l21388J563911J622086J856079K696114K566833K228012J314469
910.4D21169434J871681P31087O58035K35100j096039j513863k939262k596436k282943
919.1D14236794j913682k315177k426300k615471l275185k549248l155555l136750
926.8C92849426l798790m016227k755967l125000l370437k415352j413994j712341
934.5C70241318j706963j331634q91152p26051j670876k118339k051316j878929k137146
943.2C55728912j462593n05180n55077q83255m27894N54199m77943o36750q6136n52940
952.8C50695343q54378j424408j179847j363182j879197k206039k233124k334061k463302
961.5C34757805j953735k281151k260132j854057j476136j726455k237015j695519
$$ plain form
901.7 408619995 407643318 407321930 408885841 410507927 412364006 415060120 417626953 419854965 421169434
910.4 421169434 423041115 423772202 424430237 424665337 423569298 422055435 419116173 416519737 414236794
919.1 414236794 412323112 410007935 407581635 404966164 401690979 399141731 395986176 392849426
926.8 392849426 389050636 385034409 382278442 379153442 375783005 373367653 371953659 370241318
934.5 370241318 368534355 367202721 366311569 365585518 363914642 361796303 359744987 357866058 355728912
943.2 355728912 354266319 353761139 353206062 352322807 351894913 352449112 351971169 351334419 351248283 350695343
952.8 350695343 349840965 348416557 347236710 345873528 343994331 341788292 339555168 337221107 334757805
961.5 334757805 332804070 330522919 328262787 326408730 324932594 323206139 320969124 319273605
969.2C19273605j431675j480922k161160k685814l100300l644046l415490l549919
976.9B97804279l863868l541832l293991m235993m720459m216366m712600n258465
984.7B63960705m757443m665050m477863m039631l501149k707328l009930l106060
992.4B33696251k788715k243462k355862k355365k106839k951545k333889k081223
1000.1B14479351k461739k402801k100811j739426j926155j501121j797695k005692
1007.8A98543911j852493j365376j552143k211208j660443j627731j254826j381206
1015.5A85638485j586342k094879k508526j863632j372700j196747k222938j707325
1023.2A71085396j459027q63208o78006j855278q88919r37157q18005j448631j019916
$$ plain form
969.2 319273605 317841930 316361008 314199848 311514034 308413734 304769688 301354198 297804279
976.9 297804279 293940411 290398579 287104588 282868595 278148136 273931770 269219170 263960705
984.7 263960705 259203262 254538212 250060349 246020718 242519569 239812241 236802311 233696251
992.4 233696251 230907536 228664074 226308212 223952847 221846008 218894463 216560574 214479351
1000.1 214479351 212017612 209614811 207514000 205774574 203848419 202347298 200549603 198543911
1007.8 198543911 196691418 195326042 193773899 191562691 189902248 188274517 187019691 185638485
1015.5 185638485 184052143 181957264 179448738 177585106 176212406 175015659 172792721 171085396
1023.2 171085396 169626369 168763161 168085155 166229877 165340958 164403801 163585796 162137165 161117249
1031.9A61117249m36593j058092N13964O15044P16514R32102J695080J302395J240788
1040.6A66638451J991481P86210J025104J26839M9171m87766n53303J57089j191291
1049.3A68541985q22258j269875p51667j294937j494084p95364j106338k6074o25687
1058A60355701L55854l90529K07290J817017J213207K367745J461601J393719J062507
1066.6A69844112J030541P88975O85272J599693Q99067J144199j70383r3384j87473
1075.3A75540619k21291M85630l8814P62100L22914J288300M38366L23181J105423
1084A80006428J8978J004619R75781J635704N93052O65340J624031R31511J403237
1092.7A88858681Q00895R72004M39320J351871J820889J206131J334362N6896P36103
$$ plain form
1031.9 161117249 160680656 159622564 160136528 160751572 161468086 162400188 164095268 165397663 166638451
1040.6 166638451 168629932 169416142 170441246 170568085 170617256 170129490 169576187 169733276 168541985
1049.3 168541985 167719727 166449852 165698185 164403248 162909164 162113800 161007462 160981388 160355701
1058 160355701 160711555 160321026 160528316 162345333 163558540 165926285 167387886 168781605 169844112
1066.6 169844112 170874653 171663628 172348900 173948593 174847660 175991859 175821476 175728092 175540619
1075.3 175540619 175319328 175804958 175766144 176528244 176851158 178139458 178577824 178901005 180006428
1084 180006428 180025406 181030025 182005806 183641510 184234562 184899902 186523933 187455444 188858681
1092.7 188858681 189659576 190631580 191070900 192422771 194243660 195449791 196784153 196841049 197577152
1101.4A97577152R18045R58882R49268J316547J830712R05590J372528J036301J71756
1110B07036781k12841J04752N93834J092376O91071L05023J365681O69327J151962
1118.7B12797966P21912n08346l96099k52648L46508n85670R8286Q71963J713448J785183
1128.4B16592503O88285J692048J296520J251335J406288K064304K101632J347141
1136.1B28440056K102852J988792K592487K307702J388530J065159J149388J366577
1143.8B42401543P91301L69511j12877N24540J17436J55544J348934K69337l40824
1152.5B45524445O1073M15573O3896m06341r23291q84723n74589j348343o04076J50814
1162.1B41474438L52077N62210J308976J838111J377545K063617J977177K049408K511006
$$ plain form
1101.4 197577152 198495197 199454079 200403347 201719894 203550606 204456196 205828724 206865025 207036781
1110 207036781 206823940 206928692 207522526 208614902 209305973 209610996 210976677 211646004 212797966
1118.7 212797966 213519878 213011532 212615433 212362785 212709293 212123623 212221909 213093872 214807320 216592503
1128.4 216592503 217280788 218972836 220269356 221520691 222926979 224991283 227092915 228440056
1136.1 228440056 230542908 232531700 235124187 237431889 238820419 239885578 241034966 242401543
1143.8 242401543 243192844 243562355 243449478 243974018 244091454 244246998 245595932 245865269 245524445
1152.5 245524445 245585518 246001091 246064987 245658646 244735355 243850632 243276043 241927700 241323624 241474438
1162.1 241474438 241826515 242388725 243697701 245535812 246913357 248976974 250954151 253003559 255514565
1170.8B55514565L255500L438073K770137K900448L098259L695393L070392K732010
1178.5B80474777K999993K422027K012520K293873K642212K066841K239914K011490
1186.2B99163647J627845K214318J416263N06935M09718j526l1853l91922n94005p8316
1195.9C04241104m82273q40950n06783n41267j357288j627007j198845j438369j773987
1204.5B94474335j671124r86500k88581j73951k78110k54173k44828o48822o96221
1213.2B89232025n88741r73339j026364j103782j033135n00526k14577P1278j94493
1221.9B83668346q89301j118088j026592q00610q31184j190071j344204q35457m96177
1230.6B75136662n41420k57378k43568l17765l13968m93546n45692j97735k22416n17883
$$ plain form
1170.8 255514565 258770065 262208138 264978275 267878723 270976982 274672375 277742767 280474777
1178.5 280474777 283474770 285896797 287909317 290203190 292845402 294912243 297152157 299163647
1186.2 299163647 300791492 303005810 304422073 304929008 305338726 305337200 305305347 304913425 304319420 304241104
1195.9 304241104 303758831 302917881 302411098 301869831 300512543 298885536 297686691 296248322 294474335
1204.5 294474335 292803211 291816711 291528130 291354179 291076069 290821896 290577068 289928246 289232025
1213.2 289232025 288643284 287669945 286643581 285539799 284506664 284006138 283791561 283862839 283668346
1221.9 283668346 282779045 281660957 280634365 279833755 279002571 277812500 276468296 275632839 275136662
1230.6 275136662 274595242 274337864 274094296 273776531 273462563 272969017 272423325 272225590 272003174 271485291
1240.2B71485291l17135P1315K28253k86026q3981J79291l21655o48918o47469k18639
1249.9B69440327o48289n79071l9005k7657J49517L2597M54082L45021j3810k65865
1259.5B68847847l84159P3261J56651M35104K15168L07522R14421J245708R44329P00454
1269.2B73456306J224041R82819R10263P84683P70111P94354R36832J443005J252518
1277.8B82554932J314029J132126J386452J533432J186695J330071J324157J283150
1285.5B93045044J383953J743832J266327J128845J465797J262779Q97198Q70991J274338
1294.2C04339104O81419L97492N13343N51510O96964K87400J94015N70851N97839K06413
1303.9C09036350K20852R918k17838n55668j182709o81648j40075n27897r49326n42068
$$ plain form
1240.2 271485291 271168156 271239471 271467724 271181698 271097717 271277008 270955353 270306435 269658966 269440327
1249.9 269440327 268792038 268212967 268173962 268146305 268295822 268328419 268782501 269127522 269113712 268847847
1259.5 268847847 268463688 268536949 268693600 269128704 269343872 269651394 270565815 271811523 272755852 273456306
1269.2 273456306 274680347 275663166 276573429 277358112 278128223 278922577 279859409 281302414 282554932
1277.8 282554932 283868961 285001087 286387539 287920971 289107666 290437737 291761894 293045044
1285.5 293045044 294428997 296172829 297439156 298568001 300033798 301296577 302193775 303064766 304339104
1294.2 304339104 305020523 305418015 305931358 306482868 307179832 307467232 307661247 308232098 308829937 309036350
1303.9 309036350 309257202 309267120 309049282 308493614 307310905 306629257 306489182 305961285 305011959 304469891
1313.5C04469891P3433J10683p4139P2556l6907k12365O12755P21550P54452Q15125
1323.2C07307034M02393O32305O19488O54220N82886L37257l99436q37594q01677j016178
1332.8C07480698m17920l38249k67372M3068J40095J56593k58598N20630O41269L84083
1342.4C08084297L46070O78062R32789N36346O92463N99804J035519K87132m61025
1351.1C12731457k95296k84386K42310p02934q77323n90859k05727J60294m21543o95400
1360.8C09060593r63078q7337k40975R2564J19114o87313l31669r61304m84257Q984
1370.4C05525322l40405r4738J86940J56555r5596M86335l13625k72427K9984j47038
1380.1C05121307m0836p74078r79653j267910q33091m85230q25767j808205j266060
$$ plain form
1313.5 304469891 304543324 304654007 304579868 304652424 304615517 304403152 305015907 305737457 306491909 307307034
1323.2 307307034 307709427 308341732 308961220 309615440 310198326 310535583 310136147 309298553 308496876 307480698
1332.8 307480698 307062778 306724529 306457157 306500225 306640320 306796913 306538315 307058945 307700214 308084297
1342.4 308084297 308430367 309108429 310041218 310577564 311270027 311869831 312905350 313192482 312731457
1351.1 312731457 312436161 312151775 312394085 311691151 310813828 310222969 310017242 310177536 309755993 309060593
1360.8 309060593 308097515 308010178 307769203 307861767 307980881 307293568 306961899 306000595 305516338 305525322
1370.4 305525322 305184917 305090179 305277119 305433674 305338078 305824413 305510788 305238361 305268345 305121307
1380.1 305121307 305080471 304306393 303326740 302058830 301225739 300740509 299914742 298106537 296840477
1388.7B96840477q62827k268219j962605j568413j399383k080326l249970j674308
1396.4B81774426j655179j530265k699948k375545j466561k398166k130108j891766
1404.2B65626888k433567k328930j468544j357193j873741j566009j796303j435433
1411.9B51367168j183548r11941m68102j300754j191273q00304J08337j617279o49071
1420.6B43353233P36504l52898O50444j20735L53050R89514L87535J002941O03924
1429.2B47603512J189022O49853J368999J563931J634616K162304J091786J969509
1437B59233532J093464K245159J788273J504917K248688J707248K192326J401691J884213
1445.6B75299511J591911J546345J201725J432571K332345R38053J913261J360779
$$ plain form
1388.7 296840477 295977650 293709431 291746826 290178413 288779030 286698704 283448734 281774426
1396.4 281774426 280119247 278588982 275889034 273513489 272046928 269648762 267518654 265626888
1404.2 265626888 263193321 260864391 259395847 258038654 256164913 254598904 252802601 251367168
1411.9 251367168 250183620 249271679 248803577 247502823 246311550 245511246 245619583 244002304 243353233
1420.6 243353233 244089737 243736839 244387283 244266548 244619598 245609112 245996647 246999588 247603512
1429.2 247603512 248792534 249442387 250811386 252375317 254009933 256172237 257264023 259233532
1437 259233532 260326996 262572155 264360428 265865345 268114033 269821281 272013607 273415298 275299511
1445.6 275299511 276891422 278437767 279639492 281072063 283404408 284342461 286255722 287616501
1453.3B87616501J649952J324138K34738K977810J255226M062004J887855K510815
1461.1C03519039K100678J772728K904567Q63228K462349K246723L102856L149528
1468.8C22121696L282586L800888K383995L755493K630730L600921K908745K422867
1476.5C46907921L440780K931901L055458K461166K286529J754075J630668J532593
1484.2C66001091J273460J316948J54648R56001J870385l97377m99535O08864L17802
1492.9C71602287o90765q62351p67898m538384m36554j427612l005028n06706q90350
1501.6C58476639q82645r66263K70348k74925l128357l305817l52440K55699q56361
1510.2C49235878R36279j129341j868172k66838p95707r33457k876816q88977Q98476
$$ plain form
1453.3 287616501 289266453 290590591 290825329 293803139 295058365 299120369 301008224 303519039
1461.1 303519039 305619717 307392445 310297012 311160240 313622589 315869312 318972168 322121696
1468.8 322121696 325404282 329205170 331589165 335344658 337975388 341576309 344485054 346907921
1476.5 346907921 350348701 353280602 356336060 358797226 361083755 362837830 364468498 366001091
1484.2 366001091 367274551 368591499 368746147 369702148 371572533 371175156 370675621 371284485 371602287
1492.9 371602287 370911522 370049171 369281273 364742889 364306335 362878723 359873695 359366989 358476639
1501.6 358476639 357593994 356627731 356898079 356623154 353494797 350188980 349836540 350092239 349235878
1510.2 349235878 350172157 349042816 347174644 346907806 346112099 345178642 342301826 341412849 342311325
1518.9C42311325J068306j796226k828904J142960J294861K198524q9760M70810M37661
1527.6C44209557l43819L26881K73247N32875n6991m42772j490555J336861M82902
1536.3C44828186J66321J919784j046753k300567o71387L53813j21193R91326O40945
1545C44760475j316414J469727M93736N87235m32625J57776J321563J46027J130867
1553.6C48318367k262154J15357J126442M99763n33600r015159K014999N27687J276093
1562.3C42067795r14841j053619k662468l097229j060448k545586j122551o619377
1570C22991676k500724k088528l382378k792721l323898j696358j1359024k171859
1577.7B93676186l429833m182472m177723n460548l243866n447731l166447n009708
$$ plain form
1518.9 342311325 343379631 341583405 338754501 339897461 341192322 343390846 343301086 343771896 344209557
1527.6 344209557 343865738 344192619 344465866 344998741 344941750 344498978 343008423 344345284 344828186
1536.3 344828186 344994507 346914291 345867538 343566971 342895584 343249397 343128204 344119530 344760475
1545 344760475 343444061 344913788 345407524 345994759 345562134 345719910 347041473 347187500 348318367
1553.6 348318367 346056213 346171570 347298012 347797775 347264175 338249016 340264015 340791702 342067795
1562.3 342067795 341152954 340099335 337436867 334339638 333279190 330733604 329611053 322991676
1570 322991676 320490952 318402424 315020046 312227325 308903427 307207069 295848045 293676186
1577.7 293676186 290246353 286063881 281886158 276425610 273181744 267734013 264567566 259557858
1585.5B59557858m246312m148807m994221l011379n875302l125419m950161k865925
1593.2B26340332l303089m081040k049827m324360j714516m194812j977768l123417
1600.9B01571503k850285j248474l379593o63242k889271n59883k160263j060105j136150
1609.6A85624237k440796M96254k385731o7443j814671L74069J30272l806515J724606
1618.2A77834282j408100J198616j062355J042309R1896j268292J279679q89683J716499
1626.9A78534851j119690J724968P05967P17316R73282n56374J836853k06985K068862
1635.6A84679050j505031K207374Q81863N19829K513885K28291K177639L9616J916027
1644.3A93658543J410293n79929L106518j193276L031445M90608K499104J415061k576046
$$ plain form
1585.5 259557858 255311546 251162739 246168518 243157139 237281837 234156418 229206257 226340332
1593.2 226340332 223037243 218956203 216906376 212582016 210867500 206672688 204694920 201571503
1600.9 201571503 198721218 197472744 194093151 193429909 190540638 189980755 187820492 186760387 185624237
1609.6 185624237 183183441 183679695 181293964 181226521 179411850 179785919 179916191 176109676 177834282
1618.2 177834282 176426182 177624798 176562443 177604752 177696648 176428356 177708035 176818352 178534851
1626.9 178534851 177415161 179140129 179846096 180563412 181536694 180980320 182817173 182610188 184679050
1635.6 184679050 183174019 185381393 186263256 186783085 189296970 189525261 191702900 191742516 193658543
1644.3 193658543 195068836 194488907 197595425 196402149 199433594 199924202 202423306 203838367 201262321
1653B01262321M517193J54209L615723P07264K038040R50375J921673K058601J567974
1661.6B18793373L274841n7411L174515J858540K923374K991829K354202K911758Q75473
1670.3B39100494M307957J564102L660279K952919K751655M073219K967587M626789
1678B66005001K571182M191265L028756L847675M745083L154697N762444J005707O124973
1686.7C00436783M279365M852543N195484L910294M825211M242858N330658M702340
1694.4C37775536M992523K955894N708618O295472N192947N294685J860276P522659
1702.1C77598610N471268M433288L535462L993606M017525L003044M481773L200722
1709.9D09735298K963600L121109L031960L097343P25632J786308L638039L040390
$$ plain form
1653 201262321 205779514 205933723 209549446 210256710 212294750 213245125 215166798 217225399 218793373
1661.6 218793373 222068214 222010803 225185318 227043858 229967232 232959061 235313263 238225021 239100494
1670.3 239100494 243408451 244972553 248632832 251585751 254337406 258410625 261378212 266005001
1678 266005001 268576183 272767448 275796204 279643879 284388962 287543659 293306103 294311810 300436783
1686.7 300436783 304716148 309568691 314764175 318674469 323499680 327742538 333073196 337775536
1694.4 337775536 342768059 345723953 351432571 357728043 362920990 368215675 370075951 377598610
1702.1 377598610 383069878 387503166 391038628 395032234 399049759 402052803 406534576 409735298
1709.9 409735298 412698898 415820007 418851967 421949310 422674942 424461250 428099289 431139679
1717.6D31139679l425865K526054L796196K273445K262306J292763J306534J792717
1725.3D42963829J665878J431351J579514K235527J50299J312446M009018L859329
1733D59207191j128273l636589N197678M314957K905693L148536R37233j20697M401207
1741.7D75226936M118042K300682L241654M640465M760894M032746L796310L222733
1749.4E05340462N690536L759575K187576N919075M656678M543037M364548K207298
1757.1E38668785L790512M346504L976021M073448M97322J433716M350930K820625
1764.8E63957863K605820L192977K899323l31688K915611M913788P54242j527977o89888
1773.5E78690071M876785L277436J95465K706413J416664K422753J619033Q1902K078590
$$ plain form
1717.6 431139679 427713814 430239868 434036064 436309509 438571815 439864578 441171112 442963829
1725.3 442963829 444629707 446061058 447640572 449876099 450026398 451338844 455347862 459207191
1733 459207191 458078918 454442329 459640007 463954964 466860657 470009193 470946426 470825729 475226936
1741.7 475226936 479344978 481645660 484887314 489527779 494288673 498321419 502117729 505340462
1749.4 505340462 511030998 514790573 516978149 522897224 527553902 532096939 536461487 538668785
1757.1 538668785 542459297 546805801 550781822 554855270 555352592 556786308 561137238 563957863
1764.8 563957863 566563683 569756660 572655983 572324295 575239906 580153694 580907936 579379959 578690071
1773.5 578690071 583566856 586844292 587039757 589746170 591162834 593585587 595204620 595286522 597365112
1782.2E97365112K189370J678657j16920Q39195J973190J761856J474610K320900J836662
1790.9F11322632J258545q98552n42565M086457J464119j90621J562004J999321R37844
1799.5F20999184o40450K700730P63435J117973K553597J046180P67441M40064J071663
1808.2F30819817J103973J319733n22805R33609J756630N43938J586266N17501J294442
1816.9F39353104K70080M24576J432724J66245Q08792j26419J903381J560898k412491
1825.6F43380890O29196K616196K746734L29972l326493N54963K421035M10691L50570
1834.3F50113754Q57849R14307Q20694k48032J264191N65796N88379N64575J799393
1842.9F57240906J190185n978164J939773K557297O77109M35562J019211J517028k07138
$$ plain form
1782.2 597365112 599554482 601233139 601116219 601955414 603928604 605690460 607165070 609485970 611322632
1790.9 611322632 612581177 611682625 611140060 615226517 616690636 616500015 618062019 620061340 620999184
1799.5 620999184 620358734 623059464 623822899 624940872 627494469 628540649 629308090 629748154 630819817
1808.2 630819817 631923790 633243523 632720718 633654327 635410957 635954895 637541161 638058662 639353104
1816.9 639353104 639623184 640047760 641480484 641646729 642455521 642329102 644232483 645793381 643380890
1825.6 643380890 644010086 646626282 649373016 649702988 646376495 646931458 649352493 649763184 650113754
1834.3 650113754 650971603 651885910 652706604 652458572 653722763 654288559 654876938 655441513 657240906
1842.9 657240906 658431091 652452927 654392700 656949997 657627106 658062668 659081879 660598907 660391769
1851.6F60391769N76783k8077K03324L85361K02255O40106k07596O08216L13873R28192
1861.3F64014206O56280M38843K67792r8114O02264n69076R54361p69654j382904J664277
1870.9F65778275J552886Q41599l3722O63910j22375J30157k4490m5624K89764m28009
1880.6F68602371Q82874L34091P31354K64282J1902N33676k96326R35288m40522j406784
1890.2F70152206M90876J030807K96707M47846M11529o48727J018906Q3084n2185J5564
1899.8F73246613o6300O71692k34070M77219K518M67224M51812j13525M15192K65503
1909.5F75583878J5258o84585M53644m17710n0201K49100J12457J310654j704560Q6136
1919.1F74954071J422806O41479N38407j043091p80563m5929M20913m05426m9972K79770
$$ plain form
1851.6 660391769 660968552 660940475 661143799 661529160 661731415 662371521 662163925 662772141 663086014 664014206
1861.3 664014206 664670486 665109329 665377121 665279007 665881271 665312195 666266556 665496902 664113998 665778275
1870.9 665778275 667331161 668172760 668139038 668802948 668680573 668810730 668786240 668740616 669030380 668602371
1880.6 668602371 669485245 669819336 670550690 670814972 670826874 671360550 671064224 671999512 671558990 670152206
1890.2 670152206 670643082 671673889 671970596 672418442 672829971 672181244 673200150 673283234 673231049 673246613
1899.8 673246613 673180313 673852005 673617935 674095154 674097672 674564896 675016708 674903183 675318375 675583878
1909.5 675583878 675599136 674914551 675368195 674950485 674900284 675149384 675261841 676572495 674867935 674954071
1919.1 674954071 676376877 677018356 677556763 676513672 675733109 675687180 676108093 675702667 675652695 675932465
1928.8F75932465K63748M00543O561N75485m27627j29395l09677k88925K48947j3504
1938.4F76258621P8507m14658J350021k49023j800308O83441L31421m2114j21994K64206
1948.1F76338120p77817m31595L00369J94550K59018j86386M89273k46277N7068o7444
1957.7F75928879m24271L739m07715j9989k98996M07791K7695n8060K51083p27920
1967.3F74682236j11924J86005L26462l24860j20620j23520j25428J87226j58997M99191
1977F74915771j87225J08414k10190k84271K98919l34472o8283q20771j1444L14255
1986.6F73720703k9831p3700k27279P19757k83814r18426l69263L90854j50604n51758
1996.3F72226639P705l24478K34681k26594J16501L1052k49786N2795k89688j0681
$$ plain form
1928.8 675932465 676196213 676596756 676603317 677178802 676751175 676621780 676312103 676023178 676272125 676258621
1938.4 676258621 676337128 675922470 677272491 677023468 675223160 675906601 676238022 676195908 676073914 676338120
1948.1 676338120 675560303 675128708 675429077 675623627 675882645 675696259 676185532 675939255 675996323 675928879
1957.7 675928879 675504608 675508347 675100632 675080643 674781647 675189438 675217133 675159073 675410156 674682236
1967.3 674682236 674570312 674756317 675082779 674757919 674637299 674513779 674388351 674575577 674416580 674915771
1977 674915771 674728546 674836960 674626770 674342499 674641418 674306946 674238663 673417892 673406448 673720703
1986.6 673720703 673690872 673617172 673389893 674109650 673825836 672907410 672538147 672929001 672778397 672226639
1996.3 672226639 672234344 671909866 672144547 671917953 672034454 672065506 671815720 671868515 671578827 671568146
2005.9F71568146p39746O6604o1798o31561k07901o3629M04205m68979k746O9961m09927
2016.5F69522629q65402n25742J20010l36456L33862l94592j68991M4632k70538r4300
2026.2F67365112n35354M5929n28336k82135n85327k40250M55704n46722k3880k92664
2035.8F64832077j11313j21612k63138m07639m02908k136o32935J32218m66919k91596
2045.5F62264099Q0872k42157K89840m41665q9874j70212j64719l59497l40195N3101
2055.1F60879593k52304J10245l68653M5395j45111j03531m5547k23923L14636o47201
2064.7F59563599r3842j64871k10800k83051l28445N74112l0136Q4762n63736j27945
2074.4F58419647N7755n20020m5929j35422K25144o81686m63181k0371K92588K37961
$$ plain form
2005.9 671568146 670828400 670895004 670833206 670201645 669993744 669930115 670334320 669865341 669862595 669932556 669522629
2016.5 669522629 668657227 668131485 668251495 667915039 668248901 667854309 667685318 667729950 667459412 667365112
2026.2 667365112 666829758 666875687 666347351 666065216 665479889 665239639 665695343 665148621 665124741 664832077
2035.8 664832077 664720764 664599152 664336014 663928375 663525467 663523331 662890396 663022614 662555695 662264099
2045.5 662264099 662344971 662102814 662392654 661950989 661861115 661690903 661526184 661166687 660826492 660879593
2055.1 660879593 660627289 660737534 660368881 660414276 660269165 660165634 660120087 659896164 660210800 659563599
2064.7 659563599 659469757 659304886 659094086 658811035 658482590 659056702 659026566 659111328 658547592 658419647
2074.4 658419647 658477402 657957382 657911453 657776031 658001175 657319489 656856308 656835937 657128525 657366486
2084F57366486m09775J98135l34396r92p06635m29916L63770n34287p4768m66080l509
2094.6F54968033k49787j29013L51105m82254m22897n60913J76468k33155n33981k07825
2104.3F52675781m3030L05405m89807l69034k23846m4480j81732l04336k14539j32217
2113.9F50978165j80054o93207J91345o7901j37711j831j81122J82953j18484j9455
2123.6F49952698o24085j01776l6087l54156r7733j36948O58722n4474P706n5542k52838
2134.2F48905487j52435n19562K14310q4076l4333k15911J2588K34528o714L18603
2143.8F48672485o4697J86462m16641j67999m9286m29153O5841j13678J31073k59399
2153.5F47555008L44772N05448K19040K16827k09732K04468l27225k66876m08020M0283
$$ plain form
2084 657366486 656956711 657154846 656820450 656819458 656112823 655682907 656046677 655512390 655437622 654971542 654968033
2094.6 654968033 654718246 654589233 654940338 654458084 654035187 653474274 653650742 653417587 652883606 652675781
2104.3 652675781 652632751 652938156 652448349 652079315 651855469 651810989 651629257 651324921 651110382 650978165
2113.9 650978165 650798111 650104904 650296249 650228348 650090637 650088806 649907684 650090637 649972153 649952698
2123.6 649952698 649328613 649226837 649190750 648836594 648738861 648601913 649260635 649206161 649213867 649158325 648905487
2134.2 648905487 648753052 648233490 648447800 648363724 648329391 648113480 648126068 648360596 648353882 648672485
2143.8 648672485 648607788 648794250 648377609 648209610 648160324 647731171 647797012 647683334 647814407 647555008
2153.5 647555008 647899780 648405228 648624268 648841095 648631363 648835831 648508606 648241730 647833710 647873993
2163.1F47873993L36227j53274K30026J73035P30972r3079j60293J23520k08817j34201
2172.8F48718109o98624K79236J81198K41394M50135J99661L65753R690K02636k47268
2182.4F49701920J23443k23770l58505N4245j6480O52695L63541M01001m46091N3482
2192F50305481N34515k02865M5929n67932K06070J3198j68075J03073J30310P80716
2201.7F51180420L2959J04370j15128j47323k12021j36642J87377j77993J24206k07214
2211.3F50633011L40042L43704N41916L84445n24673J20849j94778J13449k72217k89154
2221F51196594L60184J38626K84348j06202M29001K40860j52282n16205m60663J43127
2230.6F51557388j74484j61667m74014J61667O3934J91650O06995K65427L25851m60968
$$ plain form
2163.1 647873993 648210220 648056946 648286972 648460007 649190979 649097900 648937607 649061127 648852310 648718109
2172.8 648718109 648019485 648298721 648479919 648721313 649171448 649371109 649736862 649746552 649949188 649701920
2182.4 649701920 649825363 649601593 649243088 649297333 649280853 649933548 650297089 650698090 650251999 650305481
2192 650305481 650839996 650637131 650683060 650115128 650321198 650334396 650166321 650269394 650399704 651180420
2201.7 651180420 651213379 651317749 651202621 651055298 650843277 650706635 650894012 650716019 650840225 650633011
2211.3 650633011 650973053 651316757 651858673 652243118 651718445 651839294 651644516 651757965 651485748 651196594
2221 651196594 651556778 651695404 651979752 651873550 652302551 652543411 652391129 651874924 651414261 651557388
2230.6 651557388 651382904 651221237 650747223 650908890 650972824 651164474 651771469 652036896 652362747 651901779
2240.3F51901779K35672k51694n95016L1967j83487K77100j20697J47705j27640L1586
2249.9F51347275K71301j37863K00958k74277j35879K2659K92359k86713m60968K7618
2259.5F50866470k6779M14353m5243K26822k29568k47269J07269j4114K49863p98111
2269.2F50503693j11084L16772K87476J8997k13394J87912l55377L25393J5793j53809
2278.8F50822372l55835k40249m0436p40967L83225J07040L03497K27585l10211j07345
2288.5F50048676m39225J16883m32892k13623m48914J12686Q64029K23313M86602p37609
2298.1F49579926l16926j01776j89285j04675r76792l32794J05362R69391N5161J91497
2307.8F48879089N89829o30341O1798J11847J05591r80530q81805j39465K08816R98154
$$ plain form
2240.3 651901779 652137451 651885757 651290741 651322708 651139221 651416321 651295624 651443329 651315689 651347275
2249.9 651347275 651618576 651480713 651681671 651407394 651271515 651294174 651586533 651299820 650838852 650866470
2259.5 650866470 650839691 651254044 651208801 651435623 651206055 650958786 651066055 651051941 651301804 650503693
2269.2 650503693 650392609 650709381 650996857 651015854 650802460 650990372 650634995 650960388 650976181 650822372
2278.8 650822372 650466537 650226288 650185852 649444885 649828110 649935150 650238647 650466232 650156021 650048676
2288.5 650048676 649609451 649726334 649293442 649079819 648630905 648743591 649607620 649830933 650317535 649579926
2298.1 649579926 649263000 649161224 648971939 648867264 647890472 647557678 647663040 648632431 648687592 648879089
2307.8 648879089 649468918 648838577 648900375 649012222 649117813 648137283 647255478 647116013 647324829 648322983
2317.4F48322983j71433n21469k53372R06143N25971l2807j62582l97339L34320r01413
2327.1F47649002R766M86908P37075j94168j033020L20282r73282R2927M23355k33460
2336.7F47285385j699219j483078N47486K1744P75451J9684N16052M63028M0970n07202
2346.3F45980301k089768r69848M42200J280517k25906j0376P73391K45362Q33664
2355F46259537j376343k03857l03116j43814L38287J55868J11924r53217l2654j088943
2364.7F42763672Q12683p27844r23691L83301p91931M63333p45163j184311j662407
2373.3F38387642m99039O5460o23741q7623n15747j19515p97958k26441j56974r60808
2383F34465256o12870r35363k92778l48435M692N188l63540n1461l93257J15052k96441
$$ plain form
2317.4 648322983 648151550 647630081 647376709 648282852 648808823 648776016 648613434 648216095 648550415 647649002
2327.1 647649002 647658768 648145676 648882751 648688583 647655563 647975845 647002563 647095490 647518845 647285385
2336.7 647285385 645586166 644103088 644650574 644672318 645447769 645467453 645983505 646446533 646487503 645980301
2346.3 645980301 643890533 642920685 643362885 644643402 644417496 644407120 645180511 645425873 646259537
2355 646259537 644883194 644679337 644376221 644232407 644570694 644726562 644838486 643885269 643852615 642763672
2364.7 642763672 643576355 642848511 641924820 642308121 641516190 641979523 641234360 640050049 638387642
2373.3 638387642 637888603 637954063 637330322 637242699 636726952 636607437 635809479 635583038 635426064 634465256
2383 634465256 633852386 632917023 632624245 632275810 632280502 632285690 631922150 631870689 631477432 631592484 631296043
2393.6F31296043n56106o99005m77562o2676l31955j88713o61163j52207l17649l01171
2403.2F27547836j61056l91045J10245q01582o42434n36155l13797j068l93372k41852
2412.9F24175720n53474J6784j19895l26996m80843p04727l54691o67419m16222m94346
2422.5F20073891p3815J77803j89171m48532o66999n79606r22966l31382l49961m99534
2432.2F16189728m53911p60307l61672j16081J25732n09796o41021m22249l62854m47655
2441.8F12239914p07359l03460n34324k20108m43077l10784j29776p91168j52550l50799
2451.5F08296509m12598l63579m72297p48024q80509k15492o64024n30510j94207J1406
2461.1F03826675j48162o24123p61643q99772l76167n91622n64308m92210j01166L8986
$$ plain form
2393.6 631296043 630739937 630040932 629563370 629500694 629168739 628980026 628318863 628166656 627849007 627547836
2403.2 627547836 627386780 626995735 627105980 626304398 625661964 625125809 624812012 624810944 624417572 624175720
2412.9 624175720 623622246 623639030 623519135 623192139 622711296 622006569 621651878 620984459 620568237 620073891
2422.5 620073891 620000076 620177879 619988708 619540176 618873177 618293571 617370605 617039223 616689262 616189728
2432.2 616189728 615735817 614975510 614613838 614497757 614623489 614113693 613472672 613050423 612687569 612239914
2441.8 612239914 611532555 611229095 610694771 610474663 610031586 609720802 609591026 608799858 608647308 608296509
2451.5 608296509 607883911 607520332 607048035 606300011 605419502 605204010 604539986 604009476 603815269 603826675
2461.1 603826675 603678513 603054390 602292747 601392975 601016808 600425186 599860878 599368668 599267502 599306488
2470.7E99306488o92711m90570q17566o02798o21109q15964p41272q51288j78184l59459
2480.4E93135567l73345l82271m18548m72183n97573m32014p57752n64918o92787p03278
2490E87740898n56106k07749k54631p27653l65220p02972p05566q53806n87273k99415
2499.7E82480507r12666o08330l37715j89782o48574n52445o99310r48486k32010m50898
2509.3E76900291o08863r85375m95338m35982q01926k79312o09054m20914m55246l01323
2519E71506958l17116n76973m43840o81343n93490p21817m02489m50745l13682m56047
2528.6E66549416q34427k20490o34842n09224l34930o22330q71162o43769l7269m47998
2538.2E61392975o15196o96907j82572l84826o62079l63350o79360l88145q38852m73251
$$ plain form
2470.7 599306488 598613777 598123207 597305641 596702843 596081734 595265770 594524498 593673210 593495026 593135567
2480.4 593135567 592762222 592379951 591961403 591489220 590891647 590459633 589701881 589136963 588444176 587740898
2490 587740898 587184792 586977043 586722412 585994759 585629539 584926567 584221001 583367195 582779922 582480507
2499.7 582480507 581567841 580959511 580621796 580432014 579783440 579230995 578531685 577583199 577351189 576900291
2509.3 576900291 576291428 575306053 574810715 574374733 573572807 573293495 572684441 572263527 571808281 571506958
2519 571506958 571189842 570612869 570169029 569487686 568894196 568172379 567769890 567319145 567005463 566549416
2528.6 566549416 565714989 565494499 564859657 564350433 564015503 563393173 562522011 561878242 561840973 561392975
2538.2 561392975 560777779 560080872 559898300 559513474 558851395 558488045 557808685 557420540 556581688 556108437
2547.9E56108437k56348q44917n52903n97076l59459j40533j84822p51954p39631m86069
2557.5E51194725m97818j70135m68674o10848p88803l79448k21328l23067n29175r87244
2567.2E46218185l48320p58895p77092k92168l64609m24690n48172k14729n48325n75447
2576.8E41365738n26657k06871j42861m76837m10309q87184m38118n04150p65228p45926
2586.5E36261597n90515K3689l33405m04091n44891l69873n47829o45446l99704r20830
2596.1E31528702p06864p98759j91231M7112n04990o70280r87244q13637j016235l42140
2605.7E25544434k10228m85764l39012j048355q24356k71187k42844j049385r54819
2614.4E20118484l01208l71819k88467q17680p78160p82547q46978m21142m69742p55730
$$ plain form
2547.9 556108437 555852089 555007172 554454269 553857193 553497734 553357201 553172379 552420425 551680794 551194725
2557.5 551194725 550696907 550526772 550058098 549447250 548658447 548278999 548057671 547734604 547205429 546218185
2567.2 546218185 545869865 545110970 544333878 544041710 543677101 543252411 542704239 542489510 541941185 541365738
2576.8 541365738 540839081 540632210 540489349 540012512 539602203 538715019 538276901 537772751 537007523 536261597
2586.5 536261597 535671082 535694771 535361366 534957275 534412384 534042511 533494682 532849236 532449532 531528702
2596.1 531528702 530821838 530023079 529831848 529878960 529373970 528703690 527716446 526902809 525886574 525544434
2605.7 525544434 525334206 524848442 524509430 523461075 522636719 522365532 522122688 521073303 520118484
2614.4 520118484 519817276 519445457 519156990 518339310 517561150 516778603 515931625 515510483 515040741 514285011
2624.1E14285011p37152m06608o24047n82313m95796n35241o61277n41764l06740p43598
2633.7E08650475p76291r53446o08215n00450p10068m26025o69022n05943n87807n88341
2643.4E02324867q79440q83942k91176n92155o97212p32079k82936k86140n06363m76456
2653D96696968q23097o92368p22770n23148o43196o25305m73404m17862k38648n96351
2662.6D90940819k28882l91159p65495q39234p82203k96822l47786m51813n08003k69432
2672.3D86059990o14853m71535q4037m50364l55796n68619m01764m87061n68580p54814
2681.9D81302567r09310m66537m45977J49804j90049m13932o13633q48961j95541q54187
2691.6D76514244q05473n10369m69856m46167m11453o1684l62777j94397o06995n70564
$$ plain form
2624.1 514285011 513547859 513141251 512517204 511934891 511439095 510903854 510242577 509700813 509394073 508650475
2633.7 508650475 507874184 506920738 506312523 505812073 505102005 504675980 504006958 503501015 502913208 502324867
2643.4 502324867 501445427 500561485 500270309 499678154 498980942 498248863 497965927 497679787 497173424 496696968
2653 496696968 495873871 495181503 494458733 493935585 493292389 492667084 492193680 491775818 491537170 490940819
2662.6 490940819 490711937 490320778 489555283 488716049 487933846 487637024 487289238 486837425 486329422 486059990
2672.3 486059990 485445137 484973602 484889565 484439201 484083405 483514786 483113022 482625961 482057381 481302567
2681.9 481302567 480393257 479926720 479480743 479630547 479440498 479026566 478412933 477563972 477368431 476514244
2691.6 476514244 475708771 475198402 474728546 474282379 473870926 473809242 473446465 473252068 472645073 472074509
2701.2D72074509j29967l84216o34842r71794n36843l16543k13204l60298l50685l53012
2710.9D67823105q41789m44107j38474K9945l76968p72858n67283n44129m61387j40724
2720.5D63565331K69241j80626m61693o32896m57802j25275n76896p08580n32227l1052
2730.2D60127525k35176j76277j65672n65377p4310j28364k05117o95076p16514l09448
2739.8D56856194l13035p7171l77159L1052K01759r4109l92417n32914l11508n85823
2749.4D54404869m35371l51258j95922m34990n08843N9586Q4610r6970o21681m00124
2759.1D51503906k48871k11715k03209p45087n43098l07503k99950m00924m0894k15301
2768.7D48287354p86210n68046k78816j38970n29403l05520m19006n00832k93426o81305
$$ plain form
2701.2 472074509 471944542 471560326 470925484 469953690 469416847 469100304 468887100 468526802 468176117 467823105
2710.9 467823105 466981316 466537209 466398735 466428680 466051712 465278854 464711571 464167442 463706055 463565331
2720.5 463565331 463834572 463653946 463192253 462559357 462101555 461976280 461399384 460690804 460158577 460127525
2730.2 460127525 459892349 459716072 459550400 458985023 458910713 458782349 458577232 457882156 457165642 456856194
2739.8 456856194 456543159 456465988 456088829 456119881 456321640 456227531 455835114 455302200 454990692 454404869
2749.4 454404869 453969498 453618240 453422318 452987328 452478485 452538071 452622681 452525711 451904030 451503906
2759.1 451503906 451255035 451043320 450840111 450095024 449551926 449244423 448944473 448543549 448502655 448287354
2768.7 448287354 447501144 446933098 446654282 446515312 445985909 445680389 445261383 444760551 444467125 443785820
2778.4D43785820m59557n42182k96937n03768p78275n16968p12662l68270k82555m02031
2788D38922615q19969o20613l50380p36351o30150o40106n22232q02269o28433o80581
2797.7D32491531r59015m74243m07943m47541r33838o33316o92367j133614q99353
2806.3D25910301r52644l69949m24271n21011r48449j338997o59370n75256n83649
2815D19536705r91058r10416p28035j261139j195450p13844n81474j097222j207618
2823.7D10850449p42264n19333j064720j166420q96111r45434q87070j037445q33473
2832.4D02758179j220856j393509j315231j461601j114350j322403j352501j787147
2840.1C91790581j745224j462822j800003j972008k693825k339744k054139k522316
$$ plain form
2778.4 443785820 443326263 442784081 442487144 441983376 441205101 440688133 439975471 439607201 439324646 438922615
2788 438922615 438102646 437482033 437131653 436395302 435765152 435125046 434602814 433800545 433172112 432491531
2797.7 432491531 431532516 431058273 430650330 430202789 429268951 428635635 427943268 426809654 425910301
2806.3 425910301 424957657 424587708 424163437 423642426 422693977 421354980 420695610 420120354 419536705
2815 419536705 418545647 417635231 416907196 415646057 414450607 413736763 413155289 412058067 410850449
2823.7 410850449 410108185 409588852 408524132 407357712 406461601 405516167 404629097 403591652 402758179
2832.4 402758179 401537323 400143814 398828583 397366982 396252632 394930229 393577728 391790581
2840.1 391790581 390045357 388582535 386782532 384810524 382116699 379776955 377722816 375200500
2847.8C75200500k770385k398186j571655j478920j130982j024437p53212l68042k21138
2856.5C63483543j62010j37901N06935M082q06694q27599k42576k75612q64792p44934
2866.1C59932442r93271q73146r40628p67632p15713r50814k96669o97708p67479l14026
2875.8C52615356o64901j176071p19529k31323r67979j032639p43599p57599j195411
2884.4C45126305q37212m46854j216964j138268j111336r06257p94106r35745j141930
2893.1C36597633j311683p09572q72078o50215p91397j047211m31747p24183q91380
2901.8C29168167r15489q19473o78826p70111r36928j001281j027375j051178n95588
2910.5C21371918j042824j501198j397419j728992k044373j578407j042385j144791
$$ plain form
2847.8 375200500 372430115 370031929 368460274 366981354 365850372 364825935 364072723 363704681 363483543
2856.5 363483543 363321533 363183632 363690567 363694649 362887955 362060356 361817780 361542168 360677376 359932442
2866.1 359932442 358939171 358066025 357125397 356357765 355642052 354691238 354394569 353696861 352929382 352615356
2875.8 352615356 351950455 350774384 350054855 349823532 348855553 347822914 347079315 346321716 345126305
2884.4 345126305 344289093 343842239 342625275 341487007 340375671 339469414 338675308 337739563 336597633
2893.1 336597633 335285950 334576378 333704300 333054085 332262688 331215477 330783730 330059547 329168167
2901.8 329168167 328252678 327433205 326754379 325984268 325047340 324046059 323018684 321967506 321371918
2910.5 321371918 320329094 318827896 317430477 315701485 313657112 312078705 311036320 309891529
2918.2C09891529r98650j246318q55160p43084r78508n01785o03257J31321P1450L1414
2927.8C04198952J44329l67966K24285p4329K21176Q92982N09949K40059L67470N34458
2937.5C06891365M43249O80256O27861R32789R24434P75662P44056L04985R10225Q97885
2947.1C14132767O07719N01061L38783N18227K11353K63023M39282M02774K82975N28412
2956.8C18226376O18553N88970O82182M84123Q68760O16150K51884M24347P54089R69391
2966.4C24484825P22847P41806P23190J098290Q53653M97131P08237P08160P64923
2975.1C31303062K48642K23961N12772Q07495O98929L16696N16548M10004L72276k4490
2984.7C35385895J84059O18782J41106n1957N6534J3809j38969N35011J83029n31158
$$ plain form
2918.2 309891529 308892879 307646561 306791401 306048317 305069809 304568024 303964767 304096088 304167538 304198952
2927.8 304198952 304343281 303975315 304199600 304125271 304346447 305239429 305749378 305989437 306356907 306891365
2937.5 306891365 307334614 308014870 308642731 309575520 310499954 311275616 312019672 312324657 313234882 314132767
2947.1 314132767 314740486 315241547 315580330 316098557 316309910 316572933 317012215 317414989 317697964 318226376
2956.8 318226376 318844929 319433899 320116081 320600204 321468964 322085114 322336998 322761345 323515434 324484825
2966.4 324484825 325207672 325949478 326672668 327770958 328624611 329121742 329829979 330538139 331303062
2975.1 331303062 331551704 331775665 332288437 333095932 333794861 334111557 334628105 335038109 335410385 335385895
2984.7 335385895 335569954 336188736 336329842 336277885 336334419 336348228 336209259 336744270 336927299 336396141
2994.4C36396141j91002k33345j0948j88332n75637o26069j97448j6289n13840o93664
3004C33149567o79016k96135o56243o92901j44883l94706p40242o96297k91214o58188
3013.7C27899742q93555p44819m32816l90663q98476q26988o79435j47210m99115q58497
3023.3C21528168n14260r08012q64086o68984l83110q48770j084709o47678r11446
3032C14697113p93304q07324p29408q50010r23004n21469n84355q35628q64048m54350
3041.6C07334213n10483q43830j081047r42554p65896q27713o81763p83176q00038
3050.3C00097713j118049o39267l01800p79858n86185p03545q10852j412754j134700
3059B92610703l03002m50058m86603q67729o46343o66657o11076m63829j059284q04730
$$ plain form
2994.4 336396141 336205139 335971794 335960846 335772514 335196877 334570808 334373360 334357071 333843231 333149567
3004 333149567 332470551 332174416 331518173 330825272 330680389 330285683 329545441 328849144 328557930 327899742
3013.7 327899742 327006187 326261368 325828552 325437889 324539413 323712425 323032990 322885780 322386665 321528168
3023.3 321528168 321013908 320105896 319241810 318572826 318189716 317340946 316256237 315608559 314697113
3032 314697113 313903809 313096485 312367077 311517067 310594063 310072594 309488239 308652611 307788563 307334213
3041.6 307334213 306823730 305979900 304898853 303956299 303190403 302362690 301680927 300897751 300097713
3050.3 300097713 298979664 298340397 298038597 297258739 296672554 295969009 295158157 293745403 292610703
3059 292610703 292307701 291857643 291371040 290503311 289856968 289190311 288579235 288115406 287056122 286251392
3068.6B86251392n66806m42200o08673p43675p55730q20351n40886n70373l78323m48932
3078.3B80375443p06463o08292l87726q58078j376362p18689l07884m19712q69980
3087B74122257p13463n26828r10073o54850l06492l25737q52031o98376n57136o68870
3096.6B67908401m91676o59027m57382p28035q67500p74403m55055m15459q05511k84977
3106.2B61969376p95098q32119k85721n67913q03146j104622p31792o16837o22616
3114.9B55609512q16326p82604j48964l36456p53918r21078p45811j084232r02424
3123.6B49117699l02067p09725p32765n37433m69323p22904q01258o59981r00535q34599
3133.3B42447109k55775j58482j024704r52110p41310r32255m76055l17536m44068
$$ plain form
3068.6 286251392 285684586 285242386 284633713 283890038 283134308 282313957 281773071 281202698 280824375 280375443
3078.3 280375443 279668980 279060688 278672962 277814884 276438522 275719833 275411949 274992237 274122257
3087 274122257 273408794 272881966 271971893 271317043 271010551 270684814 269832783 269134407 268577271 267908401
3096.6 267908401 267416725 266757698 266300316 265572281 264704781 263930378 263475323 263059864 262254353 261969376
3106.2 261969376 261174278 260342159 260056438 259488525 258685379 257580757 256848965 256232128 255609512
3114.9 255609512 254793186 254010582 253861618 253525162 252771244 251850166 251104355 250020123 249117699
3123.6 249117699 248815632 248105907 247373142 246835709 246366386 245643482 244842224 244182243 243281708 242447109
3133.3 242447109 242191334 242032852 241008148 240056038 239314728 238382473 237906418 237588882 237144814
3141.9B37144814o91109m75941m04091m52785n36022j085015q26626p76825q82206
3150.6B31014194m45537o08101r89933n21145j65691o88248q89568p14894o16455r58252
3160.3B24416370j051139n91011m56334m06284m13723o59714r40227n48096m37832
3168.9B18912010o08921l29380o89182j006489j091347r48562l69702k9735m47979
3177.6B13390713o76689m22364r69352p53384j94950n00260j009082j007786l20645
3186.3B07536201l29303l11260l43838n56202q43582r20868m69933o64005l50361m29077
3195.9B02317772q97255p39517n40695k14997m25281k34261m67644q49781o97231q33321
3205.6A96417789m72583m66309n77850o98815m67033j34029o85559m09355N5790m52290
$$ plain form
3141.9 237144814 236453705 235977764 235573673 235120888 234584866 233499851 232673225 231896400 231014194
3150.6 231014194 230568657 229960556 228970623 228449478 228283787 227595539 226705971 225991077 225374622 224416370
3160.3 224416370 223365231 222774220 222317886 221911602 221497879 220838165 219897938 219349842 218912010
3168.9 218912010 218303089 217973709 217284527 216278038 215186691 214238129 213868427 213838692 213390713
3177.6 213390713 212714024 212291660 211322308 210568924 210373974 209873714 208864632 207856846 207536201
3186.3 207536201 207206898 206895638 206551800 205995598 205152016 204231148 203761215 203097210 202746849 202317772
3195.9 202317772 201420517 200681000 200140305 199925308 199500027 199265766 198798122 197948341 197251110 196417789
3205.6 196417789 195945206 195478897 194901047 194202232 193735199 193601170 192915611 192506256 192562046 192109756
3215.2A92109756j011657q00934k78492m66824p25002l34225l78246q05912n31864
3223.9A86776600k35291M139k99377o70033o65474p78446j99280l21044p10965o74534
3233.5A82226295l21903Q0490n48210m48227l81202p79591n52025n2700K50340l97454
3243.2A79075813o33888l12900k38057m51488o58474n34287m54445l65295j58634L50342
3252.8A75618687r0962p95002n97534o66542l78399j55544n14088n27706j37463j04522
3262.5A71650925o08445p39021k02389r9315o54698m16622J65157Q9226n66139o34174
3272.1A67984505j05973m08191l96118k53754l81813k47708k23407r1248M8676r6970
3281.8A65827999l41205J38492r9087p62329m49772l59039m59862o45981J3199K92492
$$ plain form
3215.2 192109756 191098099 190297165 190018673 189551849 188826847 188492622 188114376 187308464 186776600
3223.9 186776600 186541309 186545448 186246071 185576038 184910564 184132118 183932838 183611794 182900829 182226295
3233.5 182226295 181904392 181984882 181436672 180988445 180607243 179827652 179275627 179222927 179473267 179075813
3243.2 179075813 178441925 178129025 177890968 177439480 176781006 176246719 175792274 175426979 175268345 175618687
3252.8 175618687 175527725 174732723 174135189 173468647 173090248 172934704 172420616 171892910 171755447 171650925
3262.5 171650925 171042480 170303459 170101070 170001755 169347057 168930435 169095592 169184818 168618679 167984505
3272.1 167984505 167878532 167470341 167074223 166820469 166438656 166190948 165967541 165876293 165924969 165827999
3281.8 165827999 165486794 165625286 165526199 164763870 164314098 163955059 163495197 162849216 162862415 163154907
3291.4A63154907k56786L4275j31683j49899j56822l58219k84481p81536o36845J0013
3301A60442924j47113k23866M6539k54354l01771k38485j76354R4309m21572m57067
3310.7A58363190k26422l59449k91615k40659n32656o76813L6430j00651n29251r6912
3320.3A55345192K25477j03884o64062m31414l88202j60122j94073p74899p10849q12292
3330A51330872o8446K78817o21462j039686o29187M98123L05061o31275o61506l65458
3339.6A48395853k15950o22158m04892J07260k87390n44596m56905l44496K3737K06194
3349.3A45856657j79911n04808j50805k4108k71082k33927k20308j81647m03776n1088
3358.9A43635197M21562j90182k90184j87158j30101k08482j80693L17068m34589n52569
$$ plain form
3291.4 163154907 162898121 162932396 162800713 162650814 162493992 162135773 161851292 161069756 160432911 160442924
3301 160442924 160295811 160071945 160118484 159864130 159562359 159323874 159147520 159241829 158820257 158363190
3310.7 158363190 158136768 157777319 157485704 157245045 156712389 156035576 156072006 155971355 155442104 155345192
3320.3 155345192 155570669 155466785 154802723 154371309 153983107 153822985 153628912 152854013 152143164 151330872
3330 151330872 151262426 151541243 150919781 149880095 149250908 149749031 150054092 149422817 148761311 148395853
3339.6 148395853 148179903 147557745 147152853 147260113 146972723 146428127 145971222 145626726 145650463 145856657
3349.3 145856657 145676746 145171938 145021133 144997025 144725943 144492016 144271708 144090061 143686285 143635197
3358.9 143635197 144056759 143866577 143576393 143389235 143259134 143050652 142869959 143187027 142752438 142199869
3368.6A42199869M49934N13153M7808j45655j74341n97124p02171n16215N0049L99962
3378.2A41525269j31150l729r8152l50780M501M7436L4304q4897l8566J94988K12469
3388.8A41311693O6061j43471j07727j7967K16704J76563l0356K42730j46180o25286
3398.4A40942764k36711J21841K02770l43856l01428N33581M33015p8439j89257P3366
3408.1A41157646L33662L24688q2092k01683M52890L88632k34766l27139J25189K66056
3417.7A42203083K9411K93017K65608N0029R1401K99959L27654L4608K69156J86882
3427.4A44050808L2930L21503L13396L24345M91591K07700l87907K9354L67031J08004
3437A45858755J86882J94292M31347M97351L98493K83670J35355J60980L63360O40030
$$ plain form
3368.6 142199869 142649803 143162956 143210764 143065109 142890768 142293644 141591473 141075258 141125307 141525269
3378.2 141525269 141394119 141390390 141292238 140941458 140945959 140993395 141027699 140942802 140904236 141099224 141311693
3388.8 141311693 141377754 141234283 141126556 141108589 141325293 141501856 141471500 141714230 141568050 140942764
3398.4 140942764 140706053 140827894 141030664 140686808 140385380 140918961 141351976 141273537 141084280 141157646
3408.1 141157646 141491308 141815996 141733904 141532221 141985111 142373743 142138977 141811838 141937027 142203083
3417.7 142203083 142232494 142525511 142791119 142841148 142932549 143232508 143560162 143594770 143863926 144050808
3427.4 144050808 144083738 144405241 144718637 145042982 145534573 145742273 145354366 145383720 145750751 145858755
3437 145858755 146045637 146239929 146671276 147168627 147567120 147850790 147986145 148147125 148510485 149150515
3446.7A49150515j56832K26917R49516K43073N75104P39822K33240K52638L93572N94635
3456.3A53202200K99072M10137O29340J96733K53496N68123N18227M22792L64285K53467
3466A57117872L98998M97017O22883Q71029N13315J86825K03991K06223L50723P49931
3475.6A61718807Q94184N11055P88441J108303M85115m406j49422L81051J183853J153183
3485.2A68070164M41189o0578N21774J169739R90429P00913M60586N66292N49259O14243
3494.9A74024010P56359M8866L00388J217099R84573O87046N82295N47962N40390R2373
3504.5A79781361N24177J208515J136284R29108K20604j5259J009293J439724Q74710
3513.2A87108517M73480Q92239J054534R86824Q72021M15402N24826R32045J015548
$$ plain form
3446.7 149150515 148993683 149220600 150170116 150413189 150988293 151728115 151961355 152213993 152607565 153202200
3456.3 153202200 153501272 153911409 154540749 154737482 154990978 155559101 156077328 156500120 156864405 157117872
3466 157117872 157516870 158013887 158636770 159507799 160021114 160207939 160411930 160618153 160968876 161718807
3475.6 161718807 162612991 163124046 163912487 165020790 165505905 165501499 165352077 165733128 166916981 168070164
3485.2 168070164 168511353 168450775 168972549 170142288 171132717 171833630 172294216 172860508 173409767 174024010
3494.9 174024010 174780369 174829235 175129623 176346722 177331295 178018341 178600636 179148598 179688988 179781361
3504.5 179781361 180305538 181514053 182650337 183579445 183800049 183784790 184794083 186233807 187108517
3513.2 187108517 187581997 188474236 189528770 190515594 191387615 191803017 192327843 193259888 194275436
3521.9A94275436O96640O09627Q35915J025734J263656P52812N62935J058406J228962
3530.6B02310123O91128M91219Q67729J156540J722546P85923M94995J367263R57566
3539.2B10845032R02385R06411J499996J343593Q39787R79252P88898J434803J030407
3547.9B20570564J417427J533051J348934J149311N16358J699237P68891J350727K031803
3556.6B32386303J010609J501712J321602K008343J502495J287765J421776J093273
3564.3B43533878K281609P44209J119023J004047R63268K418461J654930J970940J743831
3573B57434196J856747J704464J820393J841621N27363J653747J961785K111244K017212
3581.7B72928772J846218K158280J909008L210506K348938N06687L96633R09901L079052
$$ plain form
3521.9 194275436 194972076 195581703 196417618 197443352 198707008 199459820 200022755 201081161 202310123
3530.6 202310123 203001251 203492470 204360199 205516739 207239285 208025208 208520203 209887466 210845032
3539.2 210845032 211747417 212653828 214153824 215497417 216337204 217316456 218105354 219540157 220570564
3547.9 220570564 221987991 223521042 224869976 226019287 226535645 228234882 229003773 230354500 232386303
3556.6 232386303 233396912 234898624 236220226 238228569 239731064 241018829 242440605 243533878
3564.3 243533878 245815487 246559696 247678719 248682766 249646034 252064495 253719425 255690365 257434196
3573 257434196 259290943 260995407 262815800 264657421 265184784 266838531 268800316 270911560 272928772
3581.7 272928772 274774990 276933270 278842278 282052784 284401722 284908409 285305042 286214943 289293995
3590.4B89293995K559891K470474J476631J866875L101177P86018K468510L002930
3598.1C07026501J636123K582970K002850J947975K328014K087326K573757L420067
3605.8C25605583K403908M78668M010887J712723P46384N291939J589317P61261L931923
3614.5C46532593J474685M520569M772263J896858J555977O58874K798348L950806
3622.2C68160973L271484L261795L489075K439460L659707O590347O28357m576416
3629.9C86924782N014877N243530N061760L008423R89266L097419M212838L644409
3637.6D17197304J960220K865524L953362L569374K987709K531929L623543M761200
3645.3D43450165O119995J270676p41158O667786K219886k34527J661453N490608N290909
$$ plain form
3590.4 289293995 291853886 294324360 295800991 297667866 300769043 301555061 304023571 307026501
3598.1 307026501 308662624 311245594 313248444 315196419 317524433 319611759 322185516 325605583
3605.8 325605583 328009491 328488159 332499046 334211769 334958153 340250092 341839409 342600670 346532593
3614.5 346532593 348007278 352527847 357300110 359196968 360752945 361411819 364210167 368160973
3622.2 368160973 371432457 374694252 378183327 380622787 384282494 390872841 391501198 386924782
3629.9 386924782 391939659 397183189 402244949 405253372 406242638 409340057 413552895 417197304
3637.6 417197304 419157524 422023048 425976410 429545784 432533493 435065422 438688965 443450165
3645.3 443450165 449570160 450840836 450099678 456767464 458987350 458752823 460414276 465904884 471195793
3654D71195793N103340N858155m039879L008613N578308K157975K537460J824341L165207
3662.7D96389313K110557L194619L184089K029915N328713K696304J006775R63707
3670.4E16903992l806610L906898P927742Q573723j159821j3391265M839019Q021279
3678.1E31814957M357032q35609J356773K712059K328415K036820K220154K450447
3685.8E48441048M888305N924225r724006j539727Q954697m250603k39639N368538
3693.5E57822838J654625J481743L97262M04740J629104P75032L556557L601761m377861
3702.2E66945801j223564M548072J430092r2086J081962L048897K953033o576500M265061
3710.9E76380768M467354j2223359M514504M329872R18274J585655J853752J052857
$$ plain form
3654 471195793 476299133 482157288 478117409 481126022 486704330 488862305 491399765 493224106 496389313
3662.7 496389313 498499870 501694489 504878578 506908493 512237206 514933510 515940285 516903992
3670.4 516903992 513097382 517004280 524932022 533505745 532345924 518954659 523793678 531814957
3678.1 531814957 536171989 535336380 536693153 539405212 541733627 543770447 545990601 548441048
3685.8 548441048 553329353 559253578 549529572 547989845 556944542 552693939 552454300 557822838
3693.5 557822838 559477463 560959206 561356468 561761208 563390312 564165344 567721901 571323662 566945801
3702.2 566945801 565722237 570270309 571700401 571608315 572690277 575739174 578692207 572115707 576380768
3710.9 576380768 580848122 568624763 573139267 577469139 578387413 579973068 581826820 582879677
3718.6E82879677k882118J891021N292244l408050k543602M796486J026497o6491j947822
3727.3E85037842k43569L218956J107979M697457l242684n944977R718972K98996r575234
3736E85073738J292343K654801N96161K347030K869911l417129L856582J1238556j0592041
3744.7E95919952j2281761R520607N231896M511375n172005p593612J0446129o939660
3752.4E93642921n421218P116088M297944K322425m737663K252197M980927o778526
3760.1E97675095j439476L884849J489945O13021L080521l145561l880654L260804
3767.8F01538544M102211J27983p383385K743950L317261M46892N78575j247368O98814
3776.5F04923477K49596K674141J74331o952858K493859K576256J937599J300163l031692
$$ plain form
3718.6 582879677 579997559 581888580 587180824 583772774 581229172 586025658 587052155 586985664 585037842
3727.3 585037842 584794273 588013229 589121208 593818665 590575981 584631004 594349976 594648972 585073738
3736 585073738 586366081 589020882 589617043 591964073 594833984 591416855 595273437 606511993 595919952
3744.7 595919952 583638191 593158798 598390694 602902069 597730064 590136452 600582581 593642921
3752.4 593642921 588221703 595337791 599635735 601958160 597220497 599472694 604453621 597675095
3760.1 597675095 596235619 600120468 601610413 602223434 605303955 602158394 598277740 601538544
3767.8 601538544 605640755 605768738 598385353 601129303 604446564 604893456 605472031 604224663 604923477
3776.5 604923477 605173073 607847214 608021545 601068687 603562546 606138802 608076401 609376564 606344872
3785.2F06344872J87683R06601k11754J7051K34185N80101P2021M44069L0213J321640
3794.8F09926682J911506l838577j737480K743454M020729N728302p848320j1392632
3802.5E99513664L964195L984643N718727M883194r825821l433075M710846J781463
3810.2F11297836J94855J83373q8273J481171M839821k146416j1828232M745598M832344
3818.9F13512077L187027k43835j5496597K952423N524749K682953K423210j240921
3826.6F13301086l680839J118507K702637L148346J066627p540359K395134O148872
3834.3F18660011n816345P66373P134628r475021l208428P613945l962860q68263N399475
3843F16243515k586632l106956K614746Q23326k3804J499558o94275J642113L606262
$$ plain form
3785.2 606344872 606532555 607439156 607227402 607244453 607478638 608058739 608130760 608574829 608605042 609926682
3794.8 609926682 611838188 607999611 606262131 609005585 613026314 618754616 610906296 599513664
3802.5 599513664 603477859 607462502 613181229 618064423 608238602 604805527 609516373 611297836
3810.2 611297836 611492691 611676064 611587791 613068962 617908783 615762367 603934135 608679733 613512077
3818.9 613512077 616699104 616455269 600958672 603911095 609435844 612118797 614542007 613301086
3826.6 613301086 609620247 610738754 613441391 616589737 617656364 610116005 612511139 618660011
3834.3 618660011 612843666 613610039 620744667 611269646 608061218 615675163 611712303 610844040 616243515
3843 616243515 613656883 610549927 613164673 613987999 613964195 615463753 614769478 616411591 620017853
3851.7F20017853m921532M2343j4406166M163971R323540j949120j057548K218437
3859.4F13431778K146454K154655m637871K90452M489746o401253l974762M451675
3867.1F11950874M947930M587745q026008p506485M249534M988099J936683p986793
3874.8F09141579J507377M045143l7498J882858K708931o757622n465774O305923J899147
3883.5F15230064J330643K591667j1342163K793274L715286K69318L029098k505874
3891.2F15111313n876961K744560L101998j593666O37436P99560J197357P7133p252197
3899.9F08946533M859162L4751m158554M168740l222924n13992M76341J056519K190285
3908.6F13836861k44522l014l4332M92859m4098l15018N10406M87557l594513k624779
$$ plain form
3851.7 620017853 615096321 615138664 600732498 604896469 614220009 612270889 611213341 613431778
3859.4 613431778 615578232 617732887 613095016 613385468 617875214 611473961 607499199 611950874
3867.1 611950874 616898804 621486549 613460541 605954056 610203590 615191689 617128372 609141579
3874.8 609141579 610648956 614694099 614656601 616539459 619248390 612490768 607024994 613330917 615230064
3883.5 615230064 616560707 619152374 607810211 610603485 614318771 614588089 617617187 615111313
3891.2 615111313 609234352 611978912 615080910 613487244 614124680 614924240 616121597 616198730 608946533
3899.9 608946533 613805695 613840446 609681892 613850632 610627708 610113716 610590057 611646576 613836861
3908.6 613836861 613592339 613589325 613554993 614047852 614003754 613688736 614199142 614686699 611092186 608467407
3918.2F08467407M248810j2665k579841K318725J194992l3645k535324j848832J954804
3926.9F11174431J442604P44705q08487o11420J044884k229690j490136J269722M98620
3935.6F11035233N61409J99852p18918p85675K57988K010307N41763l194656p82929
3944.3F09124374J470757J479416M39567k526512l07960j07003j296272J686058n340
3953F09957085m92325N76019Q0910J98440o25572l7002k976P04041O20384r41658j92948
3963.6F09844398l91883l15132K11181O45180N25703r88121p33795N20325L06053L17955
3973.2F09941864R86977l5668p87620m50363j07308Q6975n9624J55678K93312J41678
3982.8F10165901m92210j9531L4942q03528k25601M7798O00853O13899l14559m90151
$$ plain form
3918.2 608467407 612716217 612703552 610123711 612442436 613637428 613603783 611068459 609219627 611174431
3926.9 611174431 612617035 613361740 612553253 611941833 612986717 610757027 609266891 610536613 611035233
3935.6 611035233 611596642 611796494 611077576 610291901 610549889 612560196 613101959 609907303 609124374
3944.3 609124374 610595131 612074547 612514114 609987602 609679642 609572639 608276367 609962425 609957085
3953 609957085 609464760 610040779 610121689 610320129 609694557 609657555 609654579 610358620 610979004 610037346 609844398
3963.6 609844398 609452515 609137383 609348564 609993744 610519447 609531326 608797531 609317856 609623909 609941864
3973.2 609941864 610928841 610893173 610105553 609655190 609547882 609634857 609575233 609730911 610024223 610165901
3982.8 610165901 609673691 609654160 609689102 608885574 608659973 608707771 609308624 609922523 609607964 609117813
3992.5F09117813L14217Q64982k12249o35720k73933J83945J70211N6534
4000.2F09585800
$$ plain form
3992.5 609117813 609432030 610297012 610084763 609449043 609175110 609359055 609529266 609585800
4000.2 609585800
##END=$$ End of the data block
