##TITLE=$$ Begin of the data block
##JCAMP-DX=5.00 $$ ACD/SpecManager v 10.08
##SPECTROMETER/DATA SYSTEM=Varian
##DATE=15 Jan 2013 10:11:36
##DATA TYPE=INFRARED SPECTRUM
##DATA CLASS=XYDATA
##ORIGIN=
##OWNER=
##NPOINTS=3735
##FIRSTX=399.26403809
##LASTX=4000.35498047
##MAXX=4000.35498047
##MINX=399.26403809
##MAXY=68.41098785
##MINY=14.27100658
##XFACTOR=1.0000000000
##YFACTOR=0.000000100000000
##FIRSTY=32.87853241
##DELTAX=0.96440572
##XUNITS=1/CM
##YUNITS=TRANSMITTANCE
##XYDATA=(X++(Y..Y))
399.3C28785324k957420r07402q7967l698654J875000l176060l819065p301140m763947
407.9C03948669M006272P381115l98770m290008j043186m327603J540165L306885M746723
416.6C14870262M853592N168114n162125j5884132N429077L640823K221127K437305
424.3C17574043n477752n53303J572151m77257m154033M12406O273919J684379m014702
433C12839851j563434K749767m894771j385575J614647k832966m077377p23991N103473
441.7C06829624j311455J627999L224296q17794p40395L45592M698277j79367l140164
450.4C10536613L96748N181274n73997n194492K2525j488227J828327k522774l556175
459.1C04629822K360382J511097j594734l131085k34051l316860j164932Q88958J558418
$$ y = [328785324, 325827904, 324920502, 324832535, 321133881, 323008881, 319832821, 316013756, 308712616, 303948669, 307954941, 315336056, 314937286, 310647278, 309604092, 305276489, 306816654, 310123539, 314870262, 319723854, 324891968, 319729843, 303845711, 309274788, 312915611, 315136738, 317574043, 312096291, 311542988, 313115139, 312637882, 308483849, 308896255, 315170174, 316854553, 312839851, 311276417, 314026184, 309131413, 307745838, 309360485, 306527519, 302450142, 301726151, 306829624, 305518169, 307146168, 310370464, 309552670, 308812275, 309157867, 313856144, 313676777, 310536613, 310933361, 316114635, 315540638, 310346146, 310368671, 308880444, 310708771, 308185997, 304629822, 306990204, 308501301, 306906567, 303775482, 303541431, 300224571, 299059639, 299948597, 301507015]
467.7C01507015J792984l928146j715889j690693j453781k198219j02921K708073J85127
476.4B95103550J288414L90892J53427j820946j955661L87706n42850p41768l052521
485.1B89210243j692829K090588L750839O63185m09126k138176l431702L113308J02635
493.8B91258965j525097J12590O10791J577472J68820J668529l295574m289513K408810
502.5B88695793m89712l005027r90925J141701J997795R83581l66516O53114J709347
511.1B90329151o59599l685227l190479p32918L84274M42028k461567R689J313629
519.8B81748981j312294M78859M17633L95604o40660j720009J264039M634k429447
528.5B78207340j276817Q42838Q27656O92368M56466n92441j070919j49022j11389
$$ y = [301507015, 303299999, 299371853, 297655964, 295965271, 294511490, 292313271, 292210350, 294918423, 295103550, 296391964, 296782856, 296936283, 295115337, 293159676, 293547382, 293004532, 292262764, 289210243, 287517414, 289608002, 293358841, 294022026, 293612900, 291474724, 288043022, 291156330, 291258965, 289733868, 289846458, 290457249, 292034721, 292203541, 293872070, 290576496, 286286983, 288695793, 288206081, 285201054, 284210129, 285351830, 287349625, 288333206, 287966690, 288619804, 290329151, 289669552, 285984325, 282793846, 282060928, 282445202, 282887230, 280425663, 280435352, 281748981, 280436687, 280915546, 281333179, 281728783, 281088123, 279368114, 280632153, 280636787, 278207340, 276930523, 277773361, 278601017, 279293385, 279749851, 279157410, 278086491, 277937469, 277826080]
537.2B77826080j146507J25732l81927o50291R33647N6705p95879o18801l37658m34265
546.8B74576836p04289j475067j604347o18515N56125Q08373n33333o34212j069031
555.5B69302540j100636j027527j919231j74732J357097l40271j519947Q21381J368122
564.2B66766796N32532r8667q69503O26697N26028j32542r784o56643p38793j33362
573.8B65812759n69152j005631Q25481J314049O40469o94790p2308L50075j548099
582.5B65052853l46051r8095j066703j58291J459865J391507J263752J302204j519337
591.2B67281704j424446l59116J12057Q61664j37558N83343P44763k37732m62761J566696
600.8B68528614J260681j104984q83408j415844j434173j413021j719895n46646R88617
$$ y = [277826080, 276679573, 276805305, 276423378, 275773087, 276706734, 276763439, 275967560, 275348759, 275011101, 274576836, 273872547, 272397480, 270793133, 270174618, 270730743, 271539116, 271005783, 270371571, 269302540, 268201904, 267174377, 265255146, 265080414, 266437511, 266097240, 264577293, 265398674, 266766796, 267299328, 267200661, 266331158, 266957855, 267483883, 267351341, 267341557, 266684914, 265946121, 265812759, 265243607, 264237976, 265063457, 266377506, 267017975, 266323185, 266250877, 266600952, 265052853, 264706802, 264608707, 263542004, 263383713, 264843578, 266235085, 267498837, 268801041, 267281704, 265857258, 265498142, 265610199, 266471863, 266334305, 266917648, 267662411, 267424679, 266961918, 268528614, 269789295, 268684311, 267800903, 266385059, 264950886, 263537865, 261817970, 261271324, 262259941]
609.5B62259941M36325o07414R31644L33043p16343j162568j371765j111908q55331
618.2B58135624N17425M37966J523151P95765j96419J487561J733303J500149J160907
626.9B67095432R98574o41079l16391K055473J783237J048794J147080J937828K160015
635.5B77268963J975002J231346J162129P32994m2629O68544j96018J121388K643241
644.2B86564960J567383J392594O51760j984M94995J836624N26963j044064L40996
652.9B92330227K89974J26934O29997Q50373P6408k08073O99139p12738j487045p33071
662.5B91862125j38149L16391k09694k48279p66793j138649M282456K079239L73764
671.2B96412411P88250P3394k66227P43561J168804J638889J08395K08053K082978
$$ y = [262259941, 262696266, 262088852, 263020496, 263353539, 262637196, 261474628, 260102863, 258990955, 258135624, 258653049, 259091015, 260614166, 261409931, 261213512, 262701073, 264434376, 265934525, 267095432, 268094006, 267452927, 267136536, 269192009, 270975246, 272024040, 273171120, 275108948, 277268963, 279243965, 280475311, 281637440, 282370434, 282327805, 282996349, 282800331, 283921719, 286564960, 288132343, 289524937, 290176697, 290174713, 290669708, 292506332, 293033295, 291989231, 292330227, 292620201, 292747135, 293377132, 294227505, 294303913, 294095840, 294794979, 294082241, 292595196, 291862125, 291723976, 292040367, 291830673, 291582394, 290815601, 289676952, 293959408, 296038647, 296412411, 297200661, 297274055, 297007828, 297751389, 298920193, 300559082, 300667477, 300875530, 302958508]
679.9C02958508K110576J446228O93855J729165J685085k25487J00708O67534M79412
688.6C11645584P98664J053963J967773K083454L85399o3591K9717k03476O06613R92870
698.2C19296970M42181k20795K73114J307048J518784J950149J994133J053162M2534
706.9C27657280o77185j93634Q73833N69534K63977R88502Q88558J022072J697921
715.6C33090858J689034J005096l99780m02336L96156K38419J81694L92227Q97484
724.3C37088852J431618K288017J894035L25051N71937J328163J290818M13971l9216
733C46593246R12247J173973K94533m6272M34074R88770J807289P88421m76150L30582
742.6C52800713L20358K76565L15400N17349J084251J093216J427574J000862Q74176
$$ y = [302958508, 305069084, 306515312, 307209167, 308938332, 310623417, 310397930, 310498638, 311166172, 311645584, 312444248, 313498211, 315465984, 317549438, 317934837, 317871246, 317900963, 317697487, 318304100, 319296970, 319739151, 319518356, 319791470, 321098518, 322617302, 324567451, 326561584, 327614746, 327657280, 326980095, 326786461, 327660294, 328229828, 328493805, 329482307, 330370865, 331392937, 333090858, 334779892, 335784988, 335385208, 334982872, 335379028, 335617447, 335799141, 336191368, 337088852, 338520470, 340808487, 342702522, 343027573, 343599510, 344927673, 346218491, 346632462, 346593246, 347505493, 348679466, 348973999, 348927727, 349361801, 350350571, 352157860, 352946281, 352470131, 352800713, 353121071, 353397636, 353713036, 354230385, 355314636, 356407852, 357835426, 358836288, 359710464]
751.3C59710464J572342Q94623j97983J57662P8239j47667J583786J949425J549416
760C67150307K062416J487465J167488J365165R54552J71471k03247Q8539J36757n3215
769.6C74327698M03671j13182o04172Q73985J784020O82831p54853m37278m47769o57120
779.2C75057831k03781k30522O60705P74193M67644O49910J179885J334076l7803n21622
788.9C79130516j45798O45066L81240l22341K40898J174164J028785l70827m67758
797.6C81293945j188049o50787R4413j911354k575225j850853r18694j335640j096420
806.2C69861336j058388j575279q18634j055985j187248k027321k175331j909447k181701
814.9C55872002j442147l94935M04091l82958j91269O45561J692048K598037J200104
$$ y = [359710464, 361282806, 362177429, 361979446, 362137108, 362215347, 362067680, 363651466, 365600891, 367150307, 369212723, 370700188, 371867676, 373232841, 374187393, 374358864, 374155617, 374244156, 374380913, 374327698, 374731369, 374618187, 374014015, 374888000, 376672020, 377354851, 376599998, 376162720, 375714951, 375057831, 374854050, 374623528, 375284233, 376058426, 376526070, 377175980, 378355865, 379689941, 379652138, 379130516, 378984718, 379629784, 380011024, 379688683, 379929581, 381103745, 382132530, 381761703, 381293945, 380105896, 379455109, 379549522, 377638168, 375062943, 373212090, 372293396, 370957756, 369861336, 368802948, 367227669, 366409035, 365353050, 364165802, 362138481, 359963150, 358053703, 355872002, 354429855, 354034920, 354439011, 354056053, 353864784, 354510345, 356202393, 358800430, 360000534]
823.6C60000534L37067O71119K812844L707428K605171K707748L366814M480095L928947
832.3C84617767L164635K236519K186890K841644J992721K144127J397248J846351
840D02427902K581177K363243K165337J673393K447052J328430M4937L30048J356430
848.7D16717949Q73451N18494J948280J825447J651650J699562K568397J491432P50618
857.4D30045280K164155J468429J128464R45091J395836J122742O78901K22130r422
866D39161606R30748j11466p73658j943436k278328k532768k227402r78699j419944
874.7D27826653o25649o62651r613n82962j331864p324q27255j486893j854591j112900
884.4D19324951r15031o01578l49197r35517j0910l60946o18859q01163m85420p86590
$$ y = [360000534, 360337601, 361008720, 363821564, 367528992, 370134163, 372841911, 376208725, 380688820, 384617767, 387782402, 390018921, 392205811, 395047455, 397040176, 399184303, 400581551, 402427902, 405009079, 407372322, 409537659, 411211052, 413658104, 414986534, 415031471, 415361519, 416717949, 417591400, 418109894, 420058174, 421883621, 423535271, 425234833, 427803230, 429294662, 430045280, 432209435, 433677864, 434806328, 435751419, 437147255, 438269997, 438948898, 439171028, 439161606, 440092354, 439980888, 439207230, 437263794, 434985466, 432452698, 430225296, 429246597, 427826653, 427201004, 426538353, 426528740, 425945778, 424613914, 424606590, 423779335, 422292442, 420437851, 419324951, 418409920, 417808342, 417459145, 416523628, 416512718, 416151772, 415532913, 414731750, 414246330, 413459740]
894D13459740j246109k82250j55182J7853n49011o8398m09393n59311m26636j094589
903.7D08686714P94983J114540K361260L471260K748947K187347J376610J929512P24373
912.3D25395546K51350l29399j105880j776047k492447j266098k131500k654725k725868
921D11164932k334137k627334l703156k764625k691727l171845m179878m142685l213539
929.7C82336006k348175k271919k944527k149582j342010j007195k161560j970367
937.4C66140671o79245j159744j551896j970749j744537k009125j389961p76062j422081
946.1C53437271o45485J8692L33557l47557p39441q92601j392784k76718m34914j337776
955.7C47722244j230583j593971k420273k539711k585831k392578j771812j965180
$$ y = [413459740, 412213631, 411931381, 411776199, 411794052, 411245041, 411176643, 410767250, 410207939, 409781303, 408686714, 409481697, 410596237, 412957497, 416428757, 419177704, 421365051, 422741661, 424671173, 425395546, 425646896, 425317497, 424211617, 422435570, 419943123, 418677025, 416545525, 413890800, 411164932, 408830795, 406203461, 402500305, 399735680, 397043953, 393872108, 389692230, 385549545, 382336006, 379987831, 377715912, 374771385, 372621803, 371279793, 370272598, 368111038, 366140671, 365461426, 364301682, 362749786, 360779037, 359034500, 357025375, 355635414, 354859352, 353437271, 352791786, 352810478, 353144035, 352796478, 352057037, 351164436, 349771652, 349494934, 349060020, 347722244, 346491661, 344897690, 342477417, 339937706, 337351875, 334959297, 333187485, 331222305]
963.4C31222305k288170k286148j838493j995926j975746j766300j719322p93953j739674
972.1C14818573l246822l596745l617172l294315l580437l866024m011784l846016
979.8B85759258l457870l731861m408455n352745n421887m341793m680195m772529
987.6B49591923m164105l751182k508507k687149k946148k473927k014236k124119
995.3B26922550k395706k624340l253956k557697k201653j737480j596012k002964
1003B08552742k302856k554894j740227j843910j737728j840229j440735j405411k198791
1011.7A91487961j712494j729069j043053j448211j679688j652202j510201j343345
1019.4A79369698k817021j594505j234913j764870k173576j751499n77088j394329
$$ y = [331222305, 328934135, 326647987, 324809494, 322813568, 320837822, 319071522, 317352200, 316558247, 314818573, 311571751, 307975006, 304357834, 301063519, 297483082, 293617058, 289605274, 285759258, 282301388, 278569527, 274161072, 268808327, 263386440, 259044647, 254364452, 249591923, 245427818, 241676636, 239168129, 236480980, 233534832, 231060905, 229046669, 226922550, 224526844, 221902504, 218648548, 216090851, 213889198, 212151718, 210555706, 208552742, 206249886, 203694992, 201954765, 200110855, 198373127, 196532898, 195092163, 193686752, 191487961, 189775467, 188046398, 187003345, 185555134, 183875446, 182223244, 180713043, 179369698, 176552677, 174958172, 173723259, 171958389, 169784813, 168033314, 167456226, 166061897]
1027.1A66061897n09739m38480r90963j613331j339435p84722l61080J052933K83966
1035.8A61361046J153412P95860P34653J701336J157513J628246J425038J473140o55250
1044.5A70774994j129494O8798j90181k43092j011772n00260o02569q77667j765346
1053.1A64523411j118069l86257j138916o65436j324634O24446P62387N71823J396408
1061.8A63245163Q11291J725750J388187J393814J044502J852417J022454K20642J159591
1070.5A73863811N10045J093502N2452J091041P67422o16207Q1711l53451Q81634O89430
1080.1A78061390J154766K40192l70502M44221L15381J614170J266365J799011Q20370
1088.8A85345364M24862Q23955P54337J800919N99480R24301O79703J316261J849708
$$ y = [166061897, 165552158, 165113678, 164122715, 162509384, 161169949, 160385227, 160024147, 161077080, 161361046, 162514458, 163310318, 164044971, 165746307, 166903820, 168532066, 169957104, 171430244, 170774994, 169645500, 169714298, 169524117, 169281025, 168269253, 167768993, 167166424, 166288757, 164523411, 163405342, 163019085, 161880169, 161214733, 159890099, 160514545, 161276932, 161848755, 163245163, 164056454, 165782204, 167170391, 168564205, 169608707, 171461124, 172483578, 172704220, 173863811, 174373856, 175467358, 175519810, 176610851, 177378273, 176762066, 176843777, 176490326, 177371960, 178061390, 179216156, 179456348, 179085846, 179530067, 179845448, 181459618, 182725983, 184524994, 185345364, 185770226, 186594181, 187348518, 189149437, 189748917, 190673218, 191352921, 192669182, 194518890]
1097.5A94518890R31645J067562P51743J791744Q16517O45829J096668O41594J284618
1106.2B03546810J081085J256142P08027M53281J17588K65179P25079N78346R07059
1114.9B09638596Q21399J615696R80664K86579O7596j73130j5926o12316R9563J17893
1124.5B12826614K75555N20248J104298K268028J490078R48201J123027J612873J747799
1133.2B23916721K015267J327915J044579K344894K728653K504768J383324J665516
1140.9B38931637J913109R81311P34749Q55389R44290J1406J87569P46002J46141k79160
1150.5B45172443K35711O20288J46065J64280n68218m12579O9008p84912r75342r40952
1160.2B42725792n93338k51408N51110Q99524R15566J208648J391335K178574K118644
$$ y = [194518890, 195450535, 196518097, 197269840, 199061584, 199878101, 200523930, 201620598, 202262192, 203546810, 204627895, 205884037, 206592064, 207045345, 207162933, 207428112, 208153191, 208731537, 209638596, 210459995, 212075691, 213056355, 213342934, 213410530, 213237400, 213221474, 212609158, 212708721, 212826614, 213102169, 213622417, 214726715, 216994743, 218484821, 219433022, 220556049, 222168922, 223916721, 225931988, 227259903, 228304482, 230649376, 233378029, 235882797, 237266121, 238931637, 240844746, 241826057, 242560806, 243416195, 244360485, 244371891, 244559460, 245305462, 245451603, 245172443, 245408154, 246028442, 246174507, 246338787, 245770569, 245357990, 245426998, 244642086, 243666744, 242725792, 242132454, 241881046, 242432156, 243331680, 244247246, 245455894, 246847229, 249025803, 251144447]
1168.9B51144447K394619K698250K974148L052673K943402L546638L350563L003426
1176.6B75108166K807789K804565K930851K788773K198677K285156K540989K203426
1184.3B95668392J979275K018776K081375J046944R19323J086139R41506L44333o77662
1193C05408401n58528o99425K1648J99299l53660m03443j175957j280937j506729j451836
1202.6B98198833j113147j664658j845951j296749n01728j80206p2709k18143l78380
1211.3B90927162n16853o69689n86930q46367n35717r79003j385632n17044l05405
1220B84584522j93462m52805n22175n50193q88462r56993j494751j206761o70891p30781
1229.6B76917248p47910p52277p27062l55683J89171j12514l96614p69272m30756L3684
$$ y = [251144447, 253539066, 256237316, 259211464, 262264137, 265207539, 268754177, 272104740, 275108166, 277915955, 280720520, 283651371, 286440144, 288638821, 290923977, 293464966, 295668392, 297647667, 299666443, 301747818, 302794762, 303714085, 304800224, 305741730, 306086063, 305408401, 304849873, 304150448, 304172096, 304371395, 304017735, 303614292, 302438335, 301157398, 299650669, 298198833, 297085686, 295421028, 293575077, 292278328, 291776600, 291596394, 291523685, 291305542, 290927162, 290410309, 289740620, 289153690, 288307323, 287771606, 286792603, 285406971, 284889927, 284584522, 284391060, 283938255, 283416080, 282865887, 281977425, 281020432, 279525681, 278318920, 277648029, 276917248, 276169338, 275417061, 274689999, 274334316, 274523487, 274410973, 274014359, 273245087, 272814331, 272848015]
1239.3B72848015n50327m09470j50929k4013j40743K69775L26004o36196n64690k32944
1248.9B70734482k25964o87923l47843j04866l27282K89554K50817L21388l1624k8992
1258.5B69841747J54763l71628j60866j373L15628M33216P46574R68094R63631J073627
1268.2B73963413Q11692Q16421R22241R92012M02909N88207R71660J093407J435242
1276.9B81997204J206474J583843J482582J228524J116047J031494J221065J511116
1284.6B92378349J693783J176796J593266J647205J383629J454792Q71906O72436R87434
1293.3C03859596R12075P85942R80397K14500L24955Q68244P83634P72534J54133K21882
1302.9C09877892K88620L14483N2986m77714m75922o53972n05925n96103o79913m12865
$$ y = [272848015, 272297688, 271888218, 271737289, 271713276, 271572533, 271842308, 272168312, 271532116, 270967426, 270734482, 270508518, 269820595, 269472752, 269367886, 269040604, 269330158, 269580975, 269902363, 269870739, 269841747, 269996510, 269624882, 269464016, 269462643, 269778271, 270211487, 270958061, 271926155, 272889786, 273963413, 274775105, 275591526, 276513767, 277505779, 277908688, 278496895, 279468555, 280561962, 281997204, 283203678, 284787521, 286270103, 287498627, 288614674, 289646168, 290867233, 292378349, 294072132, 295248928, 296842194, 298489399, 299873028, 301327820, 302199726, 302872162, 303859596, 304771671, 305557613, 306538010, 306752510, 307077465, 307945709, 308729343, 309501877, 309656010, 309877892, 310166512, 310480995, 310533981, 310056267, 309580345, 308926373, 308420448, 307824345, 307144432, 306731567]
1312.5C06731567m11186n54027k93389j67351j94664N86129O02264M26674N48000M25778
1322.2C07699795P22255P82700O31886L80573N65586M65126J64509k75841o41708n56202
1331.8C09938679q63705p03754p52278l61423J49269j18981K17038J32312N20192P23247
1341.5C08880596M81224M64230P52888R79309N89542Q46577M10175K88372K48375q0261
1351.1C13861027k28977l89634J10741p07188o85329j55010l33576j22090j23787k48451
1360.8C10977726n37434j86100o45332p5111J60846o66618q29144j068534l89023l47672
1370.4C06393604o5822K75688m5986k2774l07140M28733J64967k16618l13530L18680
1380.1C06609802K70348r40800r52511j661472r52549j28651q87165j936969j749630
$$ y = [306731567, 306320381, 305766354, 305472965, 305305614, 305110950, 305697079, 306299343, 306726017, 307274017, 307699795, 308422050, 309204750, 309836636, 310217209, 310782795, 311247921, 311412430, 311136589, 310494881, 309938679, 309074974, 308371220, 307618942, 307257519, 307406788, 307287807, 307504845, 307637157, 308157349, 308880596, 309361820, 309826050, 310578938, 311558247, 312147789, 312994366, 313404541, 313692913, 313941288, 313861027, 313632050, 313242416, 313353157, 312645969, 311960640, 311805630, 311472054, 311349964, 311226177, 310977726, 310440292, 310254192, 309608860, 309533749, 309694595, 309027977, 308198833, 307130299, 306741276, 306393604, 306327782, 306603470, 306557484, 306534710, 306227570, 306656303, 306821270, 306604652, 306291122, 306609802, 306880150, 305939350, 304986839, 303325367, 302372818, 302244167, 301357002, 299420033, 297670403]
1388.7B97670403j135312j896858j912403j530685j332112k437496l003406j113644
1396.4B83308487j296673j862030l748112k573833j327438j981411j658478j891861
1404.2B66968651k520943k250347j511974j499386j610260j275826j899776j487484
1411.9B52912655j272316j136627q26378j286850r12342r51729j99165j532288k16751
1420.6B44578209R89914J76563R75075k11315L42102L73554q8425J105042P72476J353703
1430.2B50366898M79297J392842J369457J333275K377967J450272J914749P15275K129688
1438.9B63529720J864357J731701K044888J404304K287312J697941K031498J250286
1446.6B77842007J711483J660881J033210J971322P63912K170429J685772J662598
$$ y = [297670403, 296535091, 294638233, 292725830, 291195145, 289863033, 287425537, 284422131, 283308487, 282011814, 280149784, 276401672, 273827839, 272500401, 270518990, 268860512, 266968651, 264447708, 262197361, 260685387, 259186001, 257575741, 256299915, 254400139, 252912655, 251640339, 250503712, 249677334, 248390484, 247478142, 246526413, 246327248, 244794960, 244578209, 245568123, 245744686, 246719761, 246508446, 246850548, 247224102, 247135677, 248240719, 249013195, 250366898, 250846195, 252239037, 253608494, 254941769, 257319736, 258770008, 260684757, 261400032, 263529720, 265394077, 267125778, 269170666, 270574970, 272862282, 274560223, 276591721, 277842007, 279553490, 281214371, 282247581, 284218903, 284982815, 287153244, 288839016, 290501614]
1454.3B90501614J305141K79293K555332J823788M568596J499462K545757K491646
1462C07570629J903744K334385j12152L403377K950459L066997K773590K901535L677826
1470.7C30470390K019959K579422K686920M941940L461914K254830L568763L105813
1478.4C55089951L062629K412300K339745J946526J741714J664505J075668R04618
1486.1C70237656K36702M84886J526947N41839n81741K09274M19236m65012p16896
1494.8C71892891r22890n000419n64843j310882k924538m21486q85925q37822o22406
1503.5C58401680L98865n14641m405365l213005M01573Q18405n96695L84026j454697
1512.2C50220146j306381J42670p96280m58069j102867j090584J74560O93055k116280
$$ y = [290501614, 291806755, 292086048, 294641380, 296465168, 301033764, 302533226, 305078983, 307570629, 309474373, 311808758, 311696606, 315099983, 318050442, 321117439, 323891029, 326792564, 330470390, 332490349, 335069771, 337756691, 342698631, 346160545, 348415375, 351984138, 355089951, 358152580, 360564880, 362904625, 364851151, 366592865, 368257370, 369333038, 370237656, 370474358, 370959244, 372486191, 373028030, 372446289, 372655563, 373074799, 372609787, 371892891, 370970001, 365969582, 365404739, 364093857, 361169319, 360747833, 359861908, 359024086, 358401680, 358800545, 358285904, 353880539, 350667534, 351069107, 351887512, 351290817, 351674843, 350220146, 348913765, 349056435, 348260155, 347802086, 346699219, 345608635, 345783195, 346476250, 344359970]
1520.8C44359970k483063J030426J001397J862258l72238M29268Q62961j93062J71089
1529.5C46669006K66724K94418j21345k23160j519508J279029Q87261J44157J089516
1538.2C48766098j84097l28751j378326p1030q31451P28340Q52394n61333J565476
1546.9C48557320L41835M95262j56746P0763J136779j80854J27754k392121R44786
1555.6C48944778J396218J61705j574974n918160K016716n7564N08233j335679j250610
1564.2C42890663k913971k852440j252517k344933m55475p121200k559204j800995
1572C21589928l311692k990474l573037k163448j1314716j833153l437939m222030
1579.7B88743439l936501n257034l664780n710830l001729m839191m462166m392071
$$ y = [344359970, 341876907, 342907333, 343908730, 345770988, 345398750, 345828018, 346690979, 346497917, 346669006, 346935730, 347230148, 347108803, 346885643, 345366135, 346645164, 347532425, 347676582, 348766098, 348582001, 348253250, 346874924, 346803894, 345972443, 346700783, 347553177, 346991844, 348557320, 348899155, 349394417, 349237671, 349308434, 350445213, 350264359, 350392113, 347999992, 348944778, 350340996, 350502701, 348927727, 343009567, 345026283, 344968719, 345476952, 344141273, 342890663, 339976692, 337124252, 335871735, 333526802, 333071327, 325950127, 323390923, 321589928, 318278236, 315287762, 311714725, 309551277, 298236561, 296403408, 292965469, 288743439, 284806938, 279549904, 275885124, 270174294, 267172565, 262333374, 257871208, 253479137]
1587.4B53479137m947319l485317o186333k888336m650516k766114l494110m110508
1595.1B20950584k256221m431038j806603m257755j824360l304405l095074j693058
1602.8A98282070l481006m48685k965012n50785k271175j064282j090183k298756M36879
1611.5A84549065k676468K70176j272354L77254m50401l755284K052727j295090J207619
1620.2A79007244j343861P18956l48663j301403J523190m29211K072906j716918J213626
1628.9A79395866P28646R65042J099472k78607K034207o63529K807961j767597J564941
1637.5A85886402J384144Q54359K297248l7269K324943K47097J880589J162624p10163
1646.2A95289974K732582p23743L861542L06034K461395J806660n33486K334080q37402
$$ y = [253479137, 248531818, 245046501, 238860168, 235971832, 231321316, 228555202, 225061092, 220950584, 218694363, 214263325, 212456722, 208198967, 206374607, 203070202, 199975128, 198282070, 194801064, 194352379, 191387367, 190836582, 188565407, 187501125, 186410942, 184112186, 184549065, 181872597, 182142773, 180870419, 181247673, 180797272, 177041988, 179094715, 177799625, 179007244, 177663383, 178382339, 178033676, 176732273, 178255463, 177826252, 179899158, 178182240, 179395866, 180124512, 181089554, 182189026, 181910419, 183944626, 183281097, 186089058, 184321461, 185886402, 187270546, 188124905, 190422153, 190384884, 192709827, 192956924, 194837513, 196000137, 195289974, 198022556, 197298813, 201160355, 201466389, 203927784, 205734444, 205200958, 207535038, 206697636]
1654.9B06697636M116459Q56876K306728J227436J866322K021332J391697L256282
1662.6B23740768N45922L305378J497593K809238K983723K174911K976570N36061M692154
1671.3B45262318K115039L666897L150063K717323L612805K865047M714165K649402
1679B70753059M363652L490162L957824M361229J341114P503643J761799N738259M144592
1687.7C07415333M491195N145627M017829M973793M344178N316009M894486N342140
1695.4C45940590L251648N645637O373291M725762M251709M169159P155227N162163
1703.1C86675186M655228L842735L301582L499718L634796M617577K882118K750282
1710.8D15859222L303376L092956L196221J308631J381150L034019K325745k732659
$$ y = [206697636, 210814095, 211670971, 213977699, 215205135, 217071457, 219092789, 220484486, 223740768, 224286690, 227592068, 229089661, 231898899, 234882622, 237057533, 240034103, 240570164, 245262318, 247377357, 251044254, 254194317, 256911640, 260524445, 263389492, 268103657, 270753059, 275116711, 278606873, 282564697, 286925926, 288267040, 295770683, 297532482, 303270741, 307415333, 311906528, 317052155, 321069984, 326043777, 330387955, 335703964, 340598450, 345940590, 349192238, 354837875, 361211166, 365936928, 370188637, 374357796, 381513023, 386675186, 391330414, 395173149, 398474731, 401974449, 405609245, 410226822, 413108940, 415859222, 419162598, 422255554, 425451775, 426760406, 428141556, 431175575, 433501320, 430768661]
1718.5D30768661L058434L603325K468109K433510J443596J186142J390419J615524
1726.3D47967720J355362J487732K420769L75785J047783L654900L449020n36804j908150
1734.9D59314117M731751L881645K264481K652969J079102M09736M853859M514542
1742.7D83702202K640686L096046M199601M476394L863220L823967L386460N534134
1750.4E14722710L490562K622223O230774M805107M669075M370461K338295L573494
1758.1E46822701M055213M190789M335098N57365J475373M472198K769280K519760
1765.8E71197777L272018K974777J27259K745552M269295J013298p23458p89451M665451
1774.5E88752518K988357K08397K870903J406212K263069J730080K67067J839218K091331
$$ y = [430768661, 433827095, 437430420, 439898529, 442332039, 443775635, 444961777, 446352196, 447967720, 449323082, 450810814, 453231583, 453607368, 454655151, 458310051, 461759071, 461222267, 459314117, 464045868, 467927513, 470191994, 472844963, 473924065, 474333801, 479187660, 483702202, 486342888, 489438934, 493638535, 498114929, 501978149, 505802116, 509188576, 514722710, 518213272, 520835495, 527066269, 531871376, 536540451, 540910912, 543249207, 546822701, 550877914, 555068703, 559403801, 559961166, 561436539, 565908737, 568678017, 571197777, 574469795, 577444572, 577571831, 580317383, 584586678, 585599976, 584876518, 584087067, 588752518, 591740875, 591949272, 594820175, 596226387, 598489456, 600219536, 600486603, 602325821, 604417152]
1783.2F04417152J835671K75459Q94013J812477J864853J496544K187538J710357J321678
1791.8F17815742j099205p27500M181747J636353L04679J769448K024803R69238o79855
1800.5F26195450K728920M30755P94907K255402J146507J543960P07589Q04367Q95843
1809.2F37503700J013718o90575J129418J945076O77414J667099M67681J024399M4480
1817.9F44782410O47812J606369K65579J094208k4491J926041K009201k203980J23215
1826.5F50226364K484284K595596N3711l133927O34919K395858L08457M91485J013184
1835.2F57069931Q08258R99069j22986J102524M45099Q23746P07779J120071O25839
1843.9F63579330n045089K399826K578506M52347K9373R10492J719132K05764O40870
$$ y = [604417152, 606252823, 606528282, 607422295, 609234772, 611099625, 612596169, 614783707, 616494064, 617815742, 616716537, 615989037, 620170784, 621807137, 622111816, 623881264, 625906067, 626875305, 626195450, 628924370, 629355125, 630150032, 632405434, 633551941, 635095901, 635803490, 636607857, 637503700, 638517418, 637826843, 638956261, 640901337, 641578751, 643245850, 643713531, 644737930, 644782410, 645430222, 647036591, 647302170, 648396378, 648371887, 650297928, 652307129, 650103149, 650226364, 652710648, 655306244, 655359955, 652226028, 652860947, 655256805, 655565262, 656056747, 657069931, 657878189, 658877258, 658754272, 659856796, 660301895, 661125641, 661833420, 662953491, 663579330, 658534241, 660934067, 663512573, 663964920, 663994293, 664904785, 666623917, 666829681, 667470551]
1852.6F67470551j29776L10211J58920l1128N92957p7820P86743K38037R90906O72760
1862.2F70982361L77350J68533j6479R36889m01764J045685j013031j402206J716461
1870.9F72393799J417312P59430k88238N68390j43738M53644M20379n7830K13241q01468
1880.6F74934921O64978M47617Q13064M90113L9825N59921q5907R30176l77502j312790
1890.2F77104416J78985Q08716J80054L84674N54810n39475J264877N02701K02942
1898.9F80642700j09558m01230M08402m33502L76052j96991L40348P54852K25372J30921
1908.5F81737366K7618M62799n25436L84903l64380J08032N55344J32141J061935k207489
1918.2F81372833j81198J539459P30210M68979r99222m16184j3733J09787k01339N07660
$$ y = [667470551, 667340775, 667650986, 667809906, 667778778, 668371735, 668293915, 669080658, 669318695, 670309601, 670982361, 671359711, 671528244, 671511765, 672448654, 672046890, 673092575, 672079544, 670677338, 672393799, 673811111, 674570541, 674282303, 674850693, 674706955, 675160599, 675580978, 675523148, 675736389, 674934921, 675599899, 676047516, 676860580, 677350693, 677390518, 677950439, 677864532, 678794708, 678417206, 677104416, 677283401, 678092117, 678272171, 678656845, 679211655, 678672180, 679937057, 680439758, 680642700, 680533142, 680131912, 680540314, 680106812, 680482864, 680285873, 680626221, 681381073, 681606445, 681737366, 681764984, 682227783, 681702347, 682087250, 681722870, 681830902, 682386246, 682518387, 683580322, 681372833, 681191635, 682731094, 683461304, 683930283, 682931061, 682514877, 682501144, 682610931, 682409592, 682917252]
1927.8F82917252J72042O9962M53873j64948M75464n60303j02997o9732j87988R6206
1937.5F83098831k76718K72827k19421J234360j72425j404419P14035L4790j01471
1946.1F83180389l25927N4931m54101j56708N2643q3237M53491m5929M22211k01569
1955.8F82896194J96457j41296n75790J47934l31269J11847l67660J8692k4338N5313
1965.4F81986084M90875m67605o6986K51998M60282l93295n76554n06744Q9950O68564
1975.1F81936569l02658J75705n6763L51105j25656o13251J72043j99585q9416p39899
1984.7F80508194j44959J68915J88980J53809k19727Q38700j7243j062317q07876J56555
1994.3F79763031J5717m18396k7543l18069K00195J26419L85437k18353n99060j22833
$$ y = [682917252, 683089294, 683159256, 683613129, 683448181, 683923645, 683363342, 683260345, 683190613, 683002625, 683098831, 682822113, 683094940, 682875519, 684109879, 683937454, 682533035, 683247070, 683281860, 683180389, 682854462, 682909393, 682455292, 682298584, 682351227, 682267990, 682721481, 682675552, 683097763, 682896194, 683092651, 682951355, 682375565, 682523499, 682192230, 682304077, 681936417, 681955109, 681930771, 681986084, 682476959, 682009354, 681942368, 682194366, 682654648, 682261353, 681684799, 681178055, 681268005, 681936569, 681633911, 681809616, 681752853, 682103958, 681978302, 681365051, 681537094, 681337509, 681248093, 680508194, 680363235, 680532150, 680721130, 680874939, 680655212, 681493912, 681476669, 680414352, 679606476, 679763031, 679778748, 679360352, 679332809, 679014740, 679214935, 679341354, 679726791, 679508438, 678909378, 678786545]
2004F78786545j68076P324p65762O7825p3394m37622P6828q0948l5858l70408L73917
2014.6F77380371r1705o16150r04007k69623J95160p38373K04773j27945j72958k50931
2024.2F74608612j82419J40229m94233P4768m76760l31498m76532m5776R9411n43365
2033.9F72372437J63955m55551J86997j92490m99039l59192m48913K72369o30417k59933
2043.5F70150223o22177n2109L46603m9514N88073m14810l70102n18951j6022o4163
2053.2F68977051o45371j64871j55334K61230l15323q8272k71606N6762J97907m90952
2062.8F67361221J79291l43246j07651l56369j83640o8130n7221O04477l66745p2860
2072.5F66589127n57938j23673M72413l22037l73840l81394J70975n67551j13220J80969
$$ y = [678786545, 678618469, 678625793, 677860031, 677927856, 677854462, 677416840, 677493668, 677412720, 677376862, 677006454, 677380371, 677288666, 676672516, 675768509, 675498886, 675694046, 674955673, 675160446, 675032501, 674859543, 674608612, 674426193, 674566422, 674072189, 674146957, 673670197, 673338699, 672862167, 672816391, 672915802, 672372437, 672536392, 672080841, 672267838, 672075348, 671576309, 671217117, 670768204, 671040573, 670410156, 670150223, 669528046, 669475937, 669822540, 669773026, 670361099, 669946289, 669576187, 669057236, 669041214, 668977051, 668331680, 668166809, 668011475, 668272705, 667957382, 667869110, 667597504, 667654266, 667852173, 667361221, 667540512, 667197266, 667089615, 666733246, 666549606, 666481476, 666424255, 667028732, 666661987, 666589127, 666031189, 665907516, 666379929, 666057892, 665684052, 665302658, 665473633, 664906082, 664792862, 664973831]
2082.1F64973831K1897Q0261m74091J22071k28348J4038k79465l14484l13491p21817
2091.7F62880402O3629k84729k0828l38669J06506K93655n04989j50376l16543K23465
2101.4F61951523m39148o91147k69623j93252l5782l39737p6218l76510J10778K0905
2111F59661789l22571n14603l39126J7471p33871J28402j84249o562L31040j10474
2120.7F57927246M25186l18832k36893l82309k67105k23007j53809J90583l32947J36871
2130.3F56764984n0049L04947J0224j96076P0648n46798r3689k10038J26954P2021
2140F56253128J9455J8616L5934M23889j18255J01089l70254j0910j42975o08673j06964
2150.6F55494080k27356M53720n4169K26212N01480L33481K51235m47769N2796j36566
$$ y = [664973831, 664995728, 665075989, 664601898, 664723969, 664495621, 664509659, 664230194, 663915710, 663602219, 662880402, 662944031, 662659302, 662638474, 662299805, 662406311, 662699966, 662194977, 662044601, 661728058, 661951523, 661512375, 660821228, 660551605, 660358353, 660322571, 659982834, 659906616, 659530106, 659640884, 659661789, 659339218, 658824615, 658485489, 658502960, 657769089, 657897491, 657713242, 657706680, 658037720, 657927246, 658352432, 658033600, 657796707, 657414398, 657147293, 656924286, 656770477, 656961060, 656628113, 656764984, 656714935, 657019882, 657030106, 656834030, 656904678, 656357880, 656264191, 656054153, 656181107, 656253128, 656272583, 656291199, 656327133, 656751022, 656632767, 656733856, 656363602, 656352692, 656209717, 655601044, 655494080, 655266724, 655720444, 655666275, 655892487, 656393967, 656727448, 656978683, 656530914, 656583710, 656447144]
2160.2F56447144J37329j81046j89972L2044l32489J94625N875O34003L06701J3276
2169.9F57067490Q6441j03226l9520m62418K78778K365J43433J31225J70746M99192
2179.5F57774506l78495P4082J63574L45154k31705l01208J05362k96021K92282J17111
2189.1F57664642M56238K46277K22626M6844j96228L39279l37066K01187j08643m43344
2198.8F58091812o9275M79508O80771k00654K63291m2420o0424j45493K93198M85000
2208.4F59775314l82843J44577k83584K49710L10745K44598L28904l40882J25275k91519
2218.1F59880295p8736l63693j67389J95237j6175M92325J36490L34320j35956m7073
2227.7F60229645j72043k58331J51443l32107M7988n01632P5149M79279R5978l662
$$ y = [656447144, 656584473, 656403427, 656213455, 656245499, 655913010, 656107635, 656113510, 656747513, 657054214, 657067490, 657153931, 657050705, 657011185, 656548767, 656827545, 656829910, 656973343, 657104568, 657275314, 657774506, 657396011, 657470093, 657633667, 657978821, 657747116, 657445908, 657551270, 657255249, 657547531, 657664642, 658120880, 658367157, 658589783, 658636627, 658440399, 658779678, 658442612, 658643799, 658535156, 658091812, 658022537, 658502045, 659182816, 658982162, 659245453, 659203033, 659142609, 658997116, 659290314, 659775314, 659392471, 659537048, 659253464, 659503174, 659813919, 660058517, 660387421, 660046539, 660171814, 659880295, 659801559, 659437866, 659270477, 659465714, 659449539, 659941864, 660078354, 660412674, 660276718, 660229645, 660057602, 659799271, 659950714, 659618607, 659666595, 659164963, 659240112, 659719391, 659815369, 659811707]
2237.4F59811707N1040M74472m61883J91269M6615k29416j51291l39813M42505m01611
2247F59433594J25961K76718J36566J99967j83716J42517n14603l0059L9978n417j81885
2257.6F59439621m56772P4844J56861N31616N0583J90735j87988k87705N6839m56848
2267.3F59111786j56479l14484P7057j9150L59192M71497R232r4910q88519J04675
2276.9F58659897J5640k80380K975M0894q0338n21545L63998J41907L52020j8386l25394
2287.5F58351288K24838m06036k26136l20434n9509m84314Q6288O07147q4686K50168
2297.2F57938614l57514M10996O0883o95572n37415n39780J85852j85089M57840K83890
2306.8F57022705J91574P8125J7166N80445o49872n04685o85577j74942l7689M3716
$$ y = [659811707, 659862747, 660337219, 659875336, 660066605, 660113220, 659883804, 659732513, 659392700, 659835205, 659433594, 659559555, 659836273, 659972839, 660172806, 659989090, 660131607, 659617004, 659586945, 659626923, 659621506, 659439621, 658982849, 659057693, 659214554, 659746170, 659796753, 659987488, 659799500, 659511795, 659568634, 659111786, 658955307, 658640823, 658717880, 658698730, 659057922, 659529419, 659538651, 659443741, 658555222, 658659897, 658675537, 658395157, 658398132, 658439026, 658358688, 657837143, 658201141, 658343048, 658695068, 658676682, 658351288, 658576126, 658170090, 657943954, 657623520, 657564011, 657079697, 657165985, 657773132, 657688446, 657938614, 657581100, 657992096, 658052979, 657357407, 656819992, 656280212, 656466064, 656280975, 656738815, 657022705, 657214279, 657292404, 657309570, 657890015, 657240143, 656735458, 656049881, 655874939, 655837250, 655880966]
2316.4F55880966O10962o61697K19345M89731O21566J52893p40585q79822n52826R75647
2326.1F56116180J94703K40325k08587k20032n38254q56628R70535k17743q06503p79190
2335.7F53894806k82440n27115j99204L64380j29471P90558k63366J53808q5602K67792
2345.4F53984146k43835k081757o78787N67093R08966o49185j22376Q87451R57260
2354.1F53528976Q88749j417618K01111j727372j116714Q43048j9836j48392o03409
2362.7F50428543J227951j013718j128234q74253L95279O44150j011658O86646l46070
2371.4F49008636j542053j975174l76587m6844l58582O69937o8359j63116r24683m24805
2381.1F43798370k70004q04062m87671j089325n83801m33044k57454j21269P4539L31421
$$ y = [655880966, 656491928, 655830231, 656049576, 656539307, 657160873, 657313766, 656573181, 655693359, 655140533, 656116180, 656310883, 656551208, 656342621, 656122589, 655584335, 654727707, 655698242, 655480499, 654673996, 653894806, 653612366, 653085251, 652886047, 653250427, 653120956, 653911514, 653648148, 653801956, 653716354, 653984146, 653740311, 651658554, 650979767, 651546860, 652455826, 651806641, 651684265, 652571716, 653528976, 654417725, 653000107, 653201218, 651473846, 650357132, 651200180, 651180344, 651031952, 650428543, 651656494, 650642776, 649514542, 648640289, 649035568, 649679718, 648668060, 649354706, 649008636, 647466583, 645491409, 645114822, 645067978, 644709396, 645379333, 645310974, 645147858, 644223175, 643798370, 643528366, 642724304, 642236633, 641147308, 640563507, 640130463, 639873009, 639751740, 639826279, 640157700]
2390.7F40157700k34681j73530o05240n57861r21555o08177R8572l42789j44310l42445
2400.3F36325684j06316j76811p2136l04604o41899n6267q28209j029624n39094P630
2410F32578354k01836j80359K25029m31900m32930m49028l5667l67508r21822m81834
2419.6F29300499l79334o35261p10068J8616j71127j9799j52435l52707l86200j078873
2429.3F25433311k27661m34951n56717o03638o95458N379k68135r5367n76935n50575
2438.9F21429253l61443m00810m81186q34694l80516r20296o12602q3847N875j33934
2448.6F17225800m41971k31781p03812m53567o83442q32176o82907l70178o3400m31519
2458.2F12331047P0648l92914l92952n68618q42095o92100j033249j82686o74706o69784
$$ y = [640157700, 639923019, 639749489, 639144249, 638586388, 637664833, 637056656, 637155228, 636812439, 636668129, 636325684, 636219368, 636042557, 635970421, 635665817, 635023918, 634967651, 634139442, 633109818, 632570724, 632578354, 632376518, 632196159, 632421188, 631989288, 631556358, 631107330, 631071663, 630704155, 629782333, 629300499, 628921165, 628285904, 627575836, 627594452, 627423325, 627403526, 627251091, 626898384, 626512184, 625433311, 625205650, 624770699, 624213982, 623610344, 622914886, 622920265, 622652130, 622556763, 621979828, 621429253, 621067810, 620667000, 620185814, 619351120, 618970604, 618050308, 617437706, 617353859, 617359734, 617225800, 616783829, 616552048, 615848236, 615394669, 614711227, 613879051, 613196144, 612825966, 612762566, 612331047, 612401695, 612008781, 611615829, 611047211, 610205116, 609513016, 608479767, 608297081, 607622375, 606952591]
2467.8F06952591k62795m76417j10283k60086k70729n50614o09474r94453p73125m70276
2477.5F02174339o12526l86848p87201m31976m58107n99022n54276k49786k28501p59010
2487.1E97107086n08499r64394o71272o90651n85975l53890o44455M807p19872o99730
2496.8E91273155o16035q06427o69518q83217l28598m06341j77345l38326m55284q39081
2506.4E85752983j037903l48358o05583m49677j033821o44226j62315o95839m60091
2515.1E80315170o30912m07715n95131l49999l79791m41132k09007p25784m72145j007920
2524.7E75095634q87641k44942k80037n18913o56929l29323m56314j74790n16014p43751
2534.4E70286980p04766o25763m94117p58934l81470o49338k93655l53966m10690j08910
$$ y = [606952591, 606689796, 606213379, 606103096, 605843010, 605572281, 605021667, 604412193, 603417740, 602644615, 602174339, 601561813, 601174965, 600387764, 599955788, 599497681, 598898659, 598344383, 598094597, 597866096, 597107086, 596598587, 595634193, 594962921, 594272270, 593686295, 593332405, 592687950, 592692757, 591972885, 591273155, 590657120, 589850693, 589181175, 588297958, 587969360, 587563019, 587385674, 587047348, 586592064, 585752983, 584715080, 584366722, 583761139, 583311462, 582277641, 581633415, 581471100, 580775261, 580315170, 579684258, 579276543, 578681412, 578331413, 577951622, 577510490, 577301483, 576575699, 576103554, 575095634, 574207993, 573963051, 573683014, 573164101, 572507172, 572177849, 571721535, 571546745, 571030731, 570286980, 569582214, 568956451, 568462334, 567703400, 567321930, 566672592, 566378937, 566024971, 565614281, 565505371]
2544E65505371p29904n08690j039658p45697k19307k85263j61933p16019n21851k91176
2553.7E60285873k95600r00879p11022k85339n60875m40598p37533m68483m51355m79088
2563.3E54955101n61256m36860m01687q86345l56636m65736m34571n38406l33748k64626
2573E50275230p97157k59666p15103l66707q3428n64575o63948o44951l65066j136208
2582.6E44678421p90901l98522l59802j37214k41471k04849p30743o01426q18176n61485
2592.2E39833832m31023p38754j59683l99361o42090q16460l68003l27568o38237o51322
2601.9E34661331j073456n52177o25649n63240l12461n01137l50113o44875p74917
2610.6E29263306n18303m85802r19838n83420m90799n92956l91388q01735p10487q38776
$$ y = [565505371, 564775467, 564266777, 563227119, 562481422, 562262115, 561976852, 561814919, 561098900, 560577049, 560285873, 559990273, 559089394, 558378372, 558093033, 557532158, 557091560, 556354027, 555885544, 555434189, 554955101, 554393845, 553956985, 553555298, 552668953, 552312317, 551846581, 551412010, 550873604, 550539856, 550275230, 549478073, 549218407, 548503304, 548136597, 548053169, 547488594, 546824646, 546179695, 545814629, 544678421, 543887520, 543488998, 543129196, 542991982, 542750511, 542545662, 541814919, 541213493, 540395317, 539833832, 539402809, 538664055, 538504372, 538105011, 537462921, 536646461, 536278458, 535950890, 535312653, 534661331, 533587875, 533035698, 532410049, 531846809, 531534348, 531033211, 530683098, 530038223, 529263306, 528745003, 528259201, 527339363, 526755943, 526265144, 525672188, 525280800, 524479065, 523768578, 522929802]
2620.2E22929802o84662n67474o06995m34112o73638m97284m43954m26522p62634q92143
2629.9E16940384p08313o44989m90799l76473l92074j149750p05032m82559o89431
2638.5E11300964l71437p82814n41992o46324n63355n34591p72591n22804p81555p12128
2648.2E05071373m92210l60833q68377p76520k72217l34778m37011j094552j013183
2656.9D99421692p47986k53944j77346n47866l65487l70559j14098o08749q25348p15065
2666.5D94695244n42565l21044o23513n00145m28276j297n33867q26454m68139m73938
2676.1D89976006m7951n30129n88112p22198p31964m49295l44696j63193p04041j79252
2685.8D85515175j82800m96102o85844r44252k42958k41394m36707r15756q18443k38953
$$ y = [522929802, 522245140, 521677666, 521070671, 520636559, 519962921, 519465637, 519021683, 518595161, 517832527, 516940384, 516232071, 515587082, 515096283, 514719810, 514327736, 513177986, 512472954, 511990395, 511300964, 510929527, 510146713, 509604721, 508958397, 508395042, 507860451, 507087860, 506565056, 505783501, 505071373, 504579163, 504218330, 503349953, 502573433, 502301216, 501966438, 501529427, 500434875, 499421692, 498673706, 498419762, 498242416, 497694550, 497329063, 496958504, 496844406, 496235657, 495410309, 494695244, 494152679, 493831635, 493208122, 492707977, 492279701, 492278404, 491744537, 490918083, 490449944, 489976006, 489928055, 489397926, 488809814, 488087616, 487355652, 486906357, 486561661, 486398468, 485694427, 485515175, 485332375, 484836273, 484150429, 483206177, 482963219, 482721825, 482285118, 481369362, 480550919, 480311966]
2695.4D80311966R5406k96593p99332K022m84505p40471m71916p29675n41191m28963
2705.1D75916748l90129n29518k75765n32646l69911k64854n88456k22892m80538l67851
2714.7D71894188n69611m55780k6626l44506l06625l05061k12937l87573m73099o99959
2724.4D68112411n67054j17646l21464p12738o87256J06278k54059l56369l75214n88722
2734D64238167K2049r8152P8582m65355o67915k84347j52283p3433p20215j96114n8822
2744.6D61622162j65482q8958n5657p1220p41082m41703l74031j94168l84713n65147
2754.3D58540001q1482r3575k5444p04994m51126r7580l76167m51622o46095j29128
2763.9D55482788j64566l90625m89387l39547m36897o18401k24761k23694k68975p05604
$$ y = [480311966, 480407372, 480110779, 479311447, 479313469, 478828964, 478088493, 477616577, 476886902, 476345711, 475916748, 475526619, 474997101, 474721336, 474188690, 473818779, 473553925, 472965469, 472742577, 472262039, 471894188, 471324577, 470868797, 470842171, 470497665, 470191040, 469885979, 469673042, 469285469, 468812370, 468112411, 467545357, 467427711, 467106247, 466393509, 465706253, 465812531, 465558472, 465202103, 464826889, 464238167, 464260216, 464162064, 464240646, 463775291, 463107376, 462823029, 462670746, 462597313, 461877098, 461680984, 461622162, 461456680, 461367722, 461312065, 461240845, 460499763, 460058060, 459684029, 459489861, 459105148, 458540001, 458458519, 458364944, 458339500, 457634506, 457183380, 457085800, 456709633, 456258011, 455611916, 455482788, 455318222, 454927597, 454438210, 454098663, 453661766, 453043365, 452818604, 452594910, 452325935, 451620331]
2773.5D51620331m73137k97012n85213n05142l63579k15378q19206o23894m58946n46265
2783.2D46732559n24368n11360k5254o61506q97827o21834l88222m59671n75561j56784
2792.8D41910172m27437o80161j079788q31261n11284o90727p38907p85560o30532
2801.5D35534515r09080m29878n83763r47571r01757j170654o50635o80694n24864
2810.2D28735619q99239j154404p93228r38682l88832n32151r43031q51288p83996
2818.9D21450768j406556j250610m19045p83576p79839j057091j093635j130753j111717
2827.6D12417946q53691j223870p11402p21322j016960j372757j445541j229935j213951
2836.2D02628517o63490j261978j640091j987419k193146j961289k314033j954460
$$ y = [451620331, 451147194, 450850182, 450264969, 449759827, 449396248, 449180870, 448361664, 447737770, 447278824, 446732559, 446208191, 445696831, 445671577, 445010071, 444112244, 443490410, 443102188, 442642517, 442066956, 441910172, 441482735, 440802574, 439722786, 438891525, 438380241, 437689514, 436950607, 436165047, 435534515, 434625435, 434195557, 433611794, 432664223, 431762466, 430591812, 429941177, 429260483, 428735619, 427836380, 426681976, 425888748, 424950066, 424561234, 424029083, 423086052, 422234764, 421450768, 420044212, 418793602, 418374557, 417590981, 416811142, 415754051, 414660416, 413529663, 412417946, 411564255, 410340385, 409628983, 408907661, 407890701, 406517944, 405072403, 403842468, 402628517, 401965027, 400703049, 399062958, 397075539, 394882393, 392921104, 390607071, 388652611]
2843.9C88652611j814499j882057k416649k718735k479210k107277j593628j831855
2851.7C71808701j314049o13594l86124q94928q77724j37863k22587J22070k8648j10016
2861.3C67345238k83890o05087n07317o89278p25936j169548j018334j110039r72252
2870C60263557l52439m38424m74929r14383o54755o62041p25441n28793q43468p07779
2879.6C53961105r35821r11598p09649m54559p90596j203499q54950j171379r37843
2888.3C45991211r43222j285858j226959j399727j099778q07762r42230j081963q33435
2897C36370277n56869m16832q49915r07783m34151p79648p76977p56417q80584q80623
2906.6C29130478q82340j064415j154174r47152j394577j278610j393852j420136j079807
$$ y = [388652611, 386838112, 384956055, 382539406, 379820671, 377341461, 375234184, 373640556, 371808701, 370494652, 369881058, 369494934, 368600006, 367722282, 367584419, 367361832, 367483902, 367455254, 367345238, 367061348, 366456261, 365948944, 365259666, 364533730, 363364182, 362345848, 361235809, 360263557, 359911118, 359472694, 358997765, 358083382, 357428627, 356766586, 356041145, 355512352, 354668884, 353961105, 353025284, 352113686, 351404037, 350949478, 350158882, 348955383, 348100433, 346929054, 345991211, 345047989, 343762131, 342535172, 341135445, 340035667, 339227905, 338285675, 337203712, 336370277, 335813408, 335396576, 334546661, 333638878, 333204727, 332425079, 331648102, 330891685, 330011101, 329130478, 328248138, 327183723, 326029549, 325082397, 323687820, 322409210, 321015358, 319595222, 318515415]
2915.3C18515415j335659j439915k003002j168823m22745j261959j474724r38415j76506
2924C08293667j77765l31535m50840O8111O43330K68230j36776j89743L15437M03634
2933.6C08705750O01272N23491N09987O24428L29666J078930R25445O51055J146755
2942.3C15096779Q00476K06203L17116R05075P25212N69020L50055K80266O40907N02797
2952C20393906K31399N05982P13615N1079M93812P82319N67169O81419L38173Q83827
2961.6C25642700O65245L07160P10869P34825P02133Q92677R87320M25530R72557J008377
2971.2C33049393L48587P91549Q66089M77677M4441M45251Q71048R55658Q61054L97987
2980.9C39108734L22647L25852L71208q1597j24168K33116L21694M28810K04315M41284
$$ y = [318515415, 317179756, 315739841, 313736839, 312568016, 312145271, 310883312, 309408588, 308470173, 308293667, 308115902, 307784367, 307333527, 307401638, 308044968, 308313198, 308176422, 307986679, 308302116, 308705750, 309307022, 309830513, 310340500, 310964928, 311294594, 312373524, 313298969, 313950024, 315096779, 315897255, 316103458, 316420574, 317325649, 318050861, 318619881, 318969936, 319250202, 319891109, 320393906, 320625305, 321131287, 321844902, 321895981, 322389793, 323172112, 323739281, 324420700, 324758873, 325642700, 326307945, 326615105, 327325974, 328060799, 328762932, 329655609, 330642929, 331068459, 332041016, 333049393, 333397980, 334189529, 335055618, 335533295, 335577736, 336022987, 336894035, 337849693, 338710747, 339108734, 339431381, 339757233, 340128441, 340046844, 339922676, 340155792, 340477486, 340906296, 341110611, 341551895]
2990.5C41551895N52178J59988m04701o50063k92511K3995k23198m39873M8752k33040
3000.2C40093422n34477n13535o49261l54004k47841m12254o51703m72603n25170p12699
3009.8C35019875p07322l73001l02314p37648k45476p65343o33049j33057j114959
3018.5C30007706q38623o39763q10356j022568o26259P4196m57573j072502j308098
3027.2C23306160m76952l07808q18367p80830r70821q88214o65627n52883j022930
3035.9C16821728j282254q73413k35691k37446p15351n45883o13651q42133j167488
3044.5C10308418j113357j021767o86779l35522j017971r74769j046715p09381l79391
3053.2C03022766q39805q71563j038762o00891q10089q24604l08838m12101m81110
$$ y = [341551895, 342104073, 342264061, 341859360, 341209297, 340916786, 340940781, 340717583, 340277710, 340326462, 340093422, 339558945, 339045410, 338396149, 338042145, 337794304, 337382050, 336730347, 336257744, 335732574, 335019875, 334312553, 333939552, 333637238, 332899590, 332654114, 331888771, 331255722, 331122665, 330007706, 329169083, 328529320, 327718964, 326696396, 326070137, 326144333, 325686760, 324614258, 323306160, 322829208, 322521400, 321703033, 320922203, 319951382, 319063168, 318397541, 317844658, 316821728, 315539474, 314666061, 314430370, 314192924, 313477573, 312931690, 312318039, 311475906, 310308418, 309195061, 308173294, 307486515, 307150993, 306133022, 305158253, 304111538, 303402157, 303022766, 302182961, 301311398, 300272636, 299671745, 298861656, 298037052, 297728214, 297316113, 296835003]
3061.9B96835003q20179r51099j235962n33352l30811j128826p53994o18153p35797
3070.6B89726830p88918n28698o69765o19908j51806o60476p68261m39892n10330j164303
3080.2B83424473q65441m40387q14038o24504o80656n92480p71046p73468o10332o48174
3089.9B76603947l70179o31084n02777n01251n62229n35794q11844j018123q74176
3098.5B70796490j06907m21124q37364p27177n98411p28188q94756m22268o68316m71267
3108.2B64920712m63105o41098m85706j197414r38340n44014o67991p54128o99806
3116.9B58529110n5294R174r55295j361981p29580m22535m74434j060810j004181m00180
3126.5B52073994o33679m83856n96657q59642j006012r93061o63605m58469l56579
$$ y = [296835003, 296014824, 295063725, 293827763, 293294411, 292963600, 291834774, 291080780, 290462627, 289726830, 288937912, 288409214, 287739449, 287119541, 286967735, 286307259, 285538998, 285099106, 284588776, 283424473, 282559032, 282118645, 281304607, 280680103, 279999447, 279406967, 278635921, 277862453, 277252121, 276603947, 276233768, 275602684, 275099907, 274598656, 274036427, 273500633, 272688789, 271670666, 270796490, 270689583, 270268459, 269431095, 268703918, 268105507, 267377319, 266482563, 266060295, 265391979, 264920712, 264457607, 263816509, 263330803, 262133389, 261195049, 260651035, 259983044, 259228916, 258529110, 258473816, 258482990, 257527695, 256165714, 255436134, 255013599, 254539165, 253478355, 252474174, 252073994, 251440315, 250956459, 250359802, 249500160, 248494148, 247501087, 246837482, 246379013, 246022434]
3135.2B46022434q91685r91974o09760k59228n10578q80814n12581n45597o53267q01811
3144.8B39365139n62286o34079q73032o34479p04251k38609o04420j057072p63511
3153.5B33293400n18933l23944q23383j114235j101761l18718k50053j064224p94602
3162.2B26983547o48594o23703n75123n12924o55803o50692m91677q10566q85944r06391
3171.8B20222130n34954m23489l47538j16730o87446j248856j047478n4855j60465
3180.5B15600319o74381p37954q40721n35926n81437n10902l06702j63917q00858j449184
3190.1B08998337p20101m97684o03981p85542n89008Q8539j22890l65239o24904p43294
3199.8B04034233k44350l66803j171188q48694m0817m50439p15313o92158j200676
$$ y = [246022434, 245130749, 244138775, 243529015, 243269787, 242759209, 241878395, 241365814, 240820217, 240166950, 239365139, 238802853, 238168774, 237295742, 236661263, 235957012, 235718403, 235113983, 234056911, 233293400, 232774467, 232450523, 231627140, 230512905, 229411144, 229092426, 228842373, 227778149, 226983547, 226334953, 225711250, 225136127, 224623203, 223967400, 223316708, 222825031, 222014465, 221128521, 220222130, 219687176, 219263687, 218916149, 218799419, 218111973, 216863117, 215815639, 215760784, 215600319, 214925938, 214187984, 213347263, 212811337, 212229900, 211718998, 211412296, 211248379, 210447521, 208998337, 208278236, 207780552, 207176571, 206391029, 205802021, 205890560, 205767670, 205402431, 204777527, 204034233, 203789883, 203423080, 202251892, 201403198, 201362381, 200911942, 200196629, 199504471, 198303795]
3208.5A98303795j039925m64020l37657K40173K11792o23856o23054o96469o09169
3217.2A94361610m2591m68635j292496j079235n39112j92299P076j86271j89286n72490
3226.8A89806271r47285p69100o00720J3581J08261n26753j007767o85977j90888p5893
3236.4A85123730j33305p03049m89158l43342o27003m14085l26862m3049l45421o60172
3246.1A81038284n08518o12144n79338n23015l54480k45247k47498l73974k95581k69623
3255.7A77028866n14984m54159k02465l758m67834n23491j76868k49043l57571q07495
3265.4A73271198n46474j18637j57109m0626j3409p5264m09584o94523p58190j64051
3275A70293331J21193k68154k50168m40254k29721J5755l58334n36118l91788k00462
$$ y = [198303795, 197263870, 196799850, 196462193, 196702366, 196914158, 196290302, 195667248, 194970779, 194361610, 194319019, 193850384, 192557888, 191478653, 190939541, 190747242, 190754318, 190568047, 190378761, 189806271, 188858986, 188089886, 187489166, 187502747, 187611008, 187084255, 186076488, 185390511, 185199623, 185123730, 184990425, 184287376, 183798218, 183454876, 182827873, 182413788, 182086926, 182043877, 181698456, 181038284, 180529766, 179917622, 179338284, 178815269, 178460789, 178215542, 177968044, 177594070, 177298489, 177028866, 176513882, 176059723, 175857258, 175853500, 175385666, 174862175, 174685307, 174436264, 174078693, 173271198, 172724724, 172606087, 172448978, 172408352, 172394943, 172319679, 171910095, 171215572, 170457382, 170293331, 170414524, 170146370, 169896202, 169455948, 169226227, 169241982, 168883648, 168347530, 167955742, 167755280]
3284.7A67755280n31140k78339P7724l13740l92589m1504M15802k12250o44226j05533
3294.3A65729485j58482j92814l18680k99740l19328n46112k99377k57683j36872n65757
3303.9A62634640n51148L20034R9335j34220m70524o64997k60811m3411J49612l27224
3313.6A60751286n87273l06654k35806l10554k10390k08416q17862o04763O7349P7734
3323.2A57614651k83594m96884l55501n92508n73731n37061n84555r2325l86811o54373
3332.9A53057308M2343M5538l75967m35991m95005k56242m78249o33879j10178k11296
3342.5A50148382l28092j13583r3899l32098o01444o75659m86918j49488j10598r966
3352.2A47246637k42147j49517J12820m44994m64955j69210M57449N10711l29456m59414
$$ y = [167755280, 167224140, 166945801, 167023525, 166709785, 166317196, 166275692, 166691494, 166479244, 165835018, 165729485, 165571003, 165378189, 165059509, 164759769, 164440441, 163894329, 163594952, 163337269, 163200397, 162634640, 162083492, 162403526, 162502861, 162368641, 161898117, 161233120, 160972309, 160928898, 161078510, 160751286, 160164013, 159857359, 159621553, 159310999, 159100609, 158892193, 158074331, 157469568, 157536917, 157614651, 157331057, 156834173, 156478672, 155886164, 155312433, 154775372, 154190817, 154098492, 153711681, 153057308, 153099651, 153145189, 152769222, 152333231, 151838226, 151581984, 151103735, 150469856, 150359678, 150148382, 149820290, 149706707, 149612808, 149280710, 148679266, 148003607, 147516689, 147367201, 147256603, 147246637, 147004490, 146854973, 146967793, 146522799, 146057844, 145888634, 146346083, 146856794, 146527338, 146067924]
3361.8A46067924n51404m16613k1334L9644j43270j5945K1686p6618J66750k59371
3371.4A44811449k17533j32399m83722k14444m3363K39725R1114r6779L8281r9116
3381.1A43893213j79577k21519j40410O4469L65877j04666l08265n4055m0064M53043
3390.7A43728046q4819l99695R8467k39220k73723J09243K11458J14527K14262j93825
3400.4A43284721j78632R2992m89015P1888M83885J73769J06029m03309r985P17564
3410A43849907L84941Q4076n083l44429j04675L66277L42160K32400J11170J91918
3419.7A45108662Q9025l4189J77936J43462J16682R9182L8786J29061J33800L23372
3429.3A46325779P62663M22697N0154K90355N0431N6457L26367M53758J32570l99580
$$ y = [146067924, 145516520, 145099907, 145078573, 145118217, 144974947, 144959002, 144980688, 144904070, 145070820, 144811449, 144593916, 144461517, 143977795, 143763351, 143719988, 143959713, 144050827, 143954048, 143992329, 143893213, 143713636, 143492117, 143351707, 143416176, 143782053, 143677387, 143369122, 143315067, 143275003, 143728046, 143643227, 143243532, 143341999, 143102779, 142829056, 142938299, 143149757, 143264284, 143478546, 143284721, 143106089, 143199081, 142710066, 142781954, 143265839, 143439608, 143545637, 143142328, 143132343, 143849907, 144234848, 144318924, 144313841, 143969412, 143864737, 144231014, 144573174, 144805574, 144916744, 145108662, 145197687, 145163498, 145341434, 145484896, 145601578, 145700760, 145739546, 145868607, 146002407, 146325779, 147088442, 147511139, 147561293, 147851648, 147902079, 147958536, 148284903, 148738661, 148871231, 148471651]
3439A48471651J20535N93119O20041L47271P4663L29599M68483O79827L49579J56679
3448.6A52211447M19693M98476O62412M31939M44650L60451M03728O24485P0591J24493
3458.2A56252365M78926M78372J73159Q2960Q97675R78317L82442L08514L88908K16752
3467.9A60638390L65943O31962M30985L57895N85155P66278N06553K85759L59001M52252
3477.5A65380173Q57105P96833O49776R68476P01580O45199P91835Q8425J10512O10371
3487.2A71600285M40692N37396N16205P91683J085072Q51612P71560N29919O45599
3495.8A77770023O22731O38218J055851O22653M09928P93114N36365J58711N11302
3504.5A83118896J030999J085987R08966J214828O32801k25086O20232P54127J073532
$$ y = [148471651, 148592186, 149185305, 149805346, 150152617, 150227280, 150556879, 151025362, 151705189, 152054768, 152211447, 152631140, 153129616, 153792028, 154223967, 154668617, 155029068, 155432796, 156057281, 156127872, 156252365, 156731291, 157209663, 157382822, 157465782, 158363457, 159341774, 159724216, 160032730, 160421638, 160638390, 161004333, 161636295, 162067280, 162425175, 163010330, 163776608, 164283161, 164568920, 164927921, 165380173, 166237278, 167034111, 167683887, 168652363, 169353943, 169999142, 170790977, 170879402, 170989914, 171600285, 172040977, 172578373, 173094578, 173886261, 174971333, 175822945, 176594505, 177124424, 177770023, 178392754, 179030972, 180086823, 180709476, 181119404, 181912518, 182448883, 182607594, 183118896, 184149895, 185235882, 186144848, 187359676, 187992477, 187767391, 188387623, 189141750, 190215282]
3513.2A90215282J569367J165295N34820J61438P16877N05238R02519J691131J172371
3521.9A98634338N60494K8190J026364J331577R24149J011123R01013J075325O58645
3530.6B06151218P27330J206093J185207Q76961J245880J169090J42593J090947J453323
3539.2B15248642J005630J270314J268177Q53443J069012J276702J056843J706124
3547B24754887J094989J458798J494617J124211J521511M41513J571159J425991J615353
3555.6B36503029K174454N90133R72939J053486J876926K045403J747589J420555Q30879
3564.3B49215393K523537J225414J536694J444511P26223K617912J767311J488591
3572B62545586J132984J531296J511077J631203K030506J288719K747727K013836J488991
$$ y = [190215282, 191784649, 192949944, 193484764, 193646202, 194363079, 194868317, 195770836, 197461967, 198634338, 199194832, 199223022, 200249386, 201580963, 202505112, 203516235, 204417248, 205492573, 206151218, 206878548, 208084641, 209269848, 210146809, 211392689, 212561779, 212704372, 213795319, 215248642, 216254272, 217524586, 218792763, 219646206, 220715218, 221991920, 223048763, 224754887, 225849876, 227308674, 228803291, 229927502, 231449013, 231890526, 233461685, 234887676, 236503029, 238677483, 239267616, 240240555, 241294041, 243170967, 245216370, 246963959, 248384514, 249215393, 251738930, 252964344, 254501038, 255945549, 256671772, 259289684, 261056995, 262545586, 263678570, 265209866, 266720943, 268352146, 270382652, 271671371, 274419098, 276432934, 277921925]
3580.7B77921925K133712K169629J979351J523799L285485J323833M08707K392521
3588.4B93138962J196422L365078K804337K109108J242123J337528K823410J021786
3596.1C09038754K808895K978229J809807L281879J477547J583519K775574J996498
3603.9C27750702K774811L213539K258987R18427L751869K721100J338653N127259
3611.6C49855347J442947K57607L717956J676331N140533M337731J724281L101806
3619.3C71254539J215096K276497L399429L341103L131828L429031K919808L069992
3627C94037323N616798J512871k767029M821167N364838M834442K539406J501274L242264
3635.7D20703354M173317L978615K173233K481231L865090L920135K658043K262840
$$ y = [277921925, 280055637, 282225266, 284204617, 285728416, 289013901, 290337734, 290746441, 293138962, 294335384, 297700462, 300504799, 302613907, 303856030, 305193558, 308016968, 309038754, 311847649, 314825878, 316635685, 319917564, 321395111, 322978630, 325754204, 327750702, 330525513, 333739052, 335998039, 336916466, 340668335, 343389435, 344728088, 349855347, 351298294, 351555901, 355273857, 356950188, 362090721, 366428452, 368152733, 371254539, 372469635, 374746132, 378145561, 381486664, 384618492, 388047523, 390967331, 394037323, 399654121, 401166992, 398399963, 403221130, 408585968, 413420410, 415959816, 417461090, 420703354, 424876671, 428855286, 431028519, 433509750, 437374840, 441294975, 443953018, 446215858]
3643.4D46215858L838501N002823N858803P30171K64664P545128K989998p53899J16425
3652.1D71808472N297317N500527M488830M649620l776397M287757O130219K449722
3659.8E00836067L201180J709175K766418K500992L224907L201599K409592M922333
3667.5E24772263J638183J733322J726036m194564M306907P453423P586365k165375
3675.2E42856560j2745972N455628Q821754N515671m27475J473694K403640K252617
3682.9E55606117J717415J010552J991577M769592O417236q571281k055283Q188362
3690.6E69074287l352089R20258M663849J153374K061386O07147q774K229958J128807
3699.3E78478203K744064K994576n368462m50058N210495J601868N70755O88209K632561
$$ y = [446215858, 450054359, 455057182, 460915985, 461646156, 461910820, 469455948, 472445946, 471692047, 471808472, 477105789, 482606316, 487095146, 491744766, 487968369, 492256126, 498386345, 500836067, 504037247, 505746422, 508512840, 511013832, 514238739, 517440338, 519849930, 524772263, 526410446, 528143768, 529869804, 525675240, 529982147, 537435570, 545021935, 542856560, 530110588, 535566216, 544387970, 549903641, 549476166, 550949860, 553353500, 555606117, 557323532, 558334084, 560325661, 565095253, 571512489, 562941208, 560885925, 569074287, 565722198, 566642456, 571306305, 572459679, 574521065, 575128212, 575119438, 577349396, 578478203, 581222267, 584216843, 578848381, 578398323, 583608818, 585210686, 585781441, 586469650, 589102211]
3708E89102211K405434o291809N337715M075088j2413711N120010N046768N35469J089974
3716.7E94007149K119293J272888l298988Q68950N023918l235741k104454N156174
3724.4E99809189J302833O8322k683869k17590L502350J160354M637566k875671n462075
3733.1E99241409R277344P74002r974747L65944L482476R40666J875763K875099k774773
3741.8F06083183L552285R903831j2549019j1012993R927330N797310N092850n387230
3749.5F11407547p851639R872360o878013m809494P105713M507484K191658m259262
3757.2F11286354L426094M595451q152694p52068L873253J361122J160202L258972
3764.9F20056686k959900m070472L246727M127121p8583p744522K523041L674850j08833
$$ y = [589102211, 591507645, 585215836, 590553551, 594628639, 582214928, 587334938, 592381706, 592917175, 594007149, 596126442, 597399330, 594100342, 594969292, 599993210, 596757469, 594653015, 599809189, 601112022, 601180344, 598496475, 598278885, 601781235, 602941589, 607579155, 604703484, 599241409, 608518753, 609292755, 599318008, 599683952, 603166428, 604107094, 605982857, 608857956, 606083183, 609635468, 619539299, 606990280, 595977287, 605904617, 611701927, 616794777, 611407547, 603555908, 613428268, 606550255, 601740761, 608846474, 613353958, 615545616, 611286354, 614712448, 619307899, 611155205, 610403137, 614276390, 615637512, 616797714, 620056686, 617096786, 613026314, 616273041, 620400162, 620321579, 612577057, 615100098, 618774948, 618666115]
3773.6F18666115K65350n23529Q54912L62930K218895k89917n941162K685738K063789
3782.3F20363121J498604J653480k496109l55110O30455N08805N82962k84577Q2245
3790.9F22183876N99175P29866o10085R57756K729073l081894l434105J601410M032783
3799.6F25707855N429726q495369r164658N765496L444976M696312M309311j0016098
3807.3F21677551k758026M805298J964989O70776K22130p31239P52296M891472j008759
3816F30486488j1907501L941536N030937L910065Q52089j5708008K540550N951424
3823.7F25097580K373962K181244j707611m632644J109237K912789L013534J75476
3831.4F30523567p333946L086815O840629n092353n47944N957222r623870k098313
$$ y = [618666115, 618931465, 618407936, 619262848, 619625778, 621844673, 621554756, 615613594, 618299332, 620363121, 621861725, 623515205, 621019096, 620663986, 621294441, 621803246, 622386208, 622101631, 622183876, 622783051, 623512917, 622902832, 623860588, 626589661, 623507767, 620073662, 621675072, 625707855, 631137581, 622642212, 613477554, 619243050, 622688026, 627384338, 631693649, 621677551, 618919525, 623724823, 625689812, 626360588, 626582718, 625851479, 626603775, 631495247, 630486488, 618578987, 622520523, 627551460, 631461525, 632313614, 616605606, 619146156, 625097580, 627471542, 629652786, 627945175, 623312531, 624421768, 627334557, 630348091, 630523567, 623189621, 626276436, 633117065, 628024712, 627476768, 633433990, 623810120, 621711807]
3839.2F21711807P398262m248848J95313N232658k768707k738113K865524J543770
3846.9F29191666k25869R89495k97089J645165L487968m124870K458572j3292999M13093
3855.6F20245132Q665696r29108j664581J577072K416305K481156m702149M6921M856606
3864.2F32993050n369301m669380L495178M688301M223289q622398p140350N301933
3871.9F24900322O002922K540588q012237L12004L379517m5968J668473K699051n774422
3880.6F27670250n032501N149841P20940J427269L849640j1053162J436882L789673
3888.3F27958832Q48465L428306j781463o116944J639252K431603j034089J165314
3896.1F28539276J322250J813241L34320q086892L944779Q92906l957863L685723l708687
$$ y = [621711807, 629110069, 624861221, 625056534, 630289192, 627520485, 624782372, 627647896, 629191666, 628965797, 629955292, 629658203, 631303368, 634791336, 630666466, 633125038, 619832039, 620245132, 628910828, 627981720, 626317139, 627894211, 630310516, 632791672, 628089523, 628136444, 632993050, 627623749, 622954369, 626449547, 631137848, 635361137, 626738739, 619598389, 624900322, 630903244, 633443832, 625431595, 625743599, 629123116, 629077148, 630745621, 633444672, 627670250, 622637749, 627787590, 628508530, 629935799, 633785439, 622732277, 624169159, 627958832, 628807297, 632235603, 630454140, 624337196, 625976448, 628408051, 627373962, 628539276, 629861526, 631674767, 632009087, 623922195, 627866974, 628759880, 624802017, 628487740, 624779053]
3904.7F24779053r52187J711235J171951J745568j57814L0632m08478m17938o8207
3913.4F27433815l548J094132J093674l931427k407151L950768m70314k616654K250557
3922.1F26393852J844826N12886k425537k004738J784210J534882N28488j336288q43506
3930.8F25989075J203499j935692j430397R78775N52826R62181L6583p01981l37372
3939.5F25317497Q3237J978645J327515l090019j622200R24339J635971R81827k244263
3948.1F25292549j10512k91671j685639J475907j74675l22915L26996K07672Q57735
3956.8F25575447q62846m44031m5700N28564K11449r52072J19400L19710Q9607m99230
3966.5F24040298N37377P22580j029701o50139N66597K94151n70564M94461L47519
$$ y = [624779053, 623826866, 625538101, 626710052, 628455620, 628297806, 628328438, 627919960, 627502022, 627433815, 627430267, 628524399, 629618073, 625686646, 623279495, 627230263, 626759949, 624143295, 626393852, 628238678, 628751564, 626326027, 624321289, 626105499, 627640381, 628168869, 626832581, 625989075, 627192574, 625256882, 623826485, 624805260, 625358086, 626320267, 626356850, 625654869, 625317497, 625400734, 627379379, 628706894, 625616875, 623994675, 624919014, 626554985, 627536812, 625292549, 625182037, 624890366, 623204727, 624680634, 624505959, 624183044, 624510040, 624717712, 625575447, 624712601, 624268570, 624222870, 624751434, 624962883, 624010811, 624130211, 624449921, 624539528, 624040298, 624577675, 625300255, 624270554, 623620415, 624187012, 624481163, 623910599, 624405060, 624752579]
3975.1F24752579n37567l38936J1787k0294m08440M03519J42746K06680K46697l11737
3984.8F24147034M9858k05841k5521L34855J063346K84272j020737n60913L8147N09033
3994.4F24613533k76108j9951m1580m03709N65796N90858
4000.2F25028839
$$ y = [624752579, 624215012, 623876076, 623887863, 623867569, 623459129, 623862648, 624005394, 624212074, 624458771, 624147034, 624196892, 623991051, 623965530, 624300385, 625363731, 625648003, 624627266, 624066353, 624104500, 624613533, 624337425, 624317474, 624275894, 623872185, 624437981, 625028839]
##END=$$ End of the data block
