##TITLE=$$ Begin of the data block
##JCAMP-DX=5.00 $$ ACD/SpecManager v 10.08
##SPECTROMETER/DATA SYSTEM=Alpha
##DATE=11 Nov 2014 09:02:30
##DATA TYPE=INFRARED SPECTRUM
##DATA CLASS=XYDATA
##ORIGIN=
##OWNER=
##NPOINTS=1765
##FIRSTX=399.76428223
##LASTX=3997.64306641
##MAXX=3997.64306641
##MINX=399.76428223
##MAXY=0.78351885
##MINY=0.43334562
##XFACTOR=1.0000000000
##YFACTOR=1.000000000000000e-9
##FIRSTY=0.65823758
##DELTAX=2.03961372
##XUNITS=1/CM
##YUNITS=ARBITRARY UNITS
##XYDATA=(X++(Y..Y))
399.8F58237576j333355n87702j2338j213253j970351n29945P96020n82754k923191
418.1F49880707k001404J51097l84211j134753l16024J80900p97808j141131J76549
436.5F44613922R85920J54615m76659J17600M42684o5386l20137r418j39176r20296
456.9F44383669r52304k25305j92285p14719r65893p36058m98533m64499m41611m42684
477.3F38749778m29690m04000m18425m27067k70307p212j34110n71251o24538k64048
497.7F35199130l75569j128197j224697n91695p54237j651585j649559p05659o44684
516F26473248j611412j614511o07371m16934j146138j182556k51293p8559j028061
534.4F18536413r76146N67377J259744M73619K99215J380801J481533k55882j142860
$$ y = [658237576, 656904221, 656316519, 656304181, 655090928, 653120577, 652590632, 653386652, 652803898, 649880707, 647879303, 648030400, 647646189, 646511436, 646195412, 646376312, 645578504, 644437373, 644613922, 645599842, 645754457, 645277798, 645395398, 645838082, 645772696, 645452559, 645443141, 645303965, 644383669, 643431365, 643206060, 643013775, 642299056, 641333163, 640597105, 640098572, 639634073, 639192462, 638749778, 638320088, 637916088, 637497663, 637070596, 636800289, 636793077, 636658967, 636087716, 635463178, 635199130, 634823561, 633695364, 632470667, 631878972, 631124735, 629473150, 627823591, 627117932, 626473248, 624861836, 623247325, 622639954, 622223020, 621076882, 619894326, 619643033, 619564474, 618536413, 617560267, 618127644, 619387388, 619861007, 620160222, 621541023, 623022556, 622766674, 621623814]
552.7F21623814L1591N89549o04689j071513L01779J030743l36111j095712L36409
571.1F20805860J027286n48423j338541M52101J592219M4167j037538L79026J363873
589.4F22740030p3969j246274R9123J260281j87040j508117k37345R85861k82526j614273
609.8F19935751m00007J212895K82407j162887K10464K276540J637340l8743N88894
628.2F24542654K134501J261116o22929N9784J966596J494050k09272M65154K513588
646.6F33605242K075553J6212L05772K151966J607955p10607p00653J372397J475752
664.9F41199589p04944o24001K489268K488912N84483M39942K419531K578616L05414
683.3F51176810l14176J608789K082527l7909r46283P97331J541615k22981p71105
$$ y = [621623814, 621655405, 622244954, 621640265, 620568752, 620870531, 621901274, 621565163, 620469451, 620805860, 621833146, 621284723, 619946182, 620398283, 621990502, 622034669, 620997131, 621376157, 622740030, 622666061, 621419787, 621518910, 622779191, 622592151, 621084034, 620846689, 621832550, 621550024, 619935751, 619535744, 620748639, 621031046, 619868159, 620078623, 622355163, 623992503, 623953760, 624542654, 626677155, 627938271, 627315342, 627375126, 629341722, 630835772, 630626500, 631091654, 633605242, 635680795, 635697007, 636002779, 638154745, 639762700, 639052093, 638351440, 639723837, 641199589, 640494645, 639870644, 642359912, 644848824, 645433307, 645873249, 648292780, 650871396, 651176810, 650862634, 652471423, 654553950, 654516041, 653569758, 654367089, 655908704, 655685723, 654914618]
701.6F54914618J433908K559066P82073k05636J655757K951265J369238Q9764J778185
720F67328238L428996K067804N97597J963496L470063J941025n3405R10162K500773
738.3F84154749J292109o20842K54810K004504J018405j026034l32475J577855Q01026
756.7F89124107j254499o46650J547336J374841m35114j3173K131522K081871J07110
775.1F94017351J72317K275765K547621P46847N88476K525568K913654R85444L79920
793.4G07152963K089619K568782O39200l17812J099348J681328n0962r21488O77764
811.8G14618742J644493J90496r19104J48297O81102j275361k552330m67181K040922
830.1G14110076J715541O22511J808524L524959K771855R83000J035630J782239N85973
$$ y = [654914618, 656348526, 658907592, 659689665, 659484029, 661139786, 664091051, 665460289, 665550053, 667328238, 670757234, 672825038, 673422635, 675386131, 678856194, 680797219, 680743814, 681653976, 684154749, 685446858, 684826016, 685080826, 687085330, 688103735, 687077701, 686745226, 688323081, 689124107, 687869608, 687222958, 688770294, 690145135, 689710021, 689696848, 691828370, 693910241, 694017351, 694189668, 696465433, 699013054, 699759901, 700348377, 702873945, 705787599, 706773043, 707152963, 709242582, 711811364, 712450564, 712132752, 713232100, 714913428, 714862466, 713940978, 714618742, 716263235, 716453731, 715534627, 715682924, 716364026, 715088665, 712536335, 712069154, 714110076, 715825617, 716448128, 718256652, 721781611, 724553466, 725536466, 726572096, 728354335, 728940308]
848.5G28940308j274526q22365R92536J096905k6465L27408J615763J154244n21779
866.8G31482029o11544M69864j7822j743078j995206q42095j056373k829909l304422
885.2G19551444j974702j460194k332390k189159m19796O45459K5213l19004O12259
903.5G12139130Q42690o51657j721800j093685o38068j629830k298295j265407k73585
921.9G03409493q33333j505434r10997m07219j445771k777278k831102k582013l557027
940.3F86559319m843175m779279m064143m250944m673421l807843k358555k084613
956.6F55697346k661348k484381j762032j981557l019750l475130l315746l828109
972.9F33169293n049109n620837n341947n441368o089330o001293m858733l929078
$$ y = [728940308, 727665782, 726843417, 727835953, 728932858, 728906393, 729233801, 730849564, 732003808, 731482029, 730870485, 731340349, 731322527, 729579449, 727584243, 726742148, 725685775, 722855866, 719551444, 717576742, 716116548, 713784158, 711594999, 711175203, 711820662, 711845875, 711526871, 712139130, 712981820, 712330163, 710608363, 709514678, 708876610, 707246780, 704948485, 703683078, 703409493, 702576160, 701070726, 700159729, 699752510, 698306739, 695529461, 692698359, 690116346, 686559319, 681716144, 676936865, 672872722, 668621778, 663948357, 660140514, 657781959, 655697346, 653035998, 650551617, 648789585, 646808028, 643788278, 640313148, 636997402, 633169293, 628120184, 622499347, 617157400, 611716032, 605626702, 599625409, 594766676, 590837598]
989.2E90837598l787875l553212k886295k728105l428519l925144l539920l062368
1005.5E63926160l184139l278554k694726k034187k040267k115011j424373n30600
1021.8E46624303l38256m77374q7261N68330O54995L82901N79357J025855Q08835M1485
1042.2E49783170k74956O199P9691j83344j34825L06606N19097K74896J76251N25833
1062.6E51078618N91516L040m89354m15921k30909j85132K12550J173616K006054K093374
1083E55837452J784206J637161J452744Q36193J35720j24812j00136j81258k33948
1101.4E61043322J63794Q56399J298666J479805J887083K516269K774716K563894K386868
1119.8E76970816K363503K182603J886248J902938K286553K375961J817584J118243
$$ y = [590837598, 587049723, 583496511, 580610216, 577882111, 574453592, 570528448, 566988528, 563926160, 560742021, 557463467, 554768741, 552734554, 550694287, 548579276, 547154903, 546624303, 546286047, 545808673, 545721412, 546289742, 546944737, 547327638, 547906995, 548932850, 549741685, 549783170, 549508214, 549514413, 549594104, 549410760, 549275935, 549582541, 550101638, 550376534, 550552785, 551078618, 551670134, 551673174, 551183820, 550767899, 550536990, 550351858, 550564408, 551738024, 553744078, 555837452, 557621658, 559258819, 560711563, 561547756, 561683476, 561558664, 561458528, 561277270, 561043322, 561207116, 562063515, 563362181, 564841986, 566729069, 569245338, 572020054, 574583948, 576970816, 579334319, 581516922, 583403170, 585306108, 587592661, 589968622, 591786206, 592904449]
1136.1E92904449O28411J12295m61578o53446l16500J64449N24223R36925J546621
1154.4E95385849K121807K504050K964855L756702M699945N475521O068111O623268
1170.7F29600108P019996P053197O839394O583095O187081N504132M664540L893435
1187.1F77344978L113568K101183R79185Q3029n01037r03964j108408j008033o91414
1205.4F79409087m47095m25160n39779p70748j204193j703977k023101k162278k247214
1223.8F67885542k315343k264082k069950j818299j536489j196504q25643n15938k65300
1242.1F55077994j8716K37465M36723N34415N87106O22213N91040N79655O96361Q23259
1262.5F60167515Q88169R38892R67205R30190Q25822O67990M59432J84954r5606k35796
$$ y = [592904449, 593532860, 593645155, 593183577, 592530131, 592213631, 592378080, 592902303, 593839228, 595385849, 597507656, 600011706, 602976561, 606733263, 611433208, 616908729, 622976840, 629600108, 636620104, 643673301, 650512695, 657095790, 663282871, 668787003, 673451543, 677344978, 680458546, 682559729, 683538914, 683621943, 683120906, 682216942, 681108534, 680100501, 679409087, 678961992, 678536832, 677997053, 677226305, 676022112, 674318135, 672295034, 670132756, 667885542, 665570199, 663306117, 661236167, 659417868, 657881379, 656684875, 655859232, 655343294, 655077994, 655059278, 655296743, 655733466, 656267881, 656854987, 657477200, 658068240, 658647895, 659344256, 660167515, 661055684, 661994576, 662961781, 663891971, 664717793, 665385783, 665845215, 666030169, 665934563, 665698767]
1282.9F65698767k18690k59101n21779q61585j116157j368523j767277k141834k310633
1301.3F55133188k417624k614737k806723k825379k741218k664685k508521k166510
1317.6F34387791j751304j483321j386404j278579j200140j304507j401663j215517
1333.9F23366356r01461p82013o77108l46363o5208j09493l52741m73320l69787l11613
1354.3F18977249m47333n61774o36041q43704j123905j340151j521170j643121k095342
1372.7F08764708k769589l282190n807698j2114584j4755428m409849J0670244J3412953
1389E89708567O470382J922130K17975n36681q28564n97477k72870k05397j42873M4525
1409.4E95779717K69651L57092K80678L65794R31918J299918J300573J462281J692891
$$ y = [665698767, 665480077, 665220976, 664699197, 663837612, 662721455, 661352932, 659585655, 657443821, 655133188, 652715564, 650100827, 647294104, 644468725, 641727507, 639062822, 636554301, 634387791, 632636487, 631153166, 629766762, 628488183, 627288043, 625983536, 624581873, 623366356, 622464895, 621682882, 621005774, 620659411, 620594203, 620484710, 620131969, 619658649, 619288862, 618977249, 618529916, 617968142, 617332101, 616488397, 615364492, 614024341, 612503171, 610860050, 608764708, 605995119, 602712929, 596905231, 584790647, 570035219, 565625370, 576295614, 589708567, 596178949, 598101079, 598319054, 597782373, 596953809, 596356332, 596083462, 595878065, 595735192, 595779717, 596049368, 596406460, 596687138, 597052932, 597984850, 599284768, 600585341, 602047622, 603740513]
1427.7F03740513J724005J453817J167595J311183J581729J311064J110255J185775
1444.1F14585936J173198R39489Q25286R61303J089812J326024K067626K438008K370596
1462.4F27777278K449692K638459K963424L725707N029917N407333M912615M474640
1478.7F59379065L813028L013134K268851J708508R45270K3961m86076j016378j971245
1497.1F67678118k585292k404869k072155k699018m134774l070056j911939j982152
1513.4F46817863k282500k099574j239478q09372r80020j191914j182854r32991j204610
1531.8F34894550j652777j144171p74682j324117j285612l46840K17021K98738K34425
1550.1F29116535N32150R69232R52124N61059P37071Q95083M20987k15530p88927r88722
$$ y = [603740513, 605464518, 606918335, 608085930, 609397113, 610978842, 612289906, 613400161, 614585936, 615759134, 616698623, 617523909, 618485212, 619575024, 620901048, 622968674, 625406682, 627777278, 630226970, 632865429, 635828853, 639554560, 644584477, 649991810, 654904425, 659379065, 663192093, 666205227, 668474078, 670182586, 671127856, 671151817, 670665741, 669649363, 667678118, 665092826, 662687957, 660615802, 657916784, 653782010, 650711954, 648800015, 646817863, 644535363, 642435789, 641196311, 640386939, 639406919, 638215005, 637032151, 636099160, 634894550, 633241773, 632097602, 631322920, 629998803, 628713191, 628366351, 628583372, 628882110, 629116535, 629648685, 630617917, 631570041, 632131100, 632868171, 633763254, 634184241, 633968711, 633179784, 632191062]
1570.5F32191062r53078j720369l004074k826929k583027l322542l863633l860414
1586.8F10056996l820121m039228m110455l803075l351331l170073l167808k929389
1603.2E81665516k596140k623439k844691k636790k259195k608598l241658k449393
1619.5E60405612j949608k443254k628744k496719k198994j650990j585006j875937
1635.8E43576360j094640l54349l24845l44933j05679M24028N32091L33905Q58366
1654.1E43500304J456201J367390J409531J911879K461612K291620K351403L076970
1670.5E59826910L290952L435433L724575L596902L499209L897071N135715N106748
1686.8E91513515M696726N014956M644871M964769N787194N855679O444454N473972
$$ y = [632191062, 631237984, 629517615, 626513541, 623686612, 621103585, 617781043, 613917410, 610056996, 606236875, 602197647, 598087192, 594284117, 590932786, 587762713, 584594905, 581665516, 579069376, 576445937, 573601246, 570964456, 568705261, 566096663, 562855005, 560405612, 558456004, 556012750, 553384006, 550887287, 548688293, 547037303, 545452297, 543576360, 542481720, 542127371, 541802526, 541457593, 541351914, 541775942, 542308033, 542641938, 543500304, 544956505, 546323895, 547733426, 549645305, 552106917, 554398537, 556749940, 559826910, 563117862, 566553295, 570277870, 573874772, 577373981, 581271052, 586406767, 591513515, 596210241, 601225197, 605870068, 610834837, 616622031, 622477710, 628922164, 634396136]
1703.1F34396136M776895M825651L885568K978921K531290K218842J989722J856506
1719.4F59459531J735330J563430J235962Q59081Q00610Q11756P59363J004577J294612
1737.8F69524252J641930J956701K101362K420604K929747L491640L825784L737867
1754.1F91629887L948390M172325L875613L952504L907978L422976L012478K765715
1770.4G20687866L015280L046513K414226J997173K021074K004266J712382J521468
1786.7G38420248J539946J523912J461625J348018J327157J353622J235008J098573
1803G49308109J156986J245022J087248Q81255R21249J082361J017272P76172P15792
1821.4G58191466Q35061Q43764O44147O34730R40621R54807O09576N11468P23839O90162
$$ y = [634396136, 639173031, 643998682, 647884250, 650863171, 653394461, 655613303, 657603025, 659459531, 661194861, 662758291, 663994253, 664853334, 665653944, 666465700, 667225063, 668229640, 669524252, 671166182, 673122883, 675224245, 677644849, 680574596, 684066236, 687892020, 691629887, 695578277, 699750602, 703626215, 707578719, 711486697, 714909673, 717922151, 720687866, 723703146, 726749659, 729163885, 731161058, 733182132, 735186398, 736898780, 738420248, 739960194, 741484106, 742945731, 744293749, 745620906, 746974528, 748209536, 749308109, 750465095, 751710117, 752797365, 753678620, 754599869, 755682230, 756699502, 757475674, 758191466, 759026527, 759870291, 760514438, 761149168, 762089789, 763044596, 763654172, 764165640, 764889479, 765579641]
1841.8G65579641M18663N02169P96199P93993N48959L96729N39302O71149N14984L02970
1862.2G71064758L46422M25041L13282L22402N72562O91891M91440K53975L02375M75049
1882.6G75259197M16040J91271J89782M47690M67122K16186K16424M24564L91424J62780
1903G78382480J51694L49224L83019K03013J17302K10524K57611J64032Q7142K41518
1923.4G80547559M05789K32756J2040J29223L04282J39892o8963J5378J80781J30892
1943.8G82029629L457Q3506K20954J06395j00077j8000K25425J89244p7128q0288J49370
1966.2G82732487J48594o3360o5982J62482J87815o6817j50979Q0764J64926q9585
1986.6G83040345k25663r180J50085k8372j81258j2397J43468m7982k36094p0929J08003
$$ y = [765579641, 765998304, 766500473, 767296672, 768090665, 768639624, 769036353, 769575655, 770246804, 770761788, 771064758, 771411180, 771836221, 772149503, 772471905, 773044467, 773736358, 774227798, 774481773, 774784148, 775259197, 775675237, 775866508, 776056290, 776503980, 776971102, 777187288, 777403712, 777828276, 778219700, 778382480, 778534174, 778883398, 779266417, 779469430, 779586732, 779797256, 780054867, 780218899, 780306041, 780547559, 780953348, 781186104, 781198144, 781327367, 781631649, 781771541, 781702578, 781717956, 781898737, 782029629, 782033086, 782116592, 782337546, 782443941, 782343864, 782325864, 782551289, 782740533, 782663405, 782583117, 782732487, 782881081, 782817721, 782751739, 782914221, 783102036, 783035219, 782884240, 782965004, 783129930, 783040345, 782814682, 782805502, 782955587, 782927215, 782745957, 782733560, 782877028, 782829046, 782592952, 782522023, 782630026]
2009G82630026q3387l16619j84417M2140o4671k98619k11358J9312n5194l07798k56956
2031.5G80912459o497n1916k97069k76029n663N7757j66833k20180K0206P7605j68502
2053.9G79875338k46465l874J02818j29939k64585l9875J35600n0008j98304j2160
2074.3G79168546J63853J1981j90735p4744J16944j8895k45809j12951J60039P7903
2094.7G79056132j90377j00196J96934J27852j81198j67608J25646J44124j35839j59979
2115.1G78715491J29998J92881p6235j84595O1691K15709J2934j42336M9949K02834
2135.5G79178321j8477j86622N6743K68817P8142j17719K5153K03848Q2850j07407
2155.9G79463649L1531K76744J78576p5043R597K95221K48194k7120n126K61962K73288
$$ y = [782630026, 782546639, 782230020, 782045603, 782087743, 782023072, 781724453, 781513095, 781532407, 781477213, 781169415, 780912459, 780905962, 780854046, 780556977, 780280948, 780275285, 780333042, 780166209, 779946029, 779966235, 780043840, 779875338, 779628873, 779624999, 779727817, 779597878, 779333293, 779293418, 779429018, 779379010, 779180706, 779168546, 779332399, 779344380, 779153645, 779078901, 779195845, 779176950, 778931141, 778818190, 778978229, 779056132, 778865755, 778765559, 778962493, 779090345, 778909147, 778741539, 778867185, 779011309, 778875470, 778715491, 778845489, 779038370, 778962135, 778777540, 778839231, 779054940, 779067874, 778925538, 778975487, 779178321, 779159844, 778973222, 779029965, 779298782, 779376924, 779259205, 779284358, 779488206, 779571056, 779463649, 779495180, 779771924, 779950500, 779875457, 779885054, 780180275, 780428469, 780401349, 780396223, 780658185, 780931473]
2178.3G80931473J0729l2783K22027K84493M6313m0591J64509K46406L6716m9770J91212
2200.8G82010734L39985Q4102j43707O5148K93255J01090j26780M3810K53618R5784
2221.2G83017039j39415m2915K06709J60157q4281m2140J99735J55926j17958j34170
2241.6G83178687J29163J57118j13606j54913J24276J98126o0618j51456O2287J41979
2262G83511043o2883j58191M2081J71125j7762k08557r7156P8440j371j50978p2480
2284.4G83033311N9307o5207l02673k52247j7345j4186j72734j73926p1287j83344
2304.8G81839669m40419m33207j69515j03474l13163m21464l28422l02493m52936m77672
2325.2G78396904k93135j99497k96295l63707k88069k87295m43458m72665j43886K68698
$$ y = [780931473, 780942202, 780909419, 781131446, 781415939, 781462252, 781421661, 781586170, 781832576, 781869292, 781819522, 782010734, 782350719, 782434821, 782291114, 782356262, 782649517, 782750607, 782623827, 782667637, 782921255, 783017039, 782877624, 782834709, 783041418, 783201575, 783117294, 783075154, 783274889, 783430815, 783312857, 783178687, 783307850, 783464968, 783351362, 783196449, 783320725, 783518851, 783458233, 783306777, 783369064, 783511043, 783448160, 783289969, 783332050, 783503175, 783485413, 783276856, 783179700, 783258140, 783256769, 783105791, 783033311, 783092618, 783027411, 782724738, 782472491, 782455146, 782440960, 782268226, 782094300, 782023013, 781839669, 781399250, 780966043, 780796528, 780693054, 780379891, 779958427, 779630005, 779327512, 778874576, 778396904, 778103769, 777904272, 777607977, 777244270, 776956201, 776668906, 776225448, 775752783, 775608897, 775877595]
2345.6G75877595J51932l72112p29918p74264p87914p65980m48167r9659n2750l4690
2366G71964073J82569K49982N4479l4631J19091K59876J69635k0802m7505j5736j62482
2388.4G72718549l52919l59536k54094k33293l26454l42787k41637k68996m21643m40895
2408.8G69476295l08574k52306l78311m72069l93629m05431o42001p05183l73661q9288
2429.2G65455842j70171l12984k58267k00093l36945m75287m00603k91169l31819m00305
2449.6G62278199l70145l21149l81172m78208m37439l46362l91305m60565l90291l11971
2470G58389592m17709n78582n51999m13954l90113m70519m87149m13119m18425n36978
2490.4G53711045n35250l91722l90350n23270m94122l55840l94821n52714n65708m14729
$$ y = [775877595, 776029527, 775657415, 774927497, 774153233, 773365319, 772599339, 772151172, 772051513, 771998763, 771964073, 772146642, 772396624, 772451103, 772416472, 772535563, 772795439, 772965074, 772944272, 772896767, 772881031, 772718549, 772365630, 772006094, 771752000, 771518707, 771192253, 770849466, 770607829, 770338833, 769917190, 769476295, 769167721, 768915415, 768537104, 768065035, 767671406, 767265975, 766623974, 765918791, 765545130, 765455842, 765285671, 764972687, 764714420, 764514327, 764177382, 763702095, 763301492, 763010323, 762678504, 762278199, 761908054, 761586905, 761205733, 760727525, 760290086, 759943724, 759552419, 759091854, 758701563, 758389592, 757971883, 757393301, 756841302, 756427348, 756037235, 755566716, 755079567, 754666448, 754248023, 753711045, 753175795, 752784073, 752393723, 751870453, 751376331, 751020491, 750625670, 750072956, 749507248, 749092519]
2510.8G49092519l41952m40478m78268l65436l32892m58598n20646m30584l86715m79400
2531.2G44857550n15819m14014l62456m62830n59330m99904l96907m19319m90963m47750
2551.6G40288258l69490m30405n29289m94659m16458m66406n53608m74989l38972l85225
2572G35828757n45919n65946m67539m71532n63145n49614m51684m82738o01709n82218
2592.4G30546713m66108m77970o03259o20246m93586m44114n83470o76989n69940m90963
2612.8G25120068n93186o63578n47111m71712n84661o71208o05643n49853o27220p01189
2633.2G19104707n93126m66227n75423p41423p02202n85258o11365p25925p09772n72741
2653.5G12821245n65529o93321p00176n98669n99146o86645o87659n86808n67555o74486
$$ y = [749092519, 748750567, 748310089, 747831821, 747466385, 747133493, 746674895, 746154249, 745723665, 745336950, 744857550, 744341731, 743927717, 743565261, 743102431, 742543101, 742043197, 741646290, 741226971, 740736008, 740288258, 739918768, 739488363, 738959074, 738464415, 738047957, 737581551, 737027943, 736552954, 736213982, 735828757, 735282838, 734716892, 734249353, 733777821, 733214676, 732665062, 732213378, 731730640, 731128931, 730546713, 730080605, 729602635, 728999376, 728379130, 727885544, 727441430, 726857960, 726180971, 725611031, 725120068, 724526882, 723863304, 723316193, 722844481, 722259820, 721588612, 720982969, 720433116, 719805896, 719104707, 718511581, 718045354, 717469931, 716728508, 716026306, 715441048, 714829683, 714103758, 713393986, 712821245, 712255716, 711562395, 710862219, 710263550, 709664404, 708977759, 708290100, 707703292, 707135737, 706461251]
2673.9G06461251p22826o44326n89073o57797o98566o02186n57601o62029p43627o93083
2694.3F99890137o29604o61016o96957o53445o02723o77764q00312p58350o48617o81937
2714.7F93079412p54774p03275o08444o24657p08997p06911o38783o34193p06077o90639
2735.1F86302662n43058n09203o22689o38187n42581n37932o46115o61015n66483n72621
2755.5F80462778o65605o75261o14465n85139o08086o17027n60284n47886o54697p64072
2775.9F74170256p71821p18892p22885p54237o95944o45697p44998q60989q31425p64072
2796.3F66659296q21770r45508r59516r00686q96394r40680r95338j025677j063526
2814.7F58110201j104474j084983j044750j082361j210630j298904j299680j337826
$$ y = [706461251, 705738425, 705094099, 704505026, 703847229, 703148663, 702546477, 701988876, 701326847, 700583220, 699890137, 699260533, 698599517, 697902560, 697249115, 696646392, 695968628, 695168316, 694409966, 693761349, 693079412, 692324638, 691621363, 691012919, 690388262, 689679265, 688972354, 688333571, 687699378, 686993301, 686302662, 685759604, 685250401, 684627712, 683989525, 683446944, 682909012, 682262897, 681601882, 681035399, 680462778, 679797173, 679121912, 678507447, 677922308, 677314222, 676697195, 676136911, 675589025, 674934328, 674170256, 673398435, 672679543, 671956658, 671202421, 670506477, 669860780, 669115782, 668254793, 667423368, 666659296, 665837526, 664892018, 663932502, 663031816, 662135422, 661194742, 660199404, 659173727, 658110201, 657005727, 655920744, 654875994, 653793633, 652583003, 651284099, 649984419, 648646593]
2831F48646593j468360j573384j611293j797139k222002k663374k987265l161311k951265
2849.3F28211200k196789j234471n72145l17753l47554n86868r07004j178681j338602
2867.7F19531333j334488j163065r93431r16123p83027o44505o69181p61688p75635
2886.1F11490190p86424r07361j009524r77278r95338j157164j253426j207054j195610
2904.4F02001011j338601j573264j814008k098143k402067k489448k193272j659691
2920.7E86432517j128495o78241k57969J06334K77758L80993O54280R62138J135648
2939.1E87884963J250267J300156J188576R21488O29484M64857L60429K38300K44498
2957.4E94483018M31240O68823Q56996R95934J114011J229763J367867J462221J382172
$$ y = [648646593, 647178233, 645604849, 643993556, 642196417, 639974415, 637311041, 634323776, 631162465, 628211200, 626014411, 624779940, 624207795, 623890042, 623542488, 622955620, 622048616, 620869935, 619531333, 618196845, 617033780, 616040349, 615124226, 614341199, 613696694, 613027513, 612265825, 611490190, 610703766, 609796405, 608786881, 607809603, 606814265, 605657101, 604403675, 603196621, 602001011, 600662410, 599089146, 597275138, 595176995, 592774928, 590285480, 588092208, 586432517, 585304022, 584625781, 584367812, 584474146, 584751904, 585132897, 585787177, 586749315, 587884963, 589135230, 590435386, 591623962, 592545450, 593174934, 593639791, 594000220, 594238520, 594483018, 594914258, 595583081, 596440077, 597436011, 598550022, 599779785, 601147652, 602609873, 603992045]
2975.8F03992045J233339J183152J082302Q83579P99239Q06272P54714N82277L11435
2994.2F11628354J01387q1777k97368l78549l72708m39107n14687m87208m63188o04569
3014.5F08090580q17299q98242q38936q00192q65162r49144r20355q23200p94172q77679
3034.9E99506199r62615r09388q59678r24170j006782j035571r80675r56416j004934
3053.3E90865970r89259r40621r34302r01342q34346p78436p81834q54671q73447p89583
3073.7E82188129o69002n89132o70076q23259q47697q01862p62641p46727q19862q79645
3094.1E74578226p99418o91056p44820r14275r56238q19087p22587q11577q93891q10444
3114.5E66414833p75158q86441j021504j152158j177251j051307r75489j053513j140415
$$ y = [603992045, 605225384, 606408536, 607490838, 608374417, 609173656, 609979928, 610734642, 611316919, 611628354, 611729741, 611647964, 611350596, 610972047, 610599339, 610160232, 609645545, 609158337, 608695149, 608090580, 607273281, 606375039, 605536103, 604735911, 603870749, 602921605, 602001250, 601178050, 600383878, 599506199, 598543584, 597634196, 596774518, 595850348, 594843566, 593807995, 592827320, 591870904, 590865970, 589876711, 588936090, 588001788, 587100446, 586266100, 585487664, 584705830, 583851159, 582977712, 582188129, 581519127, 580929995, 580259919, 579436660, 578588963, 577787101, 577024460, 576277733, 575457871, 574578226, 573778808, 573087752, 572342932, 571428657, 570472419, 569653332, 568930745, 568119168, 567225277, 566414833, 565639675, 564753234, 563731730, 562579572, 561402321, 560351014, 559375525, 558322012, 557181597]
3132.8E57181597j090646r49740r22740j091003j239419j225949j153171j060784r72986
3151.2E47475159j048386j248121j313150j222372j131237j125335j204193j255512
3167.5E37926853j215637j166463j158535j176238j181245j151562j160085j205027
3183.8E28512061j201868j149893j121700j129389j109481j075864j091957j128375
3200.1E19503534j104415j024603r49383r51112j005828j012504j010001j024902j001775
3218.5E10419011r47177r09686r46403j006007r72867q67129q11159r06944j021922
3236.9E02029717j012206j002908r86457q83579q72821j024931j095385r53316q31753
3255.2D93366361r10938j002908r75519r62764r93938r12606p49678p64161r11355
$$ y = [557181597, 556090951, 555141211, 554218471, 553127468, 551888049, 550662100, 549508929, 548448145, 547475159, 546426773, 545178652, 543865502, 542643130, 541511893, 540386558, 539182365, 537926853, 536711216, 535544753, 534386218, 533209980, 532028735, 530877173, 529717088, 528512061, 527310193, 526160300, 525038600, 523909211, 522799730, 521723866, 520631909, 519503534, 518399119, 517374516, 516425133, 515474021, 514468193, 513455689, 512445688, 511420786, 510419011, 509471834, 508562148, 507615745, 506609738, 505636871, 504769742, 503958583, 503051639, 502029717, 501017511, 500014603, 499028146, 498144567, 497271746, 496246815, 495151430, 494198114, 493366361, 492455423, 491452515, 490476996, 489514232, 488520294, 487607688, 486858010, 486093849, 485182494]
3273.6D85182494r58234r24856q90851q66145q19385p37190o71178o18786n87850o16044
3294D77491975o63221p08014p07090o03705n03123n66006p65204q83550q29696p42346
3314.4D70520020p62284q38876q34823p91639q35269r47237r88573r39429q95023q30502
3334.8D61856365p53134q13008r50902r71973r49174r10163q02398q26627r85861j006991
3355.2D52886134q68260p45833p55191q06302p23571o22779p06076q98868r59248q54581
3375.5D44945425p35522o65068p00623p45892o62715n06192l66360m10766o51657p09415
3395.9D38791215m55081k80201m50135o91801o32316m46558l93063l66717l60668m13120
3416.3D34301555l54826k28077j96159j51933k4944J01596J24991J25885J81913P8649
$$ y = [485182494, 484224260, 483299404, 482408553, 481542408, 480723023, 479985833, 479314655, 478695869, 478108019, 477491975, 476828754, 476120740, 475413650, 474809945, 474306822, 473740816, 472975612, 472092062, 471262366, 470520020, 469757736, 468918860, 468084037, 467292398, 466457129, 465509892, 464521319, 463581890, 462686867, 461856365, 461103231, 460290223, 459339321, 458367348, 457418174, 456508011, 455705613, 454878986, 453893125, 452886134, 452017874, 451272041, 450516850, 449710548, 448986977, 448364198, 447658122, 446759254, 445800006, 444945425, 444209903, 443544835, 442844212, 442098320, 441435605, 440929413, 440563053, 440152287, 439500630, 438791215, 438336134, 438055933, 437605798, 436913997, 436281681, 435835123, 435442060, 435075343, 434714675, 434301555, 433946729, 433718652, 433522493, 433370560, 433345616, 433447212, 433572203, 433698088, 433880001, 433958650]
3436.7D33958650j47492j61797J5736K19255L74258L45767K60442L22163M57198N39660
3457.1D36183840N67019N46694N85824P51197Q36105O83218M56124M33177N94080Q03202
3477.5D42440480Q97914P63834O77019Q12292Q71986P86424P89374Q94964J012325
3495.9D49946612J025289R69887J001924R71586Q09669Q43913J086145J257390J201213
3514.2D59113628J024812R60648J094252J360565J347960J096606J111597J268267
3530.6D68378335J344502J471579J530767J396298J377642J525641J637667J542121
3546.9D80204552J360089J459837J661837J637757J604199J719237J723259J484424
3563.2D92855191J600027K345741K467156J938700J816809J934112K038598K249181
$$ y = [433958650, 433811158, 433649361, 433665097, 433884352, 434258610, 434604377, 434864819, 435186982, 435644180, 436183840, 436750859, 437297553, 437883377, 438634574, 439470679, 440153897, 440610021, 441043198, 441637278, 442440480, 443338394, 444102228, 444779247, 445591539, 446463525, 447249949, 448039323, 448934287, 449946612, 450971901, 451941788, 452943712, 453915298, 454724967, 455568880, 456655025, 457912415, 459113628, 460138440, 461099088, 462193340, 463553905, 464901865, 465998471, 467110068, 468378335, 469722837, 471194416, 472725183, 474121481, 475499123, 477024764, 478662431, 480204552, 481564641, 483024478, 484686315, 486324072, 487928271, 489647508, 491370767, 492855191, 494455218, 496800959, 499268115, 501206815, 503023624, 504957736, 506996334, 509245515]
3579.5E09245515K326190K112866K119720K542853K488315K043247K139867K485156
3595.8E27503729K623439K693593K627492K315939K207875K554357K713561K708614
3612.1E47948599K775431K545774K840638L428220K859354J953125J893580L290832
3628.5E69535553L943384K865255K656698K736390K617121K638042K417862J976073
3644.8E91386378K274871L754496L976405K265870J935959K884031K773285K118289
3661.1F13369584J871586J592576J410008K032518K204717J484811K192914K452672
3677.4F28611386J506567J280069J071036Q39710J422525K111375J508534Q02279O73592
3695.8F39827073O25550P23064J073540Q73088K92838K23041P68602J426041R82344
$$ y = [509245515, 511571705, 513684571, 515804291, 518347144, 520835459, 522878706, 525018573, 527503729, 530127168, 532820761, 535448253, 537764192, 539972067, 542526424, 545239985, 547948599, 550724030, 553269804, 556110442, 559538662, 562398016, 564351141, 566244721, 569535553, 573478937, 576344192, 579000890, 581737280, 584354401, 586992443, 589410305, 591386378, 593661249, 597415745, 601392150, 603658020, 605593979, 608478010, 611251295, 613369584, 615241170, 616833746, 618243754, 620276272, 622480989, 623965800, 626158714, 628611386, 630117953, 631398022, 632469058, 633308768, 634731293, 636842668, 638351202, 639153481, 639827073, 640452623, 641175687, 642249227, 643122315, 643415153, 643638194, 644406796, 645832837, 646815181]
3714.1F46815181K35975J23739K69770L74198M70817N05984J02997k42054J44243R86814
3734.5F49787664J381576N33045o50168m43399R57251O14285r4533Q94070J088202
3752.9F54067993J46389k1696M85659M71651l5464O198K19703M21226N54323J94073
3773.3F56510055j11878P9990M52101K66850M2021K50936K32517R6619l4451k10643
3793.7F57574117n5253j21057j13905N65946K68877J13547O40928O2287o92188m67182
3814.1F57776117K77400N8651J69516Q04305J25885k27630j78337k21730j10745j15991
3834.4F58357441J83881N76496K87890R5010R6560l54648j025081j075864O89984J922250
3854.8F59753919J90794p28249o04570j44184P0333l46779l2187N29468K73705k980
$$ y = [646815181, 647051156, 647174895, 647444665, 647818863, 648289680, 648795664, 648898661, 648656607, 648800850, 649787664, 651169240, 651702285, 651052117, 650608718, 651565969, 652180254, 652085721, 652979791, 654067993, 654214382, 654192686, 654678345, 655149996, 655114532, 655120730, 655340433, 655761659, 656315982, 656510055, 656398177, 656478167, 656930268, 657197118, 657239139, 657490075, 657722592, 657819211, 657784760, 657574117, 657518864, 657397807, 657283902, 657849848, 658118725, 658232272, 658873200, 658935487, 658243299, 657776117, 658053517, 658112168, 658281684, 659085989, 659211874, 658984244, 658805907, 658584177, 658473432, 658357441, 658541322, 659117818, 659405708, 659500718, 659597278, 659242630, 658217549, 657141685, 657831669, 659753919, 659944713, 659216464, 658611894, 658467710, 658538043, 658191264, 658159077, 658688545, 658962250, 658959270]
3875.2F58959270m04180k45153J29520j1622K94089r120m43995K00630J32739o76274
3895.6F57925904o51479j19030K34246N25892M00185j40846l10659k85327l81172j83046
3916F57014668J80125R5964k25306k45750j71125k87235j23500K52485Q9109l04461
3936.4F56274974l30686j49369n246j22964k51889o0559K6763j15514j41978p5400
3956.8F55048132p8499q3805p2479j24633j78158j68860j28329r9421p3015q5473j16170
3979.3F53839290p7724n2572j26361j68920j13785q3447q8930r7096j29282
3997.6F52901173
$$ y = [658959270, 658555090, 658309937, 658439457, 658427835, 658721924, 658712804, 658268809, 658469439, 658602178, 657925904, 657274425, 657155395, 657389641, 657915533, 658315718, 658174872, 657864213, 657578886, 657197714, 657014668, 657194793, 657290757, 657065451, 656819701, 656648576, 656361341, 656237841, 656490326, 656579435, 656274974, 655944288, 655794919, 655789673, 655666709, 655414820, 655354261, 655381024, 655265510, 655123532, 655048132, 654969633, 654885828, 654813349, 654688716, 654510558, 654341698, 654213369, 654113948, 654040933, 653955460, 653839290, 653761566, 653708994, 653582633, 653413713, 653299928, 653216481, 653127551, 653030455, 652901173]
##END=$$ End of the data block
