##TITLE=$$ Begin of the data block
##JCAMP-DX=5.00 $$ ACD/SpecManager v 10.08
##SPECTROMETER/DATA SYSTEM=Alpha
##DATE=11 Nov 2014 09:02:30
##DATA TYPE=INFRARED SPECTRUM
##DATA CLASS=XYDATA
##ORIGIN=
##OWNER=
##NPOINTS=1765
##FIRSTX=399.76428223
##LASTX=3997.64306641
##MAXX=3997.64306641
##MINX=399.76428223
##MAXY=0.78431576
##MINY=0.43167865
##XFACTOR=1.0000000000
##YFACTOR=1.000000000000000e-9
##FIRSTY=0.65619677
##DELTAX=2.03961372
##XUNITS=1/CM
##YUNITS=ARBITRARY UNITS
##XYDATA=(X++(Y..Y))
399.8F56196773j620531m11510Q35537m94420j996219q31664M45783j056790l004074
418.1F48062885j364231K94387r64344j489222k31862M79520k87593o39259K71558
436.5F44131839P11143j83880q83997j03890O58512K03013l63111k57969k64287p60138
456.9F42887235p27713k03789l09586q10683r46343p03156n02944k72751j30415m72903
477.3F37806952o57856l92378l91543n37216l22462l2842j16050m59909n17846k42292
497.7F34136558m16279j130343j182496n45740n88000j437962j691878r50456q41200
516F25352204j665533j498759l95596k79903j208723j351416l74913j01685r70126
534.4F17505550j012265M35412J291394O56664L78132J347780J451910l02017j288235
$$ y = [656196773, 654576242, 654164732, 655000269, 654505849, 652509630, 651677966, 652123749, 651066959, 648062885, 646698654, 646993041, 646028697, 644539475, 644307613, 644787133, 644499540, 643860281, 644131839, 644842982, 644659102, 643775105, 643671215, 644329727, 644532740, 644169629, 643911660, 643647373, 642887235, 642159522, 641955733, 641646147, 640835464, 639889121, 639185965, 638683021, 638410270, 638279855, 637806952, 637149096, 636756718, 636365175, 635827959, 635505497, 635472655, 635356605, 634896696, 634378850, 634136558, 633720279, 632589936, 631407440, 630861700, 630273700, 628835738, 627143860, 626193404, 625352204, 623686671, 622187912, 621792316, 621512413, 620303690, 618952274, 618577361, 618475676, 617505550, 616493285, 616928697, 618220091, 618876755, 619254887, 620602667, 622054577, 621752560, 620464325]
552.7F20464325j73926M81605n68211q21948O08802J050770m61399j180768K09271
571.1F19608521R30012m84228j210094M57883J549780L3379j113176K89440J347482
589.4F21408999p7307j278699J13309J411080J2219j457453l12745R51886l29018j702070
609.8F18740201l63111J322686L43561j110792K64406K326489J602232j20461O95229
628.2F23700440K303064J193881q19445K1815K113820J602947k57611L29495K388417
646.6F32576823K114058K39789M54784K104580J487255p52032n92649J487077J483738
664.9F40603423q19981q20994K527117K686382O64293L78788K381802K533018K27690
683.3F50361538k88546J713753K114236r1136j007556P46190J570165r9003p03812
$$ y = [620464325, 620290399, 620772004, 620203793, 619381845, 619990647, 621041417, 620580018, 619399250, 619608521, 620538533, 620054305, 618844211, 619302094, 620851874, 620885253, 619772077, 620061517, 621408999, 621331692, 620052993, 620166302, 621577382, 621589601, 620132148, 619819403, 620771289, 620442271, 618740201, 618377090, 619699776, 620043337, 618932545, 619196951, 621523440, 623125672, 623005211, 623700440, 626003504, 627197385, 626377940, 626399755, 628513575, 630116522, 629858911, 630188406, 632576823, 634690881, 634930670, 635385454, 637490034, 638977289, 638225257, 637632608, 639119685, 640603423, 639783442, 638962448, 641489565, 644175947, 644840240, 645219028, 647600830, 650133848, 650361538, 650072992, 651786745, 653900981, 653809845, 652802289, 653548479, 655118644, 655019641, 654315829]
701.6F54315829J445532K604544Q10445k56896J572430K899587J332760R6738J828492
720F66649461L493309K163052O64771J960814L383756J819133r1374R19223K515734
738.3F83477879J343846n83708K78234K035439J045466r71556l42369J439214P11619
756.7F88434064j191973n48244J572430J339436m58419l58K138138K108454K25842
775.1F93619370K66016K201915K413213O88374O10709K581358K908945R23753L92139
793.4G06605792K187789K628088O06536l66628J097262J717746j6689r42051O48737
811.8G14166582J702845K80678q91924J15156O16014j331627k574563m28140K159536
830.1G13814557J835882O60241J782298L488600K699971Q70049R60589J774847O43015
$$ y = [654315829, 655761361, 658365905, 659176350, 658919454, 660491884, 663391471, 664724231, 664820969, 666649461, 670142770, 672305822, 672970593, 674931407, 678315163, 680134296, 680042922, 680962145, 683477879, 684821725, 684238017, 684516251, 686551690, 687597156, 686625600, 686283231, 687722445, 688434064, 687242091, 686693847, 688266277, 689605713, 689147294, 689146936, 691285074, 693393528, 693619370, 693885386, 696087301, 698500514, 699188888, 699799597, 702380955, 705289900, 706213653, 706605792, 708793581, 711421669, 712028205, 711661577, 712758839, 714476585, 714459896, 713517845, 714166582, 715869427, 716150105, 715258181, 715373337, 715989351, 714657724, 712083161, 711655021, 713814557, 715650439, 716310680, 718092978, 721581578, 724281549, 725151598, 726112187, 727887034, 728530049]
848.5G28530049j165569p26759J046240J083494j27852K46524J652122J234531n23328
866.8G31249452o87063M53293L6061j705527j981736q78453j138508k858102l280878
885.2G19208539j966238j441241k288461k146899l79622O09398r5547l69608O34730
903.5G11765051Q46684o50644j716912j076341o02543j595736k266943j256168l03745
921.9G03142703q78215j525641q97646l97920j475931k795875k784788k539039l559291
940.3F86288357m831493m748702m052937m244447m685283l847599k385556k109170
956.6F55383170k666414k428413j697421j972794l056407l490091l272831l775239
972.9F33023560n051315n686164n411744n473673o070376n921900m755020l852308
$$ y = [728530049, 727364480, 726637721, 727683961, 728767455, 728639603, 728886127, 730538249, 731772780, 731249452, 730562389, 731015682, 731051743, 729346216, 727364480, 726486027, 725347519, 722489417, 719208539, 717242301, 715801060, 713512599, 711365700, 710986078, 711595476, 711499929, 711130321, 711765051, 712611735, 711961091, 710244179, 709167838, 708565295, 706969559, 704702616, 703446448, 703142703, 702264488, 700738847, 699841201, 699443281, 697967350, 695171475, 692386687, 689847648, 686288357, 681456864, 676708162, 672655225, 668410778, 663725495, 659877896, 657492340, 655383170, 652716756, 650288343, 648590922, 646618128, 643561721, 640071630, 636798799, 633023560, 627972245, 622286081, 616874337, 611400664, 605330288, 599408388, 594653368, 590801060]
989.2E90801060l787935l628492k921522k660453l362477l944039l588438l078461
1005.5E63829243l186881l303349k742649k070069j998067k035856j449347o18338
1021.8E46424687l32892l93689m0650N43952O01172L51072N70059J024186Q20637M7624
1042.2E49616158k80201J072Q5533j57297r1731L55482N20825K38121J84178N62728
1062.6E51034868N99742p034m98712m13716k36988k17974K10464J209140K007067K051831
1083E55738688J772344J664936J437545P89583J37090p9751n7101j67966k31623J76131
1103.4E61179876Q60274J281619J468837J900495K528667K782464K572596K389848
1119.8E76964676K389849K230048J881420J842201K259553K398193J836478J151264
$$ y = [590801060, 587013125, 583384633, 580463111, 577802658, 574440181, 570496142, 566907704, 563829243, 560642362, 557339013, 554596364, 552526295, 550528228, 548492372, 547043025, 546424687, 546091795, 545698106, 545657456, 546201408, 546802580, 547153652, 547723711, 548747897, 549568534, 549616158, 549335957, 549337029, 549422562, 549265265, 549173534, 549529016, 550049841, 550287962, 550472140, 551034868, 551634610, 551627576, 551128864, 550715148, 550478160, 550260186, 550470650, 551679790, 553686857, 555738688, 557511032, 559175968, 560613513, 561403096, 561540186, 561460435, 561403334, 561235368, 561003745, 561179876, 562040150, 563321769, 564790606, 566691101, 569219768, 572002232, 574574828, 576964676, 579354525, 581584573, 583465993, 585308194, 587567747, 589965940, 591802418, 592953682]
1136.1E92953682O77586R6142n29349o72162l05831J35303M91321R31084J527011K116025
1156.5E97420812K560019L019869L755332M682064N480825O084860O623924P007658
1172.8F36635363P067025O868124O575942O167233N505740M656733L861665L096462
1189.1F80434287K106189R82881J00911m77553r18746j142323j012981o81281m53889
1207.5F78937495m34459n49018q07881j247823j702309j986087k148866k272666k333998
1225.8F65454388k240420k009690j764357j523792j204610q34465n24462k76684l8564
1244.2F55037344K23696M26650N18203N74410O23941O22988O13570O75380P92265Q99434
1264.6F61007881R46403R59277R26196Q33989P12871N14090J89185j36017k77639k50876
$$ y = [592953682, 593631268, 593727410, 593198061, 592525899, 592220068, 592355371, 592846692, 593777776, 595304787, 597420812, 599980831, 603000700, 606756032, 611438096, 616918921, 623003781, 629627705, 636635363, 643702388, 650570512, 657146454, 663313687, 668819427, 673476160, 677337825, 680434287, 682540476, 683523357, 683624268, 683146715, 682227969, 681085646, 680072665, 679391384, 678937495, 678503036, 677954018, 677146137, 675898314, 674196005, 672209918, 670061052, 667788386, 665454388, 663213968, 661204278, 659439921, 657916129, 656711519, 655877054, 655352592, 655075908, 655037344, 655261040, 655687690, 656205893, 656780303, 657404244, 658027232, 658640802, 659316182, 660108447, 661007881, 661954284, 662913561, 663839757, 664673746, 665386617, 665900707, 666089892, 665953875, 665676236, 665425360]
1285F65425360k74777n06819q40902j118898j389265j781106k122045k278030k416610
1303.3F52696908k646268k828717k799571k704143k681673k556622k193034j749157
1319.6F32537723j469374j380146j281321j215160j322269j414478j234054r16720
1336F22304201p98285o79493l11911l4988j13428l57210m39882l24011k98918m66108
1356.4F18479967n77450o42895q43943j112282j322448j471222j572072k045095k711356
1374.7F06181204l189563n659938j1804343j4360427m315675J0330618J3011217O257176
1391E96450269J822651J73926n65946q62122o01768k49326j83642j22786O4790K70486
1411.4E96196532L31104K33471K98560R05931J336038J318097J455963J676023J704037
$$ y = [665425360, 665150583, 664643764, 663802862, 662683964, 661294699, 659513593, 657391548, 655113518, 652696908, 650050640, 647221923, 644422352, 641718209, 639036536, 636479914, 634286880, 632537723, 631068349, 629688203, 628406882, 627191722, 625869453, 624454975, 623220921, 622304201, 621505916, 620826423, 620514512, 620479524, 620366096, 620008886, 619569004, 619244993, 618946075, 618479967, 617902517, 617259622, 616415679, 615303397, 613980949, 612509727, 610937655, 608892560, 606181204, 602991641, 597331703, 585527360, 571166933, 566851258, 577181876, 590193093, 596450269, 598272920, 598446846, 597880900, 597018778, 596417010, 596167684, 595984042, 595861256, 595926046, 596196532, 596527636, 596761107, 597059667, 597965598, 599301636, 600619733, 602075696, 603751719, 605455756]
1429.8F05455756J458228J162052J276791J593769J359045J117468J167417J169502
1446.1F15760028R51529Q22186R20594J022995J266777K116621K558708K420545K425968
1464.5F30265951K646685K983570L666699M927277N381108M971325M525244L815174
1480.8F63183033L011108K265155J674652R25243O8665m43816j043737k045036k628624
1499.1F64966643k392829k061903k795100m262090k993584j824319j998961k324939
1515.4F44312918k105415j245498p86722q99732j135528j151443q97586j184523j671970
1533.8F33234501j180172q28743j402378j290023k73526K96235L40342K29001N00083
1552.2F29625320R26137Q60989M23253P81596J049340N03182k31743q52644r92954
$$ y = [605455756, 606913984, 608076036, 609352827, 610946596, 612305641, 613423109, 614590526, 615760028, 616711557, 617533743, 618454337, 619477332, 620744109, 622860730, 625419438, 627839983, 630265951, 632912636, 635896206, 639562905, 644490182, 649871290, 654842615, 659367859, 663183033, 666194141, 668459296, 670133948, 671059191, 671127856, 670684040, 669640303, 667595267, 664966643, 662573814, 660511911, 657716811, 653454721, 650461137, 648636818, 646637857, 644312918, 642207503, 640962005, 640175283, 639275551, 638140023, 636988580, 636090994, 634906471, 633234501, 632054329, 631225586, 629823208, 628533185, 628259659, 628555894, 628896236, 629125237, 629625320, 630551457, 631412446, 631835699, 632617295, 633666635, 634169817, 633938074, 633085430, 632092476]
1570.5F32092476r30488j768887l060341k765775k501905l317952l904998l891528
1586.8F09950602l829062m042447m122078l815174l365278l196478l223777l001750
1603.2E81354558k635180k643586k876281k656043k278686k676844l319979k484500
1619.5E59783459k000273k501607k635359k468169k176166j672923j653552j912952
1635.8E42762458j027524k61307Tl63171k25663L83318O07192L67403R16898J559735
1656.2E44458032J424610J456678J974762K528965K308309K301336L070890L352225
1672.5E62875807L474772L730119L604531L521681L885567N110621N166233M776955
1688.8E96146286N058586M646719M937470N742788N829215O493270N547405M827797
$$ y = [632092476, 631161988, 629393101, 626332760, 623566985, 621065080, 617747128, 613842130, 609950602, 606121540, 602079093, 597957015, 594141841, 590776563, 587580085, 584356308, 581354558, 578719378, 576075792, 573199511, 570543468, 568264782, 565587938, 562267959, 559783459, 557783186, 555281579, 552646220, 550178051, 548001885, 546328962, 544675410, 542762458, 541734934, 541473627, 541212320, 540849149, 540623486, 541006804, 541613996, 541981399, 542898297, 544458032, 545882642, 547339320, 549314082, 551843047, 554151356, 556452692, 559523582, 562875807, 566350579, 570080698, 573685229, 577206910, 581092477, 586203098, 591369331, 596146286, 601204872, 605851591, 610789061, 616531849, 622361064, 628854334, 634401739, 639229536]
1705.1F39229536M887939L951847L011763K502382K141654J958728J924813J801133
1721.5F61409795J576245J224935Q45850P80523P78317P41661J045286J317501J641512
1739.8F71361625J971722K104342K397775K894521L511608L916383L778517L922999
1756.1F95859492M161000L877103L942073L924608L443360K996147K738357L041267
1772.4G23983407L120363K448857J982629K010643K032876J766622J549602J489341
1788.8G40384340J435399J441956J392364J346708J337528J239061J129866J168430
1805.1G50875652J245797J087725Q71002R26733J086057J002669P80821P20024Q27491
1823.4G59423971Q59559O48737O13212R51410R85384O21259N00798P09534O90281M17650
$$ y = [639229536, 644117475, 648069322, 651081085, 653583467, 655725121, 657683849, 659608662, 661409795, 662986040, 664210975, 665056825, 665837348, 666615665, 667357326, 668402612, 669720113, 671361625, 673333347, 675437689, 677835464, 680729985, 684241593, 688157976, 691936493, 695859492, 700020492, 703897595, 707839668, 711764276, 715207636, 718203783, 720942140, 723983407, 727103770, 729552627, 731535256, 733545899, 735578775, 737345397, 738894999, 740384340, 741819739, 743261695, 744654059, 746000767, 747338295, 748577356, 749707222, 750875652, 752121449, 753209174, 754080176, 755006909, 756092966, 757095635, 757876456, 758596480, 759423971, 760283530, 760932267, 761545479, 762496889, 763482273, 764103532, 764604330, 765313864, 766004145, 766421795]
1843.8G66421795M95076Q13246Q39114N64218L65197N22018O91056N43416L22103L48389
1864.2G71925628L84033K68638L44753O05345O93619M98593K73645L05116M58360M05252
1884.6G76162982J77979J51873M26293M93586K52068K33173M27306L97801J75893J47403
1905G79046357L26633L76523K14398J22606K10941K66314J74582Q2254K42353M14967
1925.4G81477928K17080K981J54912L17335J29223p6413N543J66178J41203L9518J05321
1947.9G82680809K22683J01448j23680m2439K27213K03729o5684r7514J20342J74999
1968.3G83401906k6345q2433J38581J92165m9889j39117Q2791J54793j03295k20239
1988.7G83348918J0610J68383j7822j73211j669J47104o3479k61247p3790J15692r1433
$$ y = [766421795, 766916871, 767730117, 768569231, 769133449, 769498646, 770020664, 770711720, 771255136, 771577239, 771925628, 772309661, 772578299, 772923052, 773528397, 774222016, 774720609, 774994254, 775299370, 775757730, 776162982, 776340961, 776492834, 776919127, 777412713, 777664781, 777897954, 778325260, 778723061, 778898954, 779046357, 779372990, 779749513, 779963911, 780086517, 780297458, 780563772, 780738354, 780820608, 781062961, 781477928, 781695008, 781697989, 781852901, 782170236, 782299459, 782223046, 782228589, 782394767, 782535970, 782575488, 782680809, 782903492, 783004940, 782881260, 782838821, 783066034, 783269763, 783204079, 783106565, 783226907, 783401906, 783375561, 783293128, 783431709, 783623874, 783573985, 783434868, 783517659, 783672452, 783569157, 783348918, 783359528, 783527911, 783510089, 783336878, 783335209, 783482313, 783418834, 783157587, 783083797, 783199489, 783108056]
2011.1G83108056l20733j77383L6954p8141l00169k09332Q941p4327l06189k25067
2031.5G81462610K7835l3498l11553l01600m768O4313j66595k16841K4259P8738j77563
2053.9G80445337k53975j1087Q9348j20580k36512l0279J39356k7418j96219n2690
2074.3G79745281J28388J3828j71482n7876J31845q583k41995j14500J56104P9275
2094.7G79660285j90676j08301J87277J33574j52885j48476J17243J29640j36912j52826
2115.1G79337943J34527J84775r4295j83344Q8215K27928l814j61529L3081K19106
2135.5G79782593L7015j74165J6510K53976J09434j04725J7285K37822J24097j21593
2155.9G80178249j1325K57134J81079p3433J7763L19004K74837q524L755K69115K78652
$$ y = [783108056, 782787323, 782609940, 782646894, 782568753, 782268584, 782059252, 782068193, 781993866, 781687677, 781462610, 781490445, 781456947, 781145394, 780843794, 780839026, 780903339, 780736744, 780519903, 780544162, 780622900, 780445337, 780191362, 780180275, 780269623, 780149043, 779912531, 779882252, 780021608, 779994190, 779797971, 779745281, 779873669, 779887497, 779716015, 779658139, 779789984, 779781401, 779539406, 779424906, 779581010, 779660285, 779469609, 779361308, 779548585, 779682159, 779529274, 779380798, 779498041, 779627681, 779490769, 779337943, 779472470, 779657245, 779562950, 779379606, 779467821, 779695749, 779691935, 779530406, 779563487, 779782593, 779819608, 779645443, 779661953, 779915929, 780025363, 779920638, 779937923, 780175745, 780299842, 780178249, 780166924, 780424058, 780605137, 780531704, 780549467, 780868471, 781143308, 781134784, 781138539, 781407654, 781686306]
2178.3G81686306J4007l6418J98006K55049K3543m3749K02655K97845M2736q0645J67370
2200.8G82726705L16918P8499j13249P2957K54154P8380j03831P4565K72036J00910
2221.2G83758044j52707m4823K29180J64330j01685n5850J94550J53780j17064j13785
2241.6G83913970J64986J81019j13606j63973J21296K00986o3121j57714O9916J62006
2262G84315765m5776j55986K5809J45316l9995k13921p9214J01030J2755j52409p6950
2284.4G83836424P1109o0320k90990k39253l6657l5167j85489j87576p3910j56164
2304.8G82642007l89755m01795j73867j23381l07858l82304l26574l50654m45068l97980
2325.2G79342771k24889k10285l74675l85761k20299k22981m56631n11825j30951K48015
$$ y = [781686306, 781700313, 781663895, 781861901, 782116950, 782140493, 782096744, 782299399, 782597244, 782639980, 782559335, 782726705, 783043623, 783122122, 783008873, 783081830, 783335984, 783414364, 783310533, 783385098, 783657134, 783758044, 783605337, 783560514, 783789694, 783954024, 783852339, 783796489, 783991039, 784144819, 784027755, 783913970, 784078956, 784259975, 784146369, 783982396, 784103692, 784304678, 784241557, 784083843, 784153759, 784315765, 784269989, 784114003, 784139812, 784285128, 784245133, 784031212, 783951998, 784053028, 784065783, 783913374, 783836424, 783907533, 783847213, 783556223, 783316970, 783280313, 783245146, 783059657, 782872081, 782798171, 782642007, 782252252, 781850457, 781676590, 781553209, 781245351, 780863047, 780536473, 780185819, 779740751, 779342771, 779117882, 778907597, 778532922, 778147161, 777926862, 777703881, 777247250, 776735425, 776604474, 776852489]
2345.6G76852489P2658l84391o53028p01487p23422p18593m94957j55986n7399m9412
2366G72986472J30653K58148J17302m0412N6863K13563J45733m0352q3506n1737j52051
2388.4G73540676l33369l55721k26795k12431l35694l66509k77936k80380l82960l99888
2408.8G70368993l07679k81513l92019m52638l72708l87430o01173o73353m14849j51872
2429.2G66333759j50025k48671k40624k29835l74079m95910m14551l14295l52979l98457
2449.6G63114333l33607k88665l96550m97878m18126l27707l84032m36425l91365l76463
2470G59263515m80890n65231m95612l83735l89576m78446m83454l99410m15445n25713
2490.4G54646003n11646m01914m28558n32984m91381l78191m05550n34296n41032m01616
$$ y = [776852489, 776925147, 776540756, 775887728, 775186241, 774462819, 773744226, 773249269, 773093283, 773035884, 772986472, 773117125, 773375273, 773492575, 773452163, 773509026, 773722589, 773868322, 773827970, 773744464, 773692727, 773540676, 773207307, 772851586, 772624791, 772412360, 772076666, 771710157, 771432221, 771151841, 770768881, 770368993, 770061314, 769779801, 769387782, 768935144, 768562436, 768175006, 767573833, 766900480, 766485631, 766333759, 766183734, 765935063, 765694439, 765464604, 765090525, 764594615, 764180064, 763865769, 763512790, 763114333, 762780726, 762492061, 762095511, 761597633, 761179507, 760851800, 760467768, 760031343, 759639978, 759263515, 758782625, 758217394, 757721782, 757338047, 756948471, 756470025, 755986571, 755587161, 755171716, 754646003, 754134357, 753732443, 753303885, 752770901, 752279520, 751901329, 751495779, 750961483, 750420451, 750018835]
2510.8G50018835l61025m67956m76122l40939l28243m78327n23031m26292m05431m99010
2531.2G45712459n10216l82542l28303m46736n44608m92394m24206m51804m86731m17411
2551.6G41227508l42012m29571n54978n09680m27603m94779n73277m63069l07440l78728
2572G36746371n69284n87523m69983m39226n21481n46098m72427m81784n99444o11603
2592.4G31447518m79877m44532n53369n76735m94182m86135n99444o68585n62311m81426
2612.8G26100922n94080o62625n42998m73440n82695o93142o41406n41389n85854o63399
2633.2G20119894n87523n16653o40274p68780o91235n50509n94795p33971p07865n73873
2653.5G13754416n68808o71446o75678n98073o08146o96063o92130n84781n68688o71863
$$ y = [750018835, 749657810, 749189854, 748713732, 748372793, 748044550, 747566223, 747043192, 746616900, 746211469, 745712459, 745202243, 744819701, 744491398, 744044662, 743500054, 743007660, 742583454, 742131650, 741644919, 741227508, 740885496, 740455925, 739900947, 739391267, 738963664, 738468885, 737895608, 737432539, 737125099, 736746371, 736177087, 735589564, 735119581, 734680355, 734158874, 733612776, 733140349, 732658565, 732059121, 731447518, 730967641, 730523109, 729969740, 729393005, 728898823, 728412688, 727813244, 727144659, 726582348, 726100922, 725506842, 724844217, 724301219, 723827779, 723245084, 722551942, 721910536, 721369147, 720783293, 720119894, 719532371, 719015718, 718375444, 717606664, 716915429, 716364920, 715770125, 715036154, 714328289, 713754416, 713185608, 712514162, 711838484, 711240411, 710632265, 709936202, 709244072, 708659291, 708090603, 707418740]
2673.9G07418740o99997o08027n81741o84083p21276o22391n75066o49929p19249o82891
2694.3G00874090o27279o75380p16865o53983o08980o81818p72536p48395o82414p04408
2714.7F94002032p32422o48677n78821o62923p79747p54118o37293o00279o51657o26743
2735.1F87329352n20051n47289o78897o67453n40853n24938o20723o45160n89848n87523
2755.5F81406617o43492o63876o13809n76853o16074o21975n68986n76376o37353p02202
2775.9F75185621p42376p43151p69138p84814o87838n94556o97017q82566q96156p94589
2796.3F67593420q06571r13202r30429q76665q97109r64165r91047j014411j078546
2814.7F59121275j138330j119673j052260j069784j185894j291335j340806j388908
$$ y = [707418740, 706718743, 706110716, 705528975, 704844892, 704123616, 703501225, 702926159, 702276230, 701556981, 700874090, 700246811, 699571431, 698854566, 698200583, 697591603, 696909785, 696137249, 695388854, 694706440, 694002032, 693269610, 692620933, 692042112, 691379189, 690599442, 689845324, 689208031, 688607752, 687956095, 687329352, 686809301, 686262012, 685583115, 684915662, 684374809, 683849871, 683229148, 682583988, 681994140, 681406617, 680763125, 680099249, 679485440, 678908587, 678292513, 677670538, 677101552, 676525176, 675887823, 675185621, 674443245, 673700094, 672930956, 672146142, 671458304, 670863748, 670166731, 669284165, 668388009, 667593420, 666786849, 665873647, 664943218, 664066553, 663169444, 662205279, 661214232, 660199821, 659121275, 657982945, 656863272, 655811012, 654741228, 653555334, 652263999, 650923193, 649534285]
2831F49534285j470268j521527j579464j820266k252877k673864k995491l186345k965808
2849.3F29068375k175689j205683n60403l33965l90648o13213r00388j166939j326681
2867.7F20394766j305699j129150r89736r28878p95722o63400o63936p35402p70569
2886.1F12412274q12352r31620j005114r73761j022100j181483j234830j161933j178622
2904.4F02910459j364052j595736j811385k070367k375961k511799k221227j644551
2920.7E87315381j103223o78777k67149J13607K77638L48628O14822R53853J145720
2939.1E88720500J250864J300096J208603R48310O34075M69684L78609K50399K47002
2957.4E95408142M12464O54280Q77738J007199J099110J231968J391053J454533J349151
$$ y = [649534285, 648064017, 646542490, 644963026, 643142760, 640889883, 638216019, 635220528, 632034183, 629068375, 626892686, 625687003, 625126600, 624792635, 624401987, 623788774, 622888386, 621721447, 620394766, 619089067, 617959917, 616970181, 616041303, 615245581, 614582181, 613918245, 613182843, 612412274, 611599922, 610668302, 609663188, 608689427, 607667327, 606485844, 605251014, 604089081, 602910459, 601546407, 599950671, 598139286, 596068919, 593692958, 591181159, 588959932, 587315381, 586212158, 585533381, 585266232, 585379839, 585657477, 586006105, 586620927, 587574780, 588720500, 589971364, 591271460, 592480063, 593428373, 594062448, 594532132, 594910741, 595161140, 595408142, 595820606, 596474886, 597352624, 598359823, 599458933, 600690901, 602081954, 603536487, 604885638]
2975.8F04885638J262069J245796J074135Q37207P94292Q40366P78138N67735K85029
2994.2F12570405J00672n8114k83182l80397l66866m28260n24342n00560m54247o09457
3014.5F09065652q28028q68499q12888q09074q74638r65536r58741q45730p89583q86380
3034.9F00426555r83775r01163q31425r26792j012624j020014r83715r62555r96471
3053.3E91808021r87947r58621r71675r41336q48532p51853p60615q89778r13799p77423
3073.7E83006442o28353n48899o45160q23141q69631q49963q10802p56382q04425q65817
3094.1E75403869p93636p06255p61628r02176r37998q18313p58946q62896q75831p57813
3114.5E67228377p65085q95024j058280j192987j151025j006425r65774j057446j163840
$$ y = [604885638, 606147707, 607393503, 608467638, 609304845, 610099137, 610939503, 611717641, 612285376, 612570405, 612671077, 612612963, 612329781, 611949384, 611582518, 611154258, 610629916, 610129356, 609675109, 609065652, 608237624, 607369125, 606556237, 605747163, 604872525, 603906989, 602948248, 602102518, 601312935, 600426555, 599442780, 598541617, 597710192, 596783400, 595770776, 594750762, 593767047, 592804492, 591808021, 590820074, 589861453, 588889778, 587948442, 587099910, 586348057, 585587442, 584697664, 583783865, 583006442, 582378089, 581829190, 581184030, 580360889, 579491258, 578641295, 577830493, 577074111, 576269686, 575403869, 574610233, 573903978, 573142350, 572240174, 571302176, 570483863, 569724917, 568862021, 567986190, 567228377, 566463292, 565568268, 564509988, 563317001, 562165976, 561159551, 560193777, 559136331, 557972491]
3132.8E57972491j138091r75788r20772j104713j235306j181543j142979j100540j032591
3151.2E48140168j108467j232565j246273j245737j235605j204192j216054j240731
3167.5E38410544j216352j151204j140773j198292j208603j160443j179576j228928
3183.8E28926373j191199j123429j114249j121998j106381j121819j158118j153469
3200.1E19835711j089573j008869r65893r91940j054764j041353r78529r80318j006663
3218.5E10717809r91463r71735r92835j001119r20236q26776q37028r51290j041174
3236.9E02184153j034439j018405r90897r24379r43333j056522j078010r60201q69542
3255.2D93308425r25094j014501j023114r76234r11892q42094p69258q00281r25899
$$ y = [557972491, 556834400, 555858612, 554937840, 553833127, 552597821, 551416278, 550273299, 549172759, 548140168, 547031701, 545799136, 544552863, 543307126, 542071521, 540867329, 539651275, 538410544, 537194192, 536042988, 534902215, 533703923, 532495320, 531334877, 530155301, 528926373, 527735174, 526611745, 525497496, 524375498, 523269117, 522147298, 520989180, 519835711, 518746138, 517737269, 516771376, 515779436, 514724672, 513683319, 512704790, 511724472, 510717809, 509726346, 508754611, 507761776, 506760657, 505840421, 505013645, 504176617, 503225327, 502184153, 501149714, 500131309, 499140412, 498216033, 497272700, 496216178, 495138168, 494177967, 493308425, 492383331, 491368830, 490345716, 489369482, 488457590, 487615496, 486846238, 486045957, 485120058]
3273.6D85120058r73254r35108q91000q47459q16881p93875p21395o12408n67853o23465
3294D77337360o93172p51585p70896o56128n10603n45055p46638r18507r20743q10385
3314.4D70013648p84725q46982q53419p91222p85410r22114j026690r93013r41098
3332.7D62068975q65549p63178p99745r41962r99153j000702r53972q33989q62479
3351.1D54048246j041114j044810q70407p63952p90984q00729o98149o49839p64370
3369.4D46623892r37909r85563q80241p63774p00176p32452p72685o92606n30541l72529
3389.8D39255416m12464o84112p67320m87060k77579m57465p29949o69956m30166l17544
3410.2D34021801l10540m01348n06491m16219k77668k58714j72168L7521J78605J19686
$$ y = [485120058, 484146804, 483211696, 482320696, 481473237, 480656356, 479862481, 479141086, 478528678, 477960825, 477337360, 476644188, 475892603, 475121707, 474465579, 473954976, 473409921, 472663283, 471744776, 470824033, 470013648, 469228923, 468381941, 467528522, 466737300, 465951890, 465029776, 464003086, 463010073, 462068975, 461203426, 460440248, 459640503, 458698541, 457699388, 456698686, 455744714, 454910725, 454048246, 453007132, 451962322, 451091915, 450327963, 449536979, 448736250, 448038101, 447388262, 446623892, 445685983, 444700420, 443820179, 443056405, 442356229, 441623777, 440851092, 440158486, 439627945, 439255416, 438842952, 438158840, 437391520, 436904460, 436626881, 436169416, 435439467, 434769511, 434339345, 434021801, 433711261, 433309913, 432803422, 432387203, 432109535, 431850821, 431678653, 431716174, 431894779, 432014465]
3430.6D32014465M6492J18226R6977j01418j32769N7071K28733L24249L05862K82943
3451D33240831L60221M43488N18322N72145N26756N49674P75725R08076O78927L76314
3471.4D38950479M10706O30975Q18342Q95083P62015O52701P76648Q96991Q90523Q68439
3491.8D46552902R08256J058966J074880R42320R93848J008838Q26866Q79943J128674
3510.2D55375493J262635J215964J044244R78797J138300J398832J359552J088649
3526.5D64862466J127303J345783J403153J474053J557856J450539J412123J546264
3542.8D76179540J663655J580626J382053J462370J685888J706928J659780J715929
3559.1D89036769J734376J547962J647264K350032K514720K030999J882553K006590
$$ y = [432014465, 432060957, 432179183, 432276160, 432174742, 432041973, 432099044, 432327777, 432652026, 432957888, 433240831, 433601052, 434044540, 434562862, 435135007, 435661763, 436211437, 436987162, 437895238, 438574165, 438950479, 439361185, 439992160, 440810502, 441705585, 442467600, 443120301, 443896949, 444793940, 445684463, 446552902, 447461158, 448520124, 449595004, 450537324, 451531172, 452540010, 453366876, 454246819, 455375493, 456638128, 457854092, 458898336, 459877133, 461015433, 462414265, 463773817, 464862466, 465989769, 467335552, 468738705, 470212758, 471770614, 473221153, 474633276, 476179540, 477843195, 479423821, 480805874, 482268244, 483954132, 485661060, 487320840, 489036769, 490771145, 492319107, 493966371, 496316403, 498831123, 500862122, 502744675, 504751265]
3575.4E04751265K131403K283453K313138K118349K119720K541303K565086K147019
3591.7E22970736K204239K546072K675891K718509K651274K309501K181649K619147
3608.1E42877018K844215K746105K745688K555430K889335L497422K910375J972914
3624.4E65038502J911164L305554M005194K998590K784968K830922K696872K686083
3640.7E88257849K424121J947761K210557L759086M088700K346218K033531L033281
3657F10101104K837121K079606J834751J592934J412093K023578K200067J439214K117097
3675.4F27637565K512813J652479J361489J095832Q40723J405537K103210J512050
3691.7F40121698Q21054O91295O04689O97792J115381R65417L22521J79469P36296
$$ y = [504751265, 506882668, 509166121, 511479259, 513597608, 515717328, 518258631, 520823717, 522970736, 525174975, 527721047, 530396938, 533115447, 535766721, 538076222, 540257871, 542877018, 545721233, 548467338, 551213026, 553768456, 556657791, 560155213, 563065588, 565038502, 566949666, 570255220, 574260414, 577259004, 580043972, 582874894, 585571766, 588257849, 590681970, 592629731, 594840288, 598599374, 602688074, 605034292, 607067823, 610101104, 612938225, 615017831, 616852582, 618445516, 619857609, 621881187, 624081254, 625520468, 627637565, 630150378, 631802857, 633164346, 634260178, 635100901, 636506438, 638609648, 640121698, 640942752, 641634047, 642238736, 642936528, 644051909, 645017326, 645339847, 645519316, 646255612]
3710F46255612J404703R94027L07619J85073K81393L66509M66049M95732J09732k26677
3730.4F50639772J13428R06646J351297O09040n81979m77910Q43227N32984j03593
3748.8F53832912R54152J195609K27511J4067M98652M83513K682O1512K38121M39703
3769.2F57948434O20544J99259j99438J0908M79877L52025N0903J61826K02120J75118
3789.6F60001576O2644j93476j61708k12311n7757O67751K66552K9206N68032M0948
3810F61011457o87837m57466K87175Q4818K08616Q35538J41680k32994j95861k37286
3830.4F60757840j28508j52051J08122M92156K79367J51396J97172k35438r77338j133621
3850.8F59359097N68271J852036J80483p26939n68509p6711J67191k93016n8830N35786
$$ y = [646255612, 647660315, 648654342, 648961961, 649147034, 649428427, 649794936, 650260985, 650756717, 650866449, 650639772, 650753200, 651659846, 653011143, 653620183, 653038204, 652560294, 653403521, 653936505, 653832912, 654787064, 655982673, 656210184, 656224251, 656722903, 657206416, 657209098, 657270610, 657508731, 657948434, 658568978, 658768237, 658568799, 658579707, 659059584, 659411609, 659462512, 659624338, 659826458, 660001576, 660064220, 659870744, 659709036, 659496725, 659438968, 660106719, 660373271, 660402477, 660970509, 661011457, 660323620, 659866154, 660153329, 660238147, 660446763, 661282301, 661423981, 661190987, 660995126, 660757840, 660629332, 660477281, 660585403, 661077559, 661356926, 661508322, 661705494, 661470056, 660492718, 659359097, 659927368, 661779404, 661959887, 661232948, 660664439, 660587728, 660754919, 660461903, 660403073, 660938859]
3871.2F60938859L03447l2961m56929k66493J34647l8922K74599O3181l86000J71364
3891.6F60704792J38461o14405o53982j90794J85489N25415M40240j00016l05832l04341
3912F59825027m07755k23279J17659L5465j95444q1062j4246k82824k25901J72973
3932.3F58720613J20639k44617l78072k32876M1545K801k02954j04129l3617j38283
3952.7F57551050j41740q1777q9705r2626q0645j10447j51515j56582q0347j0729j7762
3975.2F56537175j10805j89483j06990l9101j22845j85967j78516j36375k1040M351
3995.6F55450404j34826
3997.6F55315578
$$ y = [660938859, 661242306, 661209345, 660752416, 660485923, 660620570, 660581648, 660856247, 660919428, 660533428, 660704792, 660843253, 660228848, 659574866, 659384072, 659569561, 660094976, 660535216, 660435200, 660129368, 659825027, 659417272, 659193993, 659311652, 659347117, 659151673, 659070611, 659056365, 658773541, 658547640, 658720613, 658841252, 658596635, 658218563, 657985687, 658027232, 658030033, 657827079, 657722950, 657689333, 657551050, 657409310, 657327533, 657237828, 657145202, 657064557, 656954110, 656802595, 656646013, 656565666, 656554937, 656537175, 656426370, 656236887, 656129897, 656090796, 655967951, 655781984, 655603468, 655467093, 655446053, 655450404, 655315578]
##END=$$ End of the data block
