##TITLE=$$ Begin of the data block
##JCAMP-DX=5.00 $$ ACD/SpecManager v 10.08
##SPECTROMETER/DATA SYSTEM=Alpha
##DATE=11 Nov 2014 09:02:30
##DATA TYPE=INFRARED SPECTRUM
##DATA CLASS=XYDATA
##ORIGIN=
##OWNER=
##NPOINTS=1765
##FIRSTX=399.76428223
##LASTX=3997.64306641
##MAXX=3997.64306641
##MINX=399.76428223
##MAXY=0.78541160
##MINY=0.42980102
##XFACTOR=1.0000000000
##YFACTOR=1.000000000000000e-9
##FIRSTY=0.65446663
##DELTAX=2.03961372
##XUNITS=1/CM
##YUNITS=ARBITRARY UNITS
##XYDATA=(X++(Y..Y))
399.8 654466629 653249323 652993143 653691232 652921259 650850773 650242925 650815308 649703979 646700501
418.1 646700501 645276606 645537019 644702733 643424153 643471956 644095898 643629432 642452359 642111182
436.5 642111182 642519414 642361403 641945660 642453551 643314004 643416226 642895043 642514706 642187595 641424477
456.9 641424477 640719533 640489221 640246570 639566660 638614178 637914717 637445331 637005210 636692762 636345387
477.3 636345387 635921538 635585487 635200083 634641886 634159207 634010971 633942783 633485258 632869840 632616103
497.7 632616103 632233500 631079733 629879117 629332006 628702223 627199054 625592828 624882698 624182105
516 624182105 622443616 620743692 620191157 619869649 618751645 617638350 617415309 617218077 616106629
534.4 616106629 615098715 615594387 616839826 617395997 617817223 619293749 620755494 620387435 619074464
552.7 619074464 619003356 619630694 618972898 617879570 618325770 619389594 618991435 617831409 618067563
571.1 618067563 619033754 618545711 617388368 617981553 619563520 619583309 618631363 619153619 620636225
589.4 620636225 620602310 619283319 619187593 620302141 620217919 618874192 618653238 619631886 619350255 617724717
609.8 617724717 617448151 618762732 618980706 617840528 618238151 620660663 622171998 621870816 622438073
628.2 622438073 624727070 626071751 625438869 625492513 627515554 628996432 628649116 629007757 631476104
646.6 631476104 633561730 633689642 634112298 636316657 637968242 637287319 636601865 638047874 639613211
664.9 639613211 638895035 638181925 640680730 643197238 643711448 644050896 646498799 649233282 649695635
683.3 649695635 649472117 651067138 653029084 652891576 651942194 652695179 654126525 653915286 653248608
701.6 653248608 654758513 657433987 658324838 658078969 659650624 662627935 664076447 664195240 665959954
720 665959954 669453025 671664536 672323942 674264491 677698731 679580688 679484844 680358291 682812095
738.3 682812095 684138596 683587015 683863103 685882032 686917007 685907722 685550928 687028170 687769890
756.7 687769890 686595976 686098576 687742531 689088523 688551962 688510418 690690160 692801118 692912042
775.1 692912042 693054378 695274293 697837234 698682308 699392200 702031255 704974651 705899417 706236601
793.4 706236601 708321691 710863888 711442471 711072505 712187529 713927090 713920295 713053763 713818848
811.8 713818848 715530157 715698302 714717388 714850187 715529323 714216828 711627007 711186349 713308692
830.1 713308692 715089679 715760648 717598915 721109331 723884404 724890411 725919008 727670670 728248119
848.5 728248119 727029383 726235807 727168381 728205264 728177607 728543818 730170071 731281281 730722368
866.8 730722368 730101407 730602503 730656087 728975236 726980805 726048648 724913716 722102880 718842506
885.2 718842506 716869295 715398610 713090837 710958719 710590720 711205959 711134911 710767448 711385608
903.5 711385608 712232709 711609185 709947824 708873749 708208203 706588387 704324424 703058720 702791095
921.9 702791095 701956213 700403273 699477673 699110031 697650909 694807410 691978157 689464927 685957730
940.3 685957730 681114197 676306307 672244012 668058813 663441062 659614325 657220960 655146360
956.6 655146360 652527630 650078773 648326576 646312594 643225610 639719248 636440396 632665336
972.9 632665336 627648056 622020960 616644263 611196339 605141997 599200130 594411671 590520799
989.2 590520799 586709380 583100021 580175281 577466726 574122369 570278347 566766024 563691795
1005.5 563691795 560473561 557168782 554472506 552454829 550455630 548365355 546890616 546301126
1021.8 546301126 545971334 545530081 545471489 546058893 546726465 547113955 547666728 548640370 549385846 549365759
1042.2 549365759 549064159 549099207 549250543 549125314 549019277 549361229 549886823 550134480 550310612 550825119
1062.6 550825119 551401854 551462471 551029146 550596237 550292075 550016701 550204396 551412761 553450704
1081 553450704 555576980 557382286 559008598 560436010 561248899 561379850 561259031 561161518 561017573
1099.4 561017573 560838759 561032116 561922193 563254535 564732492 566606879 569125414 571933627 574542820
1117.7 574542820 576938689 579293549 581479013 583374918 585279167 587551296 589909196 591703594
1134 591703594 592813015 593478918 593661010 593245506 592579126 592221856 592354715 592860043 593792081 595359385
1154.4 595359385 597512066 600037158 603012443 606758118 611436427 616896093 622946799 629563987
1170.7 629563987 636610925 643674254 650457025 656977594 663152158 668661952 673325241 677224874
1187.1 677224874 680348694 682437837 683403134 683524072 683077931 682164192 681007981 679998994 679350615
1205.4 679350615 678912580 678435266 677819252 676981449 675743043 674035072 672025979 669897556 667690277
1223.8 667690277 665407598 663182974 661156893 659349680 657797456 656594694 655773997 655259669 654993415
1242.1 654993415 654990196 655255139 655709147 656256497 656851411 657450318 658012986 658596933 659299016 660120368
1262.5 660120368 661008179 661918223 662842274 663763463 664611697 665300906 665765762 665940940 665835321 665604651
1282.9 665604651 665379405 665091038 664563537 663706124 662559807 661159694 659397840 657275617 654977858
1301.3 654977858 652563751 649912059 647051156 644230008 641527832 638866365 636327982 634128749
1317.6 634128749 632366121 630900562 629533648 628262103 627056777 625735760 624319196 623084128
1333.9 623084128 622149229 621342659 620678484 620380640 620373785 620307624 619972110 619506598 619157374 618882418
1354.3 618882418 618474245 617927372 617257476 616377831 615292251 614030898 612604022 611053169 609023333
1372.7 609023333 606370926 603300691 597862899 586504459 572649896 568412125 578267992 590758085
1389 590758085 596777797 598506212 598621368 598031044 597198725 596635461 596366525 596135855 595982492 596032798
1409.4 596032798 596306384 596615851 596778035 597021699 597945392 599326849 600684524 602159202 603804231
1427.7 603804231 605466604 606925488 608092248 609352827 610955060 612344682 613485456 614648998
1444.1 614648998 615781665 616702974 617541850 618500412 619535983 620777011 622850776 625386715 627810180
1462.4 627810180 630260944 632933915 635916829 639546990 644427896 649809539 654810369 659365356
1478.7 659365356 663200736 666200221 668427885 670054913 670918226 670964122 670547724 669495642 667425215
1497.1 667425215 664861977 662555933 660466373 657529354 653194368 650286376 648555756 646604717
1513.4 646604717 644269228 642130613 640827715 639977574 639112294 638055027 636948049 636061311 634856880
1531.8 634856880 633180618 631996691 631090820 629621029 628384531 628187180 628552496 628926158 629147232
1550.1 629147232 629613340 630475223 631249607 631627560 632532060 633681297 634177625 633901060 633000553
1568.5 633000553 631970763 631012261 629222512 626188517 623453081 620936453 617605925 613718212
1584.8 613718212 609846592 606001139 601903498 597716510 593858361 590486348 587289870 584055901
1601.1 584055901 581037045 578362882 575680256 572784483 570074499 567689419 564904749 561540067
1617.4 561540067 559055090 557021379 554475427 551826179 549343586 547151208 545470119 543787897
1633.7 543787897 541833341 540806651 540563524 540318072 540001214 539894998 540387511 540955424 541196764
1652.1 541196764 542154551 543895423 545417726 546892166 548879623 551450551 553778827 556091428
1668.4 556091428 559210479 562614441 566122532 569903433 573564708 577084899 580897987 585991025
1684.7 585991025 591255844 596113384 601204693 605849802 610779047 616539657 622366428 628836453
1701.1 628836453 634406805 639286518 644228101 648204744 651206851 653701961 655844212 657798767
1717.4 657798767 659768701 661634624 663251281 664517581 665393770 666160047 666892350 667601943 668668687
1735.7 668668687 670020103 671686709 673676670 675772965 678143740 681031406 684555471 688493252
1752 688493252 692313075 696275830 700447083 704308450 708255172 712204218 715640724 718608856 721315145
1770.4 721315145 724327505 727460265 729946375 731959820 733999252 736058176 737834156 739386380
1786.7 739386380 740874529 742291927 743732810 745159447 746532321 747876287 749118984 750259697
1803 750259697 751439691 752683043 753755927 754626930 755567610 756660342 757668674 758457839 759166956
1821.4 759166956 759965599 760818243 761475384 762083948 763049662 764066637 764711916 765234947 765927315
1839.8 765927315 766551137 766932964 767453969 768297315 769155562 769750476 770149112 770670593 771337152 771862507
1860.2 771862507 772175312 772511542 772881806 773167670 773557544 774183631 774868786 775348723 775595725 775879085
1880.5 775879085 776343346 776781857 776992738 777158678 777606130 778116226 778344810 778553963 778984904 779380202
1900.9 779380202 779532850 779672801 780013382 780398846 780630350 780777991 781000137 781251729 781397164 781469047
1921.3 781469047 781727910 782175660 782422423 782424271 782544434 782836020 782972753 782918751 782935858 783079147
1941.7 783079147 783169985 783175528 783290803 783559501 783715308 783619940 783549726 783712327 783893704 783864796 783796668
1964.2 783796668 783910394 784065366 784037352 783970237 784109771 784296930 784267306 784162045 784251273 784385324
1984.6 784385324 784267247 784037292 784034669 784191906 784164667 783984363 783992529 784161985 784110069 783858776 783793390
2007 783793390 783914328 783842742 783522367 783300400 783305049 783243895 782963812 782761991 782801032 782758296 782441795
2029.4 782441795 782178164 782174706 782134175 781837225 781558752 781568229 781623304 781438947 781216562 781248927 781346977
2051.9 781346977 781197846 780957699 780939639 781032443 780930877 780712128 780684114 780811727 780770183 780568779
2072.3 780568779 780537903 780680716 780668914 780483186 780440986 780577123 780568779 780327618 780198157 780354738
2092.7 780354738 780460000 780291378 780181289 780358016 780482411 780317187 780178249 780321836 780460477 780315816
2113.1 780315816 780168891 780342042 780573547 780488610 780263364 780294359 780493915 780496478 780355990 780409038
2133.5 780409038 780623078 780643404 780483842 780528784 780801058 780918598 780825377 780874014 781129539 781246841
2153.9 781246841 781121016 781088531 781329989 781541169 781499863 781503916 781767070 781997859 781990647 782010317 782285810
2176.3 782285810 782574654 782610774 782603741 782842755 783132255 783147812 783072650 783283532 783629656 783704281 783616185
2198.7 783616185 783748567 784035385 784107745 783991158 784065902 784349263 784459651 784349084 784384012 784628332
2219.1 784628332 784740746 784624219 784605503 784839988 785000503 784886181 784817755 785011590 785167575 785051346
2239.5 785051346 784947038 785129905 785315573 785210073 785077691 785217226 785409510 785326064 785148680 785206616
2259.9 785206616 785356045 785304427 785156488 785208881 785404623 785411596 785199642 785084069 785160184 785168052 785010815
2282.3 785010815 784930587 785005212 784949660 784655750 784425020 784415066 784398913 784223855 784034014 783943594 783771574
2304.8 783771574 783364475 782965660 782830238 782730520 782403350 782017946 781744838 781429887 780960262 780549765
2325.2 780549765 780317187 780104101 779784441 779426277 779162109 778904676 778469741 777982354 777820587 778048337
2345.6 778048337 778132200 777728856 777044356 776366115 775676847 774941504 774452329 774335980 774270713 774165213
2366 774165213 774257481 774497688 774597466 774565578 774636745 774851799 775022149 775004387 774918854 774859965 774695754
2388.4 774695754 774363637 774010360 773774445 773570836 773251116 772891223 772630692 772373915 771981478 771562874
2408.8 771562874 771252096 770944476 770532310 770116210 769794166 769418716 768784344 768069386 767658770 767539382
2429.2 767539382 767391741 767119169 766857803 766617060 766255319 765793443 765402138 765098155 764753640 764349222
2449.6 764349222 763998628 763714910 763349056 762860775 762418747 762065291 761662960 761204362 760805845 760462582
2470 760462582 760022163 759458601 758950174 758587182 758236170 757769704 757257819 756810546 756365299 755837381
2490.4 755837381 755320251 754898965 754480362 753996313 753539860 753162324 752741992 752196074 751654208 751261771
2510.8 751261771 750922441 750464857 749978781 749617100 749274194 748812675 748316467 747906804 747522891 747047007
2531.2 747047007 746535301 746114492 745740294 745279074 744755447 744286299 743869364 743430734 742973328 742565453
2551.6 742565453 742198348 741743684 741181552 740669250 740248501 739771783 739221036 738777578 738452435 738030672
2572 738030672 737450421 736887038 736434758 735982955 735443890 734898508 734438062 733963788 733365357 732773066
2592.4 732773066 732314467 731855512 731276691 730670393 730149746 729670286 729093790 728447318 727889955 727399886
2612.8 727399886 726820052 726176858 725626171 725145996 724575758 723896563 723265052 722715497 722093046 721384704
2633.2 721384704 720774829 720274389 719684720 718961179 718265712 717683971 717077434 716332853 715607345 715063512
2653.5 715063512 714545608 713860810 713139892 712542713 711970925 711293042 710587442 709984720 709410429 708735943
2673.9 708735943 708017051 707374036 706782162 706105769 705381930 704786718 704258859 703612268 702865124 702175260
2694.3 702175260 701562345 700897574 700185657 699523687 698893011 698194027 697414458 696672261 696015358 695331872
2714.7 695331872 694586813 693912506 693338633 692714036 691987276 691276133 690636039 689995766 689289868 688608825
2735.1 688608825 688067734 687542498 686915994 686294019 685759783 685241461 684638321 683978438 683365941 682798684
2755.5 682798684 682171583 681472898 680811822 680210888 679609776 679024279 678485930 677928805 677262366 676493526
2775.9 676493526 675722897 674990177 674233735 673468828 672779143 672131658 671399057 670566738 669756174 668998539
2796.3 668998539 668173254 667236626 666317582 665459812 664547443 663558066 662564814 661565423 660507023
2814.7 660507023 659391224 658294141 657243848 656131387 654888153 653600276 652324915 650966287
2831 650966287 649444222 647854865 646255195 644448638 642217219 639576375 636618972 633457363 630475998
2849.3 630475998 628243744 626987815 626400054 626060188 625699580 625125766 624238908 623062313 621712923
2867.7 621712923 620380759 619244754 618274868 617345214 616509616 615827084 615179002 614441872 613648891
2886.1 613648891 612847030 611950994 610953510 609983027 609010875 607875824 606611133 605386972 604178548
2904.4 604178548 602822900 601242125 599418998 597332299 594958365 592465043 590257943 588601887
2920.7 588601887 587488830 586812317 586528659 586625934 586921215 587310135 587952614 588895619 590028644
2939.1 590028644 591305315 592630744 593818307 594748974 595404565 595860124 596188486 596426070 596689880
2957.4 596689880 597115874 597768366 598630250 599644363 600792766 602071762 603464484 604916394 606281936
2975.8 606281936 607532263 608762443 609867156 610732079 611512303 612330377 613090098 613654554 613972604
2994.2 613972604 614111006 614049733 613726914 613321126 612945318 612506151 612024844 611591995 611127675 610482216
3014.5 610482216 609646261 608753264 607929587 607143819 606273890 605291307 604335189 603518665 602757335 601872921
3034.9 601872921 600855112 599925697 599109590 598200977 597175002 596128821 595124841 594158292 593175709
3053.3 593175709 592198789 591228664 590246737 589321434 588492393 587729931 586940765 586051643 585143149 584340513
3073.7 584340513 583688736 583125949 582481325 581684649 580857515 580047488 579212904 578361452 577500045 576666355
3094.1 576666355 575901449 575179219 574416220 573529243 572601497 571782112 571014047 570144713 569248319 568470716
3114.5 568470716 567686856 566760838 565707862 564534366 563340604 562266111 561284125 560250819 559125960
3132.8 559125960 558016717 556998730 556003988 554892719 553678572 552485764 551335454 550235689
3149.2 550235689 549212098 548131704 546865225 545532405 544247031 542987764 541759372 540555537
3165.5 540555537 539332092 538111806 536941886 535766065 534518421 533266544 532089710 530916214
3181.8 530916214 529674351 528447449 527320266 526215911 525050104 523869276 522712469 521566451
3198.1 521566451 520448267 519377768 518307328 517228127 516175210 515154243 514179587 513203442 512181103
3216.5 512181103 511172175 510189474 509170294 508124411 507133007 506218374 505339146 504444540 503455818
3234.8 503455818 502389550 501339376 500307262 499318630 498413175 497493416 496450186 495361745 494384617
3253.2 494384617 493493289 492534101 491482586 490430325 489419639 488461524 487575769 486766040 485930711
3271.5 485930711 484979540 484014422 483112395 482231498 481376469 480564952 479764640 479005218 478376180 477825046
3291.9 477825046 477213681 476507902 475726962 474932730 474262714 473742247 473149627 472310632 471350163 470470935
3312.3 470470935 469690174 468877047 467991382 467108548 466272652 465448081 464506119 463448077 462427527
3330.7 462427527 461458653 460533857 459688812 458805919 457795352 456754148 455756605 454831213 453990251
3349 453990251 453094870 452019662 450887859 449910849 449108273 448319405 447500587 446768254 446095735 445299059
3369.4 445299059 444287986 443221807 442303598 441500843 440715313 439907789 439127713 438488305 437995523
3387.8 437995523 437573135 437069833 436370611 435653359 435177088 434859395 434354246 433588862 432877272 432386905
3408.2 432386905 431998461 431621999 431208551 430733025 430330753 430086583 429931134 429825813 429801017 429863751
3428.6 429863751 429904431 429957002 430138648 430250257 430113256 429952562 429989487 430221021 430569232 430916727
3449 430916727 431253284 431593686 431955904 432453632 433083564 433651090 434196055 434976041 435897261 436612964
3469.4 436612964 437054008 437503934 438138992 438941509 439819634 440606356 441330761 442147374 443015635 443862915
3489.8 443862915 444727421 445673257 446749777 447818160 448807955 449870676 450886548 451697856 452575922
3508.1 452575922 453727573 455047637 456295311 457360238 458403319 459590405 461004823 462406635
3524.4 462406635 463565618 464772582 466182709 467609853 469079137 470646918 472152799 473593175
3540.8 473593175 475104123 476740092 478369623 479866177 481411040 483155370 484935135 486658037
3557.1 486658037 488436967 490222961 491789222 493422747 495807797 498436302 500543892 502482951
3573.4 502482951 504591286 506803334 509109676 511444330 513591111 515743494 518335700 520949781
3589.7 520949781 523155868 525440276 528041899 530772448 533587277 536327660 538710117 540975392
3606 540975392 543666542 546552241 549351454 552179754 554812431 557763994 561341584 564384520 566481173
3624.4 566481173 568443954 571796358 575888157 578914762 581678927 584521651 587292194 590055108
3640.7 590055108 592466950 594329178 596474051 600270808 604548216 607087672 609177768 612202883
3657 612202883 615100741 617265344 619141579 620742440 622148573 624175906 626370668 627804279 629988551
3675.4 629988551 632561982 634249866 635716796 636882126 637653649 638955295 641055763 642681658
3691.7 642681658 643616974 644351959 644980490 645712435 646871209 647892058 648217082 648271859 648829401
3710 648829401 650210917 651347816 651762605 651955605 652254581 652656436 653101146 653576195 653677464 653393567
3730.4 653393567 653404236 654269993 655689836 656354427 655787826 655310988 656124234 656648219 656579196 657558978
3750.8 657558978 658776939 659028351 659034610 659514129 660038292 660093129 660108387 660269678 660730004 661410570
3771.2 661410570 661643445 661473513 661491454 661960304 662318230 662382245 662557364 662764728 662916839 662928998
3791.6 662928998 662693918 662554920 662407637 662325084 662868261 663143158 663336337 664011478 664048016 663345516
3812 663345516 662857175 663084984 663160563 663390219 664240539 664383948 664109707 663867235 663615227 663502991
3832.4 663502991 663363099 663429737 663904190 664279938 664551973 664776385 664457202 663334012 662075996
3850.8 662075996 662655473 664678752 665021479 664320111 663700521 663624287 663771451 663386941 663277268 663867354
3871.2 663867354 664273024 664324641 663884401 663511038 663533866 663553536 663955688 664029419 663573444 663711667
3891.6 663711667 663858891 663244188 662556171 662326813 662501037 663033009 663512588 663493335 663264394 662963271
3912 662963271 662485957 662212431 662341237 662391424 662205040 662130535 662111819 661850989 661643088 661803901
3932.3 661803901 661934018 661742330 661435068 661246419 661266506 661175907 660898626 660813272 660827518 660720348
3952.7 660720348 660616755 660566568 660495222 660430133 660362661 660210133 660017967 659887552 659817994 659745932 659673870 659601152
3977.2 659601152 659499109 659396172 659287333 659117639 658951521 658865035 658792675 658670545 658512592 658375442
3997.6 658375442
##END=$$ End of the data block
