##TITLE=$$ Begin of the data block
##JCAMP-DX=5.00 $$ ACD/SpecManager v 10.08
##SPECTROMETER/DATA SYSTEM=Alpha
##DATE=11 Nov 2014 09:02:30
##DATA TYPE=INFRARED SPECTRUM
##DATA CLASS=XYDATA
##ORIGIN=
##OWNER=
##NPOINTS=1765
##FIRSTX=399.76428223
##LASTX=3997.64306641
##MAXX=3997.64306641
##MINX=399.76428223
##MAXY=0.79458702
##MINY=0.47632101
##XFACTOR=1.0000000000
##YFACTOR=1.000000000000000e-9
##FIRSTY=0.69026184
##DELTAX=2.03961372
##XUNITS=1/CM
##YUNITS=ARBITRARY UNITS
##XYDATA=(X++(Y..Y))
399.8 690261841 690074205 689131320 688075721 687556446 686912954 685690463 684998512 685386956 685306966 683585823
420.2 683585823 682502985 682401419 681454301 679926693 679889441 681066692 680918932 679595768 679643035
438.5 679643035 680680335 680052578 678400695 678685129 679898918 679230213 677655399 677779794 678456366
456.9 678456366 676848710 674755692 675085962 676026464 674779534 673165381 673890412 674846530 673268735
475.2 673268735 671498001 672268689 673353851 671684504 669649839 670644522 672182202 670837939 668924153
493.6 668924153 669757664 671025991 669559777 667399287 667678773 668406308 666590512 664357543 664788306
511.9 664788306 665605366 663507760 660742879 660921454 661952138 660459042 658210099 658484817 659392238
530.3 659392238 657847404 655863523 656701028 658521652 658188462 657544494 659615397 662312925 662109435
548.7 662109435 660657704 661368787 662775576 661687970 659806073 660605609 662567019 662134826 660561264
567 660561264 661177576 662658870 661786079 660010636 660643399 662323534 661859095 660523534 661230922
585.4 661230922 662738383 662226200 660802901 661379457 662891567 662382424 660906792 661436617 662796199
603.7 662796199 661923945 660013735 660229564 661601543 661051571 659389853 659765363 661614656 662006915
622.1 662006915 661510468 662738383 664943218 665389836 664597094 665300786 667155385 667441249 666593730
640.4 666593730 667492270 669854999 670787036 670457125 671706021 674204886 675004423 674224198 674589872
658.8 674589872 676124513 676312447 674974561 674765110 677164674 678423226 678249955 679316580 681858420
677.2 681858420 683360159 683298647 684089720 686205387 687242508 686656356 686743915 688182771 688850105
695.5 688850105 688032150 687882304 689387619 690682411 690772295 691333234 693245292 694862723 695272267
713.9 695272267 695964336 697877765 699729443 700616360 701762617 704042554 706151962 707051277 707841337
732.2 707841337 709426999 710759699 710975826 711131752 712226629 713402510 713655651 713663161 714333296
750.6 714333296 715074778 715001345 714690447 715044022 715565383 715605974 715726912 716561973 717683375 718437672
771 718437672 719063103 720114231 721362829 722345114 723393679 724939764 726564467 727754712 728860259
789.3 728860259 730321765 731746852 732731342 733617127 734633505 735393286 735687971 735924900 736422181
807.7 736422181 736875415 737063468 737378061 738008797 738375127 738035738 737233579 736251235 735239208 734770596
828.1 734770596 735550165 737288773 739042461 740696073 742917717 745658636 747803748 748791039 749315739
846.4 749315739 749770105 749598026 748870671 748768806 749761999 750844419 751271307 751601994 752295196 752689183
866.8 752689183 752241135 751572192 751240194 750652611 749295950 747718871 746405303 744857490 742621779
885.2 742621779 740373194 738924444 737863779 736562014 735616028 735793173 736510098 736768425 736779511
903.5 736779511 737127364 737300038 736589074 735432208 734658897 734102190 733124793 732013404 731485844
921.9 731485844 731333792 730817676 729903519 729065418 728160441 726480365 723944247 721196830 718350887
940.3 718350887 714874446 710808337 706907988 703555942 700481534 697697222 695679128 694388866
956.6 694388866 693164647 691759646 690489590 689333498 687781096 685617626 683134854 680409849
972.9 680409849 677077115 673014820 668631256 664228499 659708500 655172169 651118398 647743046
989.2 647743046 644717336 641844153 639208496 636604309 633576512 630171120 626886368 623897672
1005.5 623897672 620984077 618133187 615680277 613699615 611901402 610274255 609162629 608648062
1021.8 608648062 608350098 608101249 608218908 608743906 609267890 609686017 610372126 611386955 612110376
1040.2 612110376 612122893 611833036 611687481 611480236 611011446 610661328 610732973 610851705 610643327 610480905
1060.6 610480905 610777259 611096919 610850692 610289216 609969556 609860361 609754324 610075414 611439705
1079 611439705 613556206 615505934 617013872 618414640 619583666 619943917 619523644 619057953 618837357
1097.3 618837357 618423760 617808819 617751420 618546247 619580746 620551288 622050524 624375165 626821578
1115.7 626821578 628816485 630748332 633035004 635228038 636840999 638362408 640421510 642515063
1132 642515063 643747211 644251823 644691765 644972146 644625127 644002259 643966675 644591391 645259500 645977139
1152.4 645977139 647392988 649515033 651657343 653804362 656763077 660852194 665479302 670244217
1168.7 670244217 675527811 681427002 687162340 692221582 697051466 701931715 706242681 709474027
1185 709474027 712024927 714333534 715940058 716277003 715790331 715254486 714578390 713396370 712168813
1203.4 712168813 711621046 711535454 711175025 710476041 709847629 709148526 707799673 705860734 704024494
1221.7 704024494 702460349 700646341 698506474 696641088 695288002 694038689 692744076 691823244
1238.1 691823244 691469610 691282451 690977812 690900207 691315234 691814840 691974580 692066550 692499816 693059683
1258.4 693059683 693359315 693624556 694282770 695105493 695637047 695990384 696529388 697096467 697227418 696899474
1278.8 696899474 696549833 696364164 696061194 695567131 695143878 694761336 694037855 692890465 691595018
1297.2 691595018 690219343 688515484 686485469 684458375 682525814 680506229 678364992 676335037
1313.5 676335037 674604058 673118591 671765804 670619249 669711828 668814003 667748809 666637301 665653348
1331.9 665653348 664779365 663981974 663332522 662858844 662431657 661989152 661578119 661203265 660765052 660262585
1352.3 660262585 659857094 659572005 659255862 658778429 658057272 657028317 655788481 654298007 652552307
1370.6 652552307 650478244 647657633 643672526 636377573 621795475 604349434 599568903 613206327
1386.9 613206327 630153775 638590991 641663194 642766893 642881274 642544389 642039239 641685903 641639948
1405.3 641639948 641720831 641884863 642149746 642511785 643094003 644078493 645308256 646311760 647386074
1423.7 647386074 648609221 649827838 651125848 652273118 653251350 654494464 655672312 656370580 657104731
1442 657104731 657992959 658977926 660024703 660941899 661756814 662851393 664932072 667315960 668535054
1460.4 668535054 669741571 671818733 674194157 676497579 679675400 684360385 688931406 692385554
1476.7 692385554 695258558 697785139 699920118 701593339 703014135 703986228 703873277 702994585 702061772
1495 702061772 700823069 698802233 696496844 694612086 693134129 690825164 687767744 685170531 682992339
1513.4 682992339 681197464 679867327 679182112 678805351 677880704 676649153 675511539 674501240 673628211
1531.8 673628211 672615170 671600044 671271384 671442270 670797050 669834554 669250011 669014037 669127882
1550.1 669127882 669696927 670745611 672056079 673713326 674459279 674026430 673644364 673265576 672808707
1568.5 672808707 672081113 670872331 669370353 667154133 664427757 661690891 658634126 655330420
1584.8 655330420 652054906 648703873 645010352 641193211 637637377 634369433 631152272 627964199
1601.1 627964199 625027239 622366250 619664431 616688848 613754034 611205280 608719289 605644643
1617.4 605644643 602760613 600498080 598114729 595444143 592894137 590612829 588836968 587753415
1633.7 587753415 587102294 586366117 585656703 585296512 585514307 586570263 587619781 588026881 589229465
1652.1 589229465 591276288 592108846 592840433 594454706 597010493 599722445 602091551 605118394 608834863
1670.5 608834863 612002552 615399480 619223416 622610331 625961840 630293846 635978103 640438795
1686.8 640438795 644059479 648132741 652200460 657171547 662800372 668006063 673409581 677478492
1703.1 677478492 680897176 684232175 686778188 688984632 691054583 692955971 694662452 695540369
1719.4 695540369 695769668 695953310 696277499 696888685 697773397 698706329 699900627 701002002 701942146
1737.8 701942146 703344166 705053806 707090974 709686399 712559462 715609193 718800962 721872151
1754.1 721872151 725048900 728266001 731578708 735372901 738607645 741146505 743900776 747090936
1770.4 747090936 750244677 752284110 753640532 755396128 757313848 758675694 759819090 761256039
1786.7 761256039 762760341 764111936 765316367 766403615 767491281 768412828 769113123 769972563 771018505
1805.1 771018505 771863699 772467136 773242474 774180591 774882019 775305569 775896430 776831508 777729869 778278410
1825.5 778278410 778827190 779779077 780481100 780612588 780869186 781576395 782292187 782746673 783259034 783917367
1845.9 783917367 784393787 784572959 784710586 785170972 785799444 786150813 786312699 786709964 787330449 787824452
1866.3 787824452 788121104 788417101 788754761 788975000 789040148 789216697 789609373 789977670 790177822 790397823
1886.7 790397823 790790141 791096926 791181087 791305363 791571200 791828573 792002976 792152703 792361319 792622983
1907.1 792622983 792840242 792953014 793022752 793168724 793426394 793645740 793750823 793830335 793889165 793964088
1927.5 793964088 794040978 794050097 794077575 794204891 794330955 794370592 794452131 794582903 794587016 794456959 794374168
1949.9 794374168 794444203 794517636 794424891 794285476 794343889 794488311 794471979 794374764 794395447 794466794 794382036
1972.3 794382036 794200599 794203579 794386864 794387519 794147015 794031382 794156551 794195235 794018626 793919921 794024467
1994.8 794024467 794049621 793816924 793610394 793652654 793672442 793434858 793194532 793202817 793229640 793009758 792732775
2017.2 792732775 792668104 792661190 792432725 792102277 791993797 792005420 791806281 791476190 791342497 791382968
2037.6 791382968 791298330 791069984 790960670 791026115 790988386 790754676 790617049 790695488 790716231 790537775
2058 790537775 790399134 790464401 790507793 790345907 790218055 790295362 790352166 790229023 790104687 790128708 790186584
2080.4 790186584 790134609 790041387 790039897 790061533 790004432 789940774 789951146 789957821 789910078 789912283 789996922 790044963
2104.9 790044963 790008664 789981842 790020168 790058017 790026903 790000796 790046215 790081799 790068030 790108204 790251911
2127.3 790251911 790346861 790277302 790209770 790295362 790374398 790345192 790375590 790543675 790671289 790615976 790545404
2149.8 790545404 790674686 790851891 790834010 790789306 790969014 791190982 791191459 791122019 791245222 791467190 791541219
2172.2 791541219 791546106 791735113 792022586 792115569 792047501 792129397 792384267 792522669 792490304 792566359 792854488
2194.6 792854488 793027997 792928576 792909861 793149650 793327868 793260992 793214738 793403924 793594539 793543041
2215 793543041 793468118 793609083 793786407 793759763 793689191 793831110 794018745 793961048 793790877 793859482 794099569
2237.5 794099569 794134915 793989599 794014394 794217110 794284701 794161558 794115782 794239581 794292033 794176459
2257.9 794176459 794135153 794257700 794309139 794192433 794103742 794171989 794251502 794189453 794107616 794149101 794171572
2280.3 794171572 794039249 793908715 793899059 793889761 793749928 793530881 793390036 793320239 793194473 793007076
2300.7 793007076 792819917 792619526 792352557 792028785 791742206 791539848 791319370 790986180 790569782 790161788
2321.1 790161788 789835095 789570570 789279759 788964033 788722515 788498640 788178504 787818670 787534654 787417889
2341.5 787417889 787512541 787705362 787629366 787089348 786266267 785448909 784770489 784221351 783831120 783633173
2361.9 783633173 783623695 783793569 784044802 784251750 784385443 784543633 784778833 784977257 785055578 785056591
2382.3 785056591 785032809 784928322 784687817 784419239 784234047 784045815 783752024 783437073 783196926 782974839
2402.7 782974839 782690763 782359540 782064795 781807542 781486928 781120181 780801177 780485868 780039787 779434264
2423.1 779434264 778854191 778529584 778432727 778353512 778219640 778053522 777825892 777533054 777251184 777016521
2443.5 777016521 776757836 776434958 776104569 775824487 775549889 775219858 774867296 774546742 774252295 773932993
2463.9 773932993 773581743 773230791 772854209 772437632 772051334 771699667 771308959 770891488 770516753 770174444
2484.3 770174444 769786537 769358754 768966556 768607318 768235624 767847359 767470479 767107308 766728103 766325891
2504.7 766325891 765945375 765617609 765275836 764870942 764494956 764207780 763903797 763515651 763137043 762826324
2525.1 762826324 762486100 762051523 761630177 761305630 760967016 760547221 760186732 759932399 759618878 759160995
2545.5 759160995 758695662 758372009 758101642 757703185 757231295 756870925 756577253 756173849 755717337 755394936
2565.8 755394936 755154431 754768372 754249156 753831923 753544033 753192008 752719760 752277792 751933575 751556754
2586.2 751556754 751082599 750645936 750323057 749963462 749457419 748961687 748625576 748306990 747810066 747241795
2606.6 747241795 746831954 746502101 746035933 745500684 745086074 744741917 744296432 743766963 743317425 742961407
2627 742961407 742524922 741980672 741496265 741111279 740691662 740177929 739674509 739234269 738777399 738264918
2647.4 738264918 737781405 737374425 736935735 736403108 735890985 735494256 735121191 734638691 734099448 733629286
2667.8 733629286 733202457 732730269 732226610 731771171 731358111 730882227 730330288 729828060 729404032 728933811
2688.2 728933811 728374243 727846801 727427006 726987064 726421237 725829005 725307584 724818349 724292696 723739147
2708.6 723739147 723224461 722765744 722277462 721712768 721156776 720649302 720130384 719598293 719104886 718635440
2729 718635440 718157053 717652559 717127562 716646314 716220915 715786219 715343833 714954019 714574099 714125395
2749.4 714125395 713646531 713197649 712775528 712320149 711809754 711336136 710967839 710645199 710251510 709765077
2769.8 709765077 709288239 708845675 708325684 707737148 707210839 706719518 706157148 705577493 705066681 704550505
2790.2 704550505 703937888 703263462 702623665 702041864 701414645 700682700 699916482 699178815 698427856 697614431
2810.6 697614431 696792901 696001768 695196092 694339275 693453550 692561150 691622496 690590382 689492285
2828.9 689492285 688392222 687249422 685957074 684480488 682795823 680787027 678292811 675283372
2845.3 675283372 672052681 669218242 667301595 666334748 666024268 666009843 665962160 665680766 665105164
2863.6 665105164 664272189 663263202 662208855 661262929 660472631 659806848 659264147 658827424 658402562
2882 658402562 657868683 657181442 656369448 655467868 654528856 653570533 652528942 651377857 650197923
2900.3 650197923 649031043 647791326 646409988 644836545 642984867 640794516 638272285 635681272
2916.6 635681272 633474469 631887496 630875528 630328953 630229354 630530417 631040752 631669164 632477164
2935 632477164 633521736 634788930 636134744 637378991 638389230 639036298 639305472 639332712 639182985
2953.4 639182985 638934016 638828278 639067531 639701545 640686870 641927123 643338442 644908071 646608114
2971.7 646608114 648293555 649799168 651159286 652460396 653556645 654348493 655006289 655719817 656485379
2990.1 656485379 657084465 657343149 657405496 657395899 657212615 656873226 656507850 656159699 655816317 655471623
3010.5 655471623 655103445 654650033 654066801 653369606 652631223 651935220 651242137 650458872 649689198 649088204
3030.9 649088204 648572922 647873282 646955729 646153510 645561039 644886196 644010425 643107474 642315447 641549289
3051.3 641549289 640701592 639861703 639083266 638302088 637526751 636823893 636213899 635561109 634765387 633970439
3071.7 633970439 633340657 632879198 632429063 631822050 631111443 630398631 629625738 628835142 628147602 627473235
3092.1 627473235 626716495 625960052 625294268 624648511 623883724 623063922 622373402 621764123 621020317 620191157
3112.4 620191157 619474888 618813157 618039966 617072225 615965605 614901960 613966882 613075495 612135291
3130.8 612135291 611155748 610192955 609290898 608388662 607362211 606244445 605134249 604067266 603120208
3149.2 603120208 602269113 601275206 600053012 598802805 597630858 596485376 595360219 594263434 593154192
3167.5 593154192 592022121 590893805 589775741 588679373 587587476 586466849 585331976 584156871
3183.8 584156871 582941115 581817627 580798268 579732060 578587651 577448308 576352239 575285673
3200.1 575285673 574241161 573221922 572213829 571161687 570076287 569061697 568114698 567137539 566123843
3218.5 566123843 565144539 564196229 563219607 562230349 561296582 560453236 559613943 558624268 557516634
3236.9 557516634 556433380 555396855 554401577 553471744 552552938 551530302 550427794 549389660 548436165
3255.2 548436165 547463834 546425462 545384645 544398427 543446541 542532384 541674912 540774047 539775848
3273.6 539775848 538770795 537795722 536861837 535997808 535170972 534344852 533557892 532881021 532237828
3291.9 532237828 531468391 530607522 529743195 528916419 528233349 527677894 527048647 526190996 525140941
3310.3 525140941 524075329 523134232 522249758 521292448 520282805 519292414 518309236 517234802 516073465
3328.6 516073465 514927506 513818502 512785912 511827946 510770679 509554565 508318186 507126451
3345 507126451 506053686 505137503 504135013 502888680 501595914 500462532 499471396 498474419 497446448
3363.3 497446448 496535927 495710015 494737238 493546873 492333084 491274118 490322262 489374787 488394171
3381.7 488394171 487459391 486681849 486087024 485617638 485069185 484288573 483466566 482887775 482457846 481797606
3402.1 481797606 480886221 480114102 479575813 479099035 478629738 478084743 477489769 477061182 476798832 476562858
3422.5 476562858 476377010 476321012 476374120 476408809 476457417 476620346 476713359 476569563 476392627 476417392 476685792
3444.9 476685792 477089763 477410376 477686048 478104860 478641868 479240328 479935765 480602622 481197417 481978893
3465.3 481978893 482947290 483747870 484274477 484815836 485532314 486420840 487415820 488307595 489101082 489998460
3485.7 489998460 490970194 491918504 492893666 493970722 495151937 496248513 497279704 498427629 499470890
3504 499470890 500334442 501345277 502566636 503834605 505012989 506091356 507237613 508582354 510136127
3522.4 510136127 511639774 512905896 514125228 515426993 516844511 518429279 520004332 521441460
3538.7 521441460 523014605 524864376 526772797 528384030 529736876 531288326 533044457 534673572
3555 534673572 536272526 538109422 540017307 541746795 543693960 546219528 548527658 550249040 552023470
3573.4 552023470 554111719 556335688 558651865 560986042 563266873 565727532 568343341 570617139
3589.7 570617139 572700083 575096190 577693760 580257833 582853973 585361779 587654054 590028822
3606 590028822 592735767 595479429 598190725 600874066 603389382 606306314 609549999 612047434 613899171
3624.4 613899171 616141200 619711876 623309612 625716925 628022254 630525231 633036673 635567725
3640.7 635567725 637953401 640223086 643061399 646937251 650138915 651763022 653556585 656198919
3657 656198919 658603549 660506606 662232995 663810194 665530324 667837381 670000553 671621501 673664391
3675.4 673664391 675434113 676405966 677295625 678256810 679462969 681311548 683200479 684071898 684451878
3693.7 684451878 684971571 685638547 686472952 687431753 688065588 688455164 689093471 690146267 691197157
3712.1 691197157 691581190 691581428 691746593 692188323 692693830 693107963 693361819 693388462 693529963 694262445
3732.5 694262445 695386350 696141064 696132064 695702791 695754111 696595848 697085619 697309196 697949231 698316872
3752.9 698316872 698186576 698201120 698511243 698623300 698550820 698693752 699002624 699388862 699608386 699501455
3773.3 699501455 699449718 699749291 700141907 700195849 700156748 700282633 700376987 700383544 700352013 700401604 700655699
3795.7 700655699 700851083 701087117 701423645 701308787 701227188 701370239 701184452 700893223 700978994 701360583
3816.1 701360583 701572657 701879561 702120781 701868117 701609910 701502085 701483607 701561034 701716542 702052236
3836.5 702052236 702359259 702327013 702148855 701915920 701518655 701072991 701043308 701891243 702520192 702065706
3856.9 702065706 701491952 701317608 701508522 701552153 701318979 701381803 701579690 701514900 701260924 700870037
3877.3 700870037 700753748 700924635 701088428 701225996 700974524 700650632 700700343 700593054 700226784 700060666
3897.7 700060666 700108230 700248957 700436175 700356781 699955523 699534118 699270308 699224412 699355245 699410319
3918.1 699410319 699238956 699022770 698942840 698882461 698725641 698674142 698737085 698615313 698317349 698057830
3938.5 698057830 697956026 697952032 697856843 697750628 697747588 697678208 697501361 697343111 697220325 697080731 696897626
3960.9 696897626 696736395 696683049 696674168 696614563 696524501 696438968 696358502 696275592 696172595 696088314 696044922
3983.3 696044922 695938706 695754766 695616126 695547462 695473909 695356727 695254505
3997.6 695254505
##END=$$ End of the data block
