##TITLE=$$ Begin of the data block
##JCAMP-DX=5.00 $$ ACD/SpecManager v 10.08
##SPECTROMETER/DATA SYSTEM=Alpha
##DATE=11 Nov 2014 09:02:30
##DATA TYPE=INFRARED SPECTRUM
##DATA CLASS=XYDATA
##ORIGIN=
##OWNER=
##NPOINTS=1765
##FIRSTX=399.76428223
##LASTX=3997.64306641
##MAXX=3997.64306641
##MINX=399.76428223
##MAXY=0.79572940
##MINY=0.47422937
##XFACTOR=1.0000000000
##YFACTOR=1.000000000000000e-9
##FIRSTY=0.68856233
##DELTAX=2.03961372
##XUNITS=1/CM
##YUNITS=ARBITRARY UNITS
##XYDATA=(X++(Y..Y))
399.8F88562334L12984m02153p70867o07371p58529j050711l53336N48363k86460k019048
$$ 688562334 688875318 688473165 687702298 687094927 686336398 685285687 684932351 685480714 685194254 683175206
420.2F83175206j087367k2829j050055j782179l80993Q10564j57774q44717K82109
$$ 683175206 682087839 682065010 681014955 679232776 678851783 679662347 679504573 678659856 678941965
438.5F78941965P19667q31485j480699M53234J169801q33989j600146K07782O05166
$$ 678941965 679661632 678830147 677349448 677802682 678972483 678138494 676538348 676746130 677351296
456.9F77351296j713276j986146M98176R65595j418829j921356P18475J441538j307130
$$ 677351296 675638020 673651874 674150050 675115645 673696816 671775460 672493935 673935473 672628343
475.2F72628343j930594O71327J145363j677990k168835R20415J591504j311123j953900
$$ 672628343 670697749 671369076 672514439 670836449 668667614 669588029 671179533 669868410 667914510
493.6F67914510Q23259J236320j584292k093792O21081R46164k028823k663016K28941
$$ 667914510 668737769 669974089 668389797 666296005 666917086 667863250 665834427 663171411 663400352
511.9F63400352R48787j822949k588153J60516Q32677j756847k274871N41866J058221
$$ 663400352 664349139 662526190 659938037 660098553 660931230 659174383 656899512 657441378 658499599
530.3F58499599j729727k111316J062572K067447l61562q72612J829564K574683j95742
$$ 658499599 656769872 654658556 655721128 657788575 657427013 656554401 658383965 660958648 660762906
548.7F60762906j292884R54687J526058j111984j878441Q75116J931310o22869j654446
$$ 660762906 659470022 660424709 661950767 660838783 658960342 659835458 661766768 661143899 659489453
567F59489453P20441J495421r52661j727581P47442J677513n91993j433551P30574
$$ 659489453 660209894 661705315 660752654 659025073 659772515 661450028 660858035 659424484 660155058
585.4F60155058J517475o25134j547694O35862J745343l65793j533270M00185J283706
$$ 660155058 661672533 661047399 659499705 660135567 661880910 661515117 659981847 660382032 661665738
603.7F61665738q37267j868665J44124J277208n26070j563430M18365J855969L94583
$$ 661665738 660828471 658959806 659103930 660381138 659855068 658291638 658710003 660565972 660960555
622.1F60960555n13136J303851K389610N29528q50320O41107J849890L58403p55787
$$ 660960555 660447419 661751270 664140880 664670408 663820088 664461195 666311085 666669488 665913701
640.4F65913701R73404K403974R16898l75509J129329K376378Q09967p45892L23713
$$ 665913701 666887105 669291079 670207977 669832468 670961797 673338175 674148142 673402250 673725963
658.8F73725963J491785K23636j165807J6153K366722J102447j56581J161337K554893
$$ 673725963 675217748 675441384 674275577 674291730 676658452 677760899 677604318 678765655 681320548
677.2F81320548J451373p7545P60853K030849R95040n42819J77085J473844O16431
$$ 681320548 682771921 682694376 683455229 685486078 686481118 685938299 686115384 687589228 688205659
695.5F88205659q31723p8380J572132J244843j5735N49316J966536J632214L87966
$$ 688205659 687373936 687295556 688867688 690112531 690096796 690646112 692612648 694244862 694632828
713.9F94632828O84679J905501J829743Q53896J143038K330125K163827R26495Q05020
$$ 694632828 695317507 697223008 699052751 699906647 701049685 703379810 705543637 706470132 707275152
732.2G07275152J630306J403094K85625J74880J043856J121045K23934J2279P19666
$$ 707275152 708905458 710308552 710594177 710769057 711812913 712933958 713157892 713170171 713889837
750.6G13889837P90775j19686m64499K49624N85675J46568J53840Q71777J172007P55429
$$ 713889837 714680612 714560926 714096427 714346051 714931726 715078294 715232134 716103911 717275918 718031347
771G18031347O16014J085639J290440J002312J057148J539409J591087J173377J127481
$$ 718031347 718647361 719733000 721023440 722025752 723082900 724622309 726213396 727386773 728514254
789.3G28514254J446545J367808R60350R44614J116097P67112K28345K54750N56171
$$ 728514254 729960799 731328607 732288957 733233571 734349668 735116780 735345125 735599875 736156046
807.7G36156046M45486K35021M49359O60718K44379m68970q24392r11891r33170m29750
$$ 736156046 736601532 736836553 737285912 737946630 738191009 737722039 736897647 735985756 735052586 734622836
828.1G34622836Q06928J797557J776457J642227K268552K792776K142191R67741N15461
$$ 734622836 735429764 737227321 739003778 740646005 742914557 745707333 747849524 748817265 749332726
846.4G49332726M27604k14875p67469j32919R92418J057803L80933L94166Q27670M08590
$$ 749332726 749760330 749545455 748777986 748645067 749637485 750695288 751076221 751470387 752298057 752706647
866.8G52706647n11348o55592k91467o22570j460254j632095j243472j464665k219557
$$ 752706647 752195299 751539707 751248240 750625670 749165416 747533321 746289849 744825184 742605627
885.2G42605627k245725j480996j131416j307487q78751K15053P24852K77400l6180
$$ 742605627 740359902 738878906 737747490 736440003 735561252 735776305 736501157 736778557 736742377
903.5G36742377K84970K01047o90818j195133p99656n51939r49323j078665n10395
$$ 736742377 737027347 737228394 736537576 735342443 734542787 733990848 733041525 731962860 731452465
921.9G31452465j61588n84543j015544q87871q95500j651585k508879k731442k841592
$$ 731452465 731290877 730706334 729690790 728802919 727907419 726255834 723746955 721015513 718173921
940.3G18173921l471494m011333l808260l313005l083229k805590k058387j303434
$$ 718173921 714702427 710691094 706882834 703569829 700486600 697681010 695622623 694319189
956.6F94319189j201570j403034j264751j138747j581311k210617k479553k694369
$$ 694319189 693117619 691714585 690449834 689311087 687729776 685519159 683039606 680345237
972.9F80345237l348648m097939m376292m392564m514099m495441m016698l379583
$$ 680345237 676996589 672898650 668522358 664129794 659615695 655120254 651103556 647723973
989.2F47723973l035307k881467k679646k630592k958357l316045l272891l013432
$$ 647723973 644688666 641807199 639127553 636496961 633538604 630222559 626949668 623936236
1005.5F23936236k927184k869964k463102j937688j754403j637757j130282n41211
$$ 623936236 621009052 618139088 615675986 613738298 611983895 610346138 609215856 608674645
1021.8F08674645l29613k51413J23561N28812N25117M28796O96480J000583P31469
$$ 608674645 608345032 608093619 608217180 608745992 609271109 609699905 610396385 611396968 612128437
1040.2F12128437N7101k62082j57118k30789m93169l78966N6446J30355j75953j37865
$$ 612128437 612185538 611923456 611766338 611535549 611042380 610663414 610719860 610850215 610674262 610536397
1060.6F10536397L09169L32773k35379n46515l02911j17838j52052K94447J377463
$$ 610536397 610845566 611178339 610942960 610396445 610093534 609975696 609823644 610118091 611495554
1079F11495554K121747J932502J473784J385927J192511L82125l83735m08888k00212
$$ 611495554 613617301 615549803 617023587 618409514 619602025 619984150 619600415 619191527 618991315
1097.3F18991315m30882o48141q6963P82669J044571J010299J534820K330482K445995
$$ 618991315 618560433 617912292 617825329 618607998 619652569 620662868 622197688 624528170 626974165
1115.7F26974165K025366J982212K294422K152979J577794J487375K020180K096295
$$ 626974165 628999531 630981743 633276165 635429144 637006938 638494313 640514493 642610788
1132F42610788J273632N49138M65691K57790m06444o40809O437O54518O66976P08104
$$ 642610788 643884420 644433558 644899249 645157039 644750595 644109786 644116223 644770741 645437717 646145821
1152.4F46145821J388251K102852K164901K169489K964080M082143M597962M737437
$$ 646145821 647534072 649636924 651801825 653971314 656935394 661017537 665615499 670352936
1168.7F70352936N271137N917549N783319N095601M828513M859388M294812L215135
$$ 670352936 675624073 681541622 687324941 692420542 697249055 702108443 706403255 709618390
1185G09618390K542317K312481J625836L62336n07295o06894p18832j156390j191616
$$ 709618390 712160707 714473188 716099024 716461360 715954065 715347171 714628339 713471949 712280333
1203.4G12280333n39303p7545l53754p09176o34551p03752j358926j921773j819551
$$ 712280333 711741030 711663485 711309731 710600555 709966004 709262252 707903326 705981553 704162002
1221.7G04162002j596153j853347k142489j839876j308561j220047j306891r13442
$$ 704162002 702565849 700712502 698570013 696730137 695421576 694201529 692894638 691981196
1238.1F91981196l01122j58429l14117p4685M24266M76838J25825P8380M28021N58794
$$ 691981196 691680074 691521645 691207528 691132843 691557109 692033947 692159772 692238152 692666173 693224967
1258.4F93224967L18408K87413O61492Q17657N27501L35693N03779N33700J14202l03447
$$ 693224967 693543375 693830788 694492280 695309937 695837438 696173131 696676910 697210610 697324812 697021365
1278.8F97021365k94685j54555l17335n54681n01454m11630o84142j107633j303196
$$ 697021365 696726680 696572125 696254790 695700109 695198655 694787025 694102883 692995250 691692054
1297.2F91692054j393795j694500k011776k031088j956046k044856k163828k046108
$$ 691692054 690298259 688603759 686591983 684560895 682604849 680559993 678396165 676350057
1313.5F76350057j738429j500726j369536j137554q92401q98361j065910j104117r92357
$$ 676350057 674611628 673110902 671741366 670603812 669711411 668813050 667747140 666643023 665650666
1331.9F65650666r00924q10683o36220m37021l91126m36485m18246l53217l78072m48465
$$ 665650666 664749742 663939059 663302839 662865818 662474692 662038207 661619961 661266744 660888672 660440207
1352.3F60440207l99590l19123l50714m96447p24137j001239j200557j450479j698076
$$ 660440207 660040617 659721494 659370780 658874333 658150196 657148957 655948400 654497921 652799845
1370.6F52799845k006054k694369l788352o938040j3862729j6595065m588306J2911200
$$ 652799845 650793791 648099422 644311070 637373030 623510301 606915236 602326930 615238130
1386.9F15238130J6081035P976175K841711R79125O2049l50178m89890l57271o6638
$$ 615238130 631319165 639295340 642137051 643116176 643178225 642828047 642338157 641980886 641914248
1405.3F41914248P2778J43110K45631L62396N53906R28522J218795J018525J084387
$$ 641914248 641987026 642130136 642375767 642738163 643292069 644220591 645439386 646457911 647542298
1423.7F47542298J253486J217365J251697J142025J006425J250744J210034P53164
$$ 647542298 648795784 650013149 651264846 652406871 653413296 654664040 655874074 656627238
1440F56627238P46369Q47757R19282J020968R46463P99357R85265J955509K449394
$$ 656627238 657373607 658221364 659140646 660161614 661108077 661907434 662892699 664848208 667297602
1458.3F67297602J397550J266897K026855K366424K336383L150761M614353M567147
$$ 667297602 668695152 669962049 671988904 674355328 676691711 679842472 684456825 689023972
1474.7F89023972L521442K941728K573371K143263J622200J335025R21190q1003q35478
$$ 689023972 692545414 695487142 698060513 700203776 701825976 703161001 704082191 704001188 703165710
1493G03165710r49860j287877k020538k269030j899123j592874k386153k961874k512157
$$ 703165710 702215850 700927973 698907435 696638405 694739282 693146408 690760255 687798381 685286224
1511.4F85286224k172828j853585j398861p34449l95060q61227j145959j091123r83417
$$ 685286224 683113396 681259811 679860950 679126501 678731441 677870214 676724255 675633132 674649715
1529.7F74649715q56876r87947r78887l64244N4955o49690q57115m95374j86682J16348
$$ 674649715 673792839 672804892 671826005 671461761 671516716 670867026 670009911 669514537 669327855 669444203
1550.1F69444203N22316R71436J200557J570046Q50022l25918l58820l72350m62056
$$ 669444203 669966519 670937955 672138512 673708558 674558580 674232662 673873842 673501492 673039436
1568.5F73039436p21097j217365j586974k281427k685606k679050l030897l319084
$$ 673039436 672318339 671100974 669514000 667232573 664546967 661867917 658837020 655517936
1584.8F55517936l322780l408611l739119l857732l604531l317416l267824l244519
$$ 655517936 652195156 648786545 645047426 641189694 637585163 634267747 630999923 627755404
1601.1F27755404k989352k703071k738476l018856k984583k600253k561629l150463
$$ 627755404 624766052 622062981 619324505 616305649 613321066 610720813 608159184 605008721
1617.4F05008721k917051k306342k439320k696455k572000k297282j768887j090705
$$ 605008721 602091670 599785328 597346008 594649553 592077553 589780271 588011384 586920679
1633.7E86920679o83666p33256o57082l12566J86264R98497J147211N41806J245856
$$ 586920679 586237013 585503757 584846675 584534109 584720373 585718870 586866081 587407887 588653743
1652.1E88653743K139509R82404Q12530J637459K593935K776384K371848K989411L751039
$$ 588653743 590793252 591775656 592588186 594225645 596819580 599595964 601967812 604957223 608708262
1670.5F08708262L251076L451586L867209L413200L311336M248381N723178M607916
$$ 608708262 611959338 615410924 619278133 622691333 626002669 630251050 635974228 640582144
1686.8F40582144L713012M109740M040599M898310N568266N189359N483866M164815
$$ 640582144 644295156 648404896 652445495 657343805 662912071 668101430 673585296 677750111
1703.1F77750111L485441L426730K604664K193808K021254J841425J663268R10878
$$ 677750111 681235552 684662282 687266946 689460754 691482008 693323433 694986701 695897579
1719.4F95897579L09348K44320L33190N84960Q61883Q97050J169979J179159J023889
$$ 695897579 696206927 696451247 696784437 697369397 698231280 699128330 700298309 701477468 702501357
1737.8G02501357J418650J698375K034068K586424K849221L032506L214538L124654
$$ 702501357 703920007 705618382 707652450 710238874 713088095 716120601 719335139 722459793
1754.1G22459793L221035L231168L282249L763199L260553K582788K773106L152549
$$ 722459793 725680828 728911996 732194245 735957444 739217997 741800785 744573891 747726440
1770.4G47726440L096521K060235J412690J792252J966655J427889J177788J423954
$$ 747726440 750822961 752883196 754295886 756088138 758054793 759482682 760660470 762084424
1786.7G62084424J449347J282275J200735J159549J149297R22859O66141Q55148J076877
$$ 762084424 763533771 764816046 766016781 767176330 768325627 769248486 769914627 770769775 771846652
1805.1G71846652Q56638N76675P86960J008034P23362L83973N69582R43184Q91864
$$ 771846652 772703290 773279965 774066925 775074959 775798321 776182294 776751876 777695060 778586924
1823.4G78586924N08547N02467R47237P53880J74224K60890P07864P22885M50552N02527
$$ 778586924 779095471 779597938 780545175 781299055 781473279 781734169 782442033 783164918 783615470 784117997
1843.8G84117997O84499N19813J92225J38402M72426O42240L46959J29878L47674N73516
$$ 784117997 784802496 785322309 785514534 785652936 786125362 786767602 787114561 787244439 787592113 788165629
1864.2G88165629M64857L01778L37660L65257K11835N7519K04027M44650L93868J85132
$$ 788165629 788630486 788932264 789269924 789635181 789847016 789904535 790108562 790553212 790947080 791132212
1884.6G91132212K04086L94940L21985J05023J42694K75611K47896J46449J34289K15054
$$ 791132212 791336298 791731238 792053223 792158246 792300940 792576551 792824447 792970896 793105185 793320239
1905G93320239K60531K06709J18137P6353J26839K45869K43247J21891P7546P4386
$$ 793320239 793580770 793787479 793905616 793981969 794108808 794354677 794597924 794719815 794797361 794871747
1925.4G94871747R1792P7188K8610M9233R3341P1109J6868P2598J39952M9710j00851
$$ 794871747 794963539 795040727 795069337 795118570 795211911 795283020 795299888 795372486 795512438 795562148 795461297
1947.9G95461297j03772N1916Q5294p0989j25646M7862J15752m6551j00672M8160Q3030
$$ 795461297 795357525 795409441 795494735 795423746 795298100 795345962 795461714 795415163 795314491 795362651 795445681
1970.3G95445681j05977j94848K1756K13384L1889k17021j21653R9242J8120j98722
$$ 795445681 795339704 795144856 795166612 795379996 795411885 795194864 795073211 795172453 795190573 794991851
1990.7G94991851j21057R6679L1948k15829j87218O7174L9995k38240k47716R715J9431
$$ 794991851 794870794 794967473 794999421 794783592 794596374 794663548 794703543 794465303 794217587 794227302 794246733
2013.1G94246733k40445k78652n3882j1921k32756l13223q0347K6047k16484l55482
$$ 794246733 794006288 793727636 793673754 793661833 793429077 793115854 793035507 793061554 792845070 792489588
2033.5G92489588j30355P1287o4313k47121j25468O9022l9339k18391j08898R6560
$$ 792489588 792359233 792430520 792366207 792119086 791993618 792062640 792023301 791804910 791696012 791792572
2053.9G91792572K3245j91986j49369N4121L9517j40786j26004M3809L6955j12533
$$ 791792572 791815817 791623831 791474462 791528583 791568100 791427314 791301310 791345119 791382074 791269541
2074.3G91269541r4950P1764J01745m5300j16467k2471j431q8751o3121M5359L1769
$$ 791269541 791174591 791246355 791348100 791302800 791186333 791163862 791162431 791073680 791010559 791055918 791087687
2096.8G91087687m4525r298R1255Q8095j7881l3855M5955M4346k6465j8060L6538K0265
$$ 791087687 791043162 791033864 791125119 791213214 791195333 791161478 791207433 791251779 791225314 791207254 791243792 791264057
2121.2G91264057k7597K0683J33455R0718o5625k9325J34587R5487n7578o438J72198
$$ 791264057 791236460 791257143 791390598 791481316 791415691 791386366 791520953 791616440 791558862 791552424 791724622
2143.7G91724622J47343n2095o5326J36971J75059j3351k8491J85191K24591J0192
$$ 791724622 791871965 791819870 791754544 791891515 792066574 792053223 792024732 792209923 792434514 792444706
2164.1G92444706o7353J28269K34961Q1301R418J86383K73884P1645q7142Q8751K93255
$$ 792444706 792377353 792505622 792740583 792821884 792831302 793017685 793291569 793363214 793276072 793364823 793658078
2186.5G93658078J71542k3127Q2970K84016J67728p4089O258K31028J54853p5758l5047
$$ 793658078 793829620 793806493 793889463 794173479 794341207 794267118 794273376 794504404 794659257 794583499 794548452
2208.9G94548452K04205K02239m4465p2718J40250J53899o3181q0466J47819J95444
$$ 794548452 794752657 794954896 794910431 794837713 794977963 795131862 795068681 794988215 795136034 795331478
2229.3G95331478j9789j16646O6578J82093J4543j13308M6968K14875R0122j03473
$$ 795331478 795311689 795195043 795261621 795443714 795458257 795344949 795391917 795606792 795696914 795593441
2249.7G95593441l8922J21832N3048j27435p3671J18136Q2374q8632o2883P5638M5657
$$ 795593441 795554519 795676351 795729399 795601964 795528293 795646429 795728803 795640171 795577288 795652926 795698583
2272.2G95698583r6381q6903N6088N5253j15633j58667l2842n663j41501k03431q2016
$$ 795698583 795602202 795515299 795571387 795626640 795511007 795352340 795319498 795313835 795172334 794968903 794886887
2294.6G94886887j8001j34050k53618k53379j92404k00451k71380k44081j50323k04563
$$ 794886887 794868886 794734836 794481218 794227839 794035435 793834984 793563604 793319523 793169200 792964637
2315G92964637l49998m05967l91722l45886k49922k21312k80857k46167k17438l26753
$$ 792964637 792614639 792208672 791816950 791471064 791221142 790999830 790718973 790472806 790255368 789928615
2335.4G89928615l83496l05891j35303J03057K12729q3089n43654p73132p18474n99325
$$ 789928615 789545119 789239228 789103925 789206982 789419711 789336622 788792968 788019836 787301362 786702037
2355.8G86702037n37932m00066j44005L6239J22965J70409J04249K4438R9957K18630
$$ 786702037 786164105 785764039 785620034 785656273 785779238 785949647 786053896 786078334 786178291 786396921
2376.2G86396921J94430O8784l3558o1214j08897k38419k85447j87218j58012k65836
$$ 786396921 786591351 786660135 786626577 786565363 786456466 786218047 785932600 785745382 785587370 785321534
2396.6G85321534k96891k18213k28226l11017l27349k73823k51055l34680l72589k75075
$$ 785321534 785024643 784806430 784578204 784267187 783939838 783666015 783414960 783080280 782707691 782432616
2417G82432616k55764m41611o39975n89370l21031j19448j02937j39832j70291k33352
$$ 782432616 782176852 781735241 781095266 780505896 780184865 780065417 779962480 779822648 779652357 779419005
2437.4G79419005k92838k65300k12133k59876l48926l59297l08632k84493l01004l16739
$$ 779419005 779126167 778860867 778648734 778388858 778039932 777680635 777372003 777087510 776786506 776469767
2457.8G76469767l12745l20137l49581l64542l49641l46661l84032l94285l78370l99650
$$ 776469767 776157022 775836885 775487304 775122762 774773121 774426460 774042428 773648143 773269773 772870123
2478.1G72870123m17649l79920l39270l70681m10557l83258l62158l93510m17232l86417
$$ 772870123 772452474 772072554 771733284 771362603 770952046 770568788 770206630 769813120 769395888 769009471
2498.5G69009471l39150l57450m08768l75390k98977l32952m16934l70920k86698l47436
$$ 769009471 768670321 768312871 767904103 767528713 767229736 766896784 766479850 766108930 765822232 765474796
2518.9G65474796m17828l32296k58506l36825m37260m22955l32534l18885l84152l68654
$$ 765474796 765056968 764724672 764466166 764129341 763692081 763269126 762936592 762617707 762233555 761864901
2539.3G61864901k90752l27110m55082m55498l13640k66194l85285m51386l52800l01003
$$ 761864901 761574149 761247039 760791957 760336459 760022819 759756625 759371340 758919954 758567154 758266151
2559.7G58266151m15266m57048l13520k43247l77417m95612m27008l19064l66211m69088
$$ 758266151 757850885 757393837 757080317 756837070 756459653 755964041 755537033 755217969 754851758 754382670
2580.1G54382670m07994k94208l76046n20766m68373l27766l59237m98772m90725l49283
$$ 754382670 753974676 753680468 753304422 752783656 752315283 751987517 751628280 751129508 750638783 750289500
2600.5G50289500l38972n01096n36025l61561l07858m65036n30422m11987l50833m62293
$$ 750289500 749950528 749449432 748913407 748551846 748243988 747778952 747248530 746836543 746485710 746023417
2620.9G46023417n32985m44412l86835m71949n46992m64797l52263m11392n41389n26130
$$ 746023417 745490432 745046020 744659185 744187236 743640244 743175447 742823184 742411792 741870403 741344273
2641.3G41344273m25279m29213n17964n11528m15325m14431n08964n24878m25876l85940
$$ 741344273 740918994 740489781 739971817 739460289 739044964 738630533 738121569 737596691 737170815 736784875
2661.7G36784875m78446n33044m62771m00185m51923n26309m79758m04894m61161n42700
$$ 736784875 736306429 735773385 735310614 734910429 734458506 733932197 733452439 733047545 732586384 732043684
2682.1G32043684m96507m20749m68612n57363n34773m60505m69506n30124n40912n02825
$$ 732043684 731547177 731126428 730657816 730100453 729565680 729105175 728635669 728105545 727564633 727061808
2702.5G27061808m86493n35429n67019n21481m88519n09382n35070n31137n04256n10931
$$ 727061808 726575315 726039886 725472867 724951386 724462867 723953485 723418415 722887278 722383022 721872091
2722.9G21872091n31673m88162m59433n03838n38647n05865m34696m06146m31836m38809
$$ 721872091 721340418 720852256 720392823 719888985 719350338 718844473 718409777 718003631 717571795 717132986
2743.3G17132986l99113m00245m62592m89533m59790m21643m35055m95553m75466l54230
$$ 717132986 716733873 716333628 715871036 715381503 714921713 714500070 714065015 713569462 713093996 712739766
2763.7G12739766l06011m06801m96567m45544m13835n39720o18935n55933n33878n80192
$$ 712739766 712433755 712026954 711530387 711084843 710671008 710131288 709512353 708956420 708422542 707842350
2784.1G07842350n62608m89176n09798o12319o36994n97537o14226o98089p54416p39336
$$ 707842350 707279742 706790566 706280768 705668449 705031455 704433918 703819692 703121603 702367187 701627851
2804.5G01627851p01905p03156p80761q41677q13842p93874q37386q83281r00269r41395
$$ 701627851 700925946 700222790 699442029 698600352 697786510 696992636 696155250 695271969 694371700 693430305
2824.9F93430305j037717j105965j086175j101673j248419j466393j729012k085388
$$ 693430305 692392588 691286623 690200448 689098775 687850356 686383963 684654951 682569563
2841.2F82569563k537965k994657l224254k888620j953303r19223k67208r179m3273
$$ 682569563 680031598 677036941 673812687 670924067 668970764 668051541 667784333 667775154 667731881
2859.5F67731881l03030n99027q10802r72747j056850r64403p75278o43849n63026
$$ 667731881 667428851 666829824 666019022 665046275 663989425 663025022 662249744 661605895 661042869
2877.9F61042869m86612m40836m98891o69360q31962r02474r34362r92418j067101
$$ 661042869 660556257 660115421 659616530 658947170 658115208 657212734 656278372 655285954 654218853
2896.3F54218853j125515j144707j164615j242936j366436j554251j826227k188682
$$ 654218853 653093338 651948631 650784016 649541080 648174644 646620393 644794166 642605484
2912.6F42605484k561152k616883k225101j626968j013160m98056q7440K71499M84466
$$ 642605484 640044332 637427449 635202348 633575380 632562220 632064164 631976724 632248223 632732689
2930.9F32732689O07312Q18074J088321J286447J350701J275957J043021O50704K61188
$$ 632732689 633340001 634158075 635246396 636532843 637883544 639159501 640202522 640853226 641114414
2949.3F41114414L7729j32381k38240q5473K44736O22869R96113J246452J376093J534104
$$ 641114414 641152143 641019762 640781522 640696049 640940785 641563654 642559767 643806219 645182312 646716416
2969.7F46716416J721918J719296J504243J362204J317800J114368Q24809P03275P21514
$$ 646716416 648438334 650157630 651661873 653024077 654341877 655456245 656281054 656984329 657705843
2988F57705843P19607N45979K40087Q8692J4961j97828l62813l70026l35038l26574
$$ 657705843 658425450 658971429 659211516 659300208 659315169 659117341 658754528 658384502 658049464 657722890
3008.4F57722890l45826l80277m45247n57602o78122p19070o83785o99460p79688p75218
$$ 657722890 657377064 656996787 656551540 655993938 655315816 654596746 653912961 653213501 652433813 651658595
3028.8F51658595o45161n62787p18773q94546p49409n71847p14719r11534q76427p51674
$$ 651658595 651013434 650450647 649731874 648837328 648087919 647516072 646801353 645889819 645013392 644261718
3049.2F44261718p70986q66592q30054p65384q42690q86500p27236n37634n94199q10325
$$ 644261718 643490732 642624140 641794086 641028702 640186012 639299512 638572276 638034642 637440443 636630118
3069.6F36630118q35002o30378m41134m46022n99563o82294o97255p71225p69615o83308
$$ 636630118 635795116 635164738 634723604 634277582 633678019 632995725 632298470 631527245 630757630 630074322
3090F30074322p25865q03113p36654o18160o23524p83205q71420p49588o39558p45773
$$ 630074322 629348457 628545344 627808690 627190530 626567006 625783801 624912381 624162793 623523235 622777462
3110.4F22777462q35896p24017o64413p74920r58026j111090j074791r06646q77261
$$ 622777462 621941566 621217549 620553136 619778216 618820190 617709100 616634309 615727663 614850402
3128.8F14850402r98020j046181r68337q68440q92758j054466j143694j104593j063347
$$ 614850402 613852382 612806201 611837864 610969424 610076666 609022200 607878506 606773913 605710566
3147.1F05710566r80198q84295r83298j213252j288772j213610j172185j158237j145006
$$ 605710566 604730368 603846073 602862775 601649523 600360751 599147141 597974956 596816719 595671713
3165.5E95671713j154720j130283j097679j131058j144529j106679j111090j142383
$$ 595671713 594516993 593386710 592289031 591157973 590013444 588906765 587795675 586653292
3181.8E86653292j160860j173973j153469j128435j145601j127124j094222j139105
$$ 586653292 585492432 584318459 583164990 582036555 580890954 579763830 578669608 577530503
3198.1E77530503j149952j066268r98735j007021j090049j129210j034498r47416r57430
$$ 577530503 576380551 575314283 574315548 573308527 572218478 571089268 570054770 569107354 568149924
3216.5E68149924j008928j047670j029611r94921r87828r63807q74638q31664r99629
$$ 568149924 567140996 566093326 565063715 564068794 563080966 562117159 561242521 560410857 559411228
3234.8E59411228j177311j133263j027823r78768r46641r76562j073718j112700j024544
$$ 559411228 558233917 557100654 556072831 555094063 554147422 553170860 552097142 550984442 549959898
3253.2E49959898r35256r67145j046300j070500j025557r59516q86381q27848r01402
$$ 549959898 549024642 548057497 547011197 545940697 544915140 543955624 543069243 542241395 541339993
3271.5E41339993j035034j071632j023412r12726q21292q40247q86917q47101p21097
$$ 541339993 540304959 539233327 538209915 537297189 536475897 535635650 534748733 533901632 533180535
3289.9E33180535o60598p51436q63552r01640q36074o99163o19351p09832r24289j057685
$$ 533180535 532519937 531768501 530904949 530003309 529167235 528468072 527848721 527138889 526214600 525156915
3310.3E25156915j035452r58979r72986j044750j021266r69708j006067j135290j236856
$$ 525156915 524121463 523162484 522189498 521144748 520123482 519153774 518147707 517012417 515775561
3328.6E15775561j212060j136303j029730r71556j112163j298427j296938j195490
$$ 515775561 514563501 513427198 512397468 511425912 510313749 509015322 507718384 506522894
3345E06522894j090169j005113j124561j345217j343012j150280j019746j067013j105428
$$ 506522894 505432725 504427612 503303051 501957834 500614822 499464542 498444796 497377783 496272355
3363.3D96272355r53257q41886j001209j249343j262188j086503j013786j037120j026690
$$ 496272355 495319098 494477212 493476003 492226660 490964472 489877969 488864183 487827063 486800373
3381.7D86800373r33141p96050o38932m78148n65231q43227q57204n99176m99785p18206
$$ 486800373 485867232 485071182 484432250 483954102 483388871 482545644 481688440 481089264 480589479 479871273
3402.1D79871273q96275p52807n47468n15670n34475n46157n63979m44621k75046k48164
$$ 479871273 478974998 478222191 477674723 477159053 476624578 476078421 475514442 475069821 474794775 474546611
3422.5D74546611k26497r0748L5375L4481O2019J71661R6590j66774k31803K3395L41833
$$ 474546611 474320114 474229366 474264741 474299222 474361241 474532902 474629492 474462718 474230915 474254310 474596143
3444.9D74596143M63128L37392K64853L86834N26071O09279O72906O27488O04898Q64535
$$ 474596143 475059271 475396663 475661516 476048350 476574421 477183700 477856606 478484094 479088992 479953527
3465.3D79953527J079143Q39054M85420N19395P58231R57757J021236Q54194P94739
$$ 479953527 481032670 481871724 482357144 482876539 483634770 484592527 485613763 486467957 487262696
3483.6D87262696R81808J011878R15259R93461J121848J134366J036704J079708J265556
$$ 487262696 488244504 489256382 490171641 491165102 492286950 493421316 494458020 495537728 496803284
3502D96803284J153290R09448R94950J243621J400769J332760J154780J166642J316726
$$ 496803284 497956574 498866022 499860972 501104593 502505362 503838122 504992902 506159544 507476270
3520.4E07476270J483679J489818J360238J327932J358330J450360J630366J661419
$$ 507476270 508959949 510449767 511810005 513137937 514496267 515946627 517576993 519238412
3536.7E19238412J504064J564503J844406J967609J683712J397252J587450J802802
$$ 519238412 520742476 522306979 524151385 526118994 527802706 529199958 530787408 532590210
3553E32590210J706601J718402J955568J964331J706064J901507K550006K407491J879633
$$ 532590210 534296811 536015213 537970781 539935112 541641176 543542683 546092689 548500180 550379813
3571.3E50379813J943290K158225K227067K351940K367497K273857K508641K757608
$$ 550379813 552323103 554481328 556708395 559060335 561427832 563701689 566210330 568967938
3587.7E68967938K371133K093732K433658K722442K680123K666712K592146K365768
$$ 568967938 571339071 573432803 575866461 578588903 581269026 583935738 586527884 588893652
3604E88893652K441108K836347K884269K783000K752066K621233L006220L291965K555310
$$ 588893652 591334760 594171107 597055376 599838376 602590442 605211675 608217895 611509860 614065170
3622.3F14065170J949251K311468L571272L638208K475738K352953K597988K642274
$$ 614065170 616014421 618325889 621897161 625535369 628011107 630364060 632962048 635604322
3638.7F35604322K616942K410233K245605K802789L936648L372849J778006J904070
$$ 635604322 638221264 640631497 642877102 645679891 649616539 652989388 654767394 656671464
3655F56671464K729118K473176J939714J726091J565695J692235K255261K107620J582384
$$ 656671464 659400582 661873758 663813472 665539563 667105258 668797493 671052754 673160374 674742758
3673.3F74742758K104163J875341J006008R56714J048088J159310J729548J916409
$$ 674742758 676846921 678722262 679728270 680684984 681733072 682892382 684621930 686538339
3689.6F86538339R88245M34339N20289O43491Q12710J011193P74025M66705O15954
$$ 686538339 687526584 687960923 688481212 689124703 689937413 690948606 691722631 692189336 692805290
3708F92805290J038730J086414M44532K1636J23143M00722M85003M06683K87831J05381
$$ 692805290 693844020 694930434 695374966 695396602 695519745 695920467 696405470 696812153 697099984 697205365
3728.4F97205365J88887O34253J010716P83920r119m71354M590P81536M93288K46167
$$ 697205365 697394252 698028505 699039221 699823141 699814022 699342668 699347258 700128794 700622082 700868249
3748.8G00868249O48379M09544o6102N4717L39926J86622l8386P6890K35617L85285
$$ 700868249 701516628 701926172 701860070 701914787 702254713 702441335 702402949 702479839 702715456 703100741
3769.2G03100741K77460m8042l1233K98024M36782R3580q5652Q5413J25706P1526J1921
$$ 703100741 703378201 703330159 703298926 703596950 704033732 704127312 704041660 704127073 704252779 704324305 704336226
3791.6G04336226K1577J66952J28806K46525M26888k5987p7427J22309j67489k79605
$$ 704336226 704357803 704524755 704653561 704900086 705326974 705300987 705223560 705345869 705178380 704898775
3812G04898775P4744L61621J59502K34843K61783j55330k15172j06097j5318L5584
$$ 704898775 704973519 705335140 705494642 705729485 705991268 705835938 705620766 705514669 705499351 705534935
3832.4G05534935N5313K49565L05056L6240j08659k00332l75390m41372j11878P18594
$$ 705534935 705590248 705839813 706144869 706181109 706072450 705872118 705496728 705055356 704943478 705662072
3852.8G05662072O31630l62456m87447j26957J80661Q2732j62423J0788R7275q4877
$$ 705662072 706293702 705931246 705443799 705316842 705497503 705580235 705417812 705428600 705525875 705440998
3873.2G05440998k15053l09349k5689J87754Q9646Q2254k28107l01420M7922j11401
$$ 705440998 705225945 704916596 704890907 705078661 705168307 705250561 705022454 704721034 704768956 704657555
3893.6G04657555l90649j76072N9008J13786J78694j9371l21448l53396k58446j19507
$$ 704657555 704266906 704090834 704149842 704263628 704442322 704422951 704101503 703748107 703489661 703370154
3914G03370154L8445L3080j04486j32800k2947q1122k34664j25468L0518o0201k01404
$$ 703370154 703408599 703441679 703337193 703204393 703181446 703100324 702865660 702740192 702770710 702710509 702509105
3936.4G02509105k15590j25766o3002j30236j14441j2696p1048j52707r9123m3034
$$ 702509105 702293515 702167749 702104747 701974511 701860070 701847374 701776326 701623619 701524496 701481462
3956.8G01481462q1897j59383j65522p5460m7803j05261j21713r0003n0426q8870j28925
$$ 701481462 701399565 701240182 701074660 700999200 700951397 700846136 700724423 700634420 700583994 700495124 700366199
3979.3G00366199k5630M1187p5936j84656j37627q0645j16527j24574o7472
$$ 700366199 700340569 700381756 700305820 700121164 699983537 699902892 699786365 699661791 699594319
3997.6F99594319
$$ 699594319
##END=$$ End of the data block
