##TITLE=$$ Begin of the data block
##JCAMP-DX=5.00 $$ ACD/SpecManager v 10.08
##SPECTROMETER/DATA SYSTEM=Alpha
##DATE=11 Nov 2014 09:02:30
##DATA TYPE=INFRARED SPECTRUM
##DATA CLASS=XYDATA
##ORIGIN=
##OWNER=
##NPOINTS=1765
##FIRSTX=399.76428223
##LASTX=3997.64306641
##MAXX=3997.64306641
##MINX=399.76428223
##MAXY=0.80528265
##MINY=0.46422902
##XFACTOR=1.0000000000
##YFACTOR=1.000000000000000e-9
##FIRSTY=0.68242806
##DELTAX=2.03961372
##XUNITS=1/CM
##YUNITS=ARBITRARY UNITS
##XYDATA=(X++(Y..Y))
399.8F82428062K47657j64926p44939m61757n03421j029253p78377K7776k39253j592100
420.2F77189469j126468j73688q66473j380681L6239R20236o02245j323164O04868
438.5F73278093J142681j311600j986325N28693J261234q85963j744568M6789O76811
456.9F71005845j423299j936674K93433Q41677j414358j879811O38902J254260j262128
475.2F66117847j734316N84304Q80063j594306j842379R34720J368105j325488j765430
493.6F61623120Q87156J205921j554012k149463L95119P97451j861692k363383L32772
511.9F57312989Q02338k128064k807975K04921J035511j565218k279520L33250J033842
530.3F51942074j380980j953900P43688J854181j90795p02202J742959K439439j52766
$$ plain form
399.8 682428062 682675719 682510793 681765854 681304097 680800676 679771423 678993046 679020822 678781569 677189469
420.2 677189469 676063001 675889313 675022840 673642159 673678398 674598634 673996389 672673225 673278093
438.5 673278093 674420774 673109174 671122849 671651542 672912776 672026813 670282245 670329034 671005845
456.9 671005845 669582546 667645872 667939305 668780982 667366624 665486813 666125715 667379975 666117847
475.2 666117847 664383531 664967835 665847898 664253592 662411213 663345933 664714038 663388550 661623120
493.6 661623120 662510276 663716197 662162185 660012722 660407841 661205292 659343600 656980217 657312989
511.9 657312989 658115327 655987263 653179288 653384209 654419720 652854502 650574982 650908232 651942074
530.3 651942074 650561094 648607194 649350882 651205063 651014268 650312066 652055025 654494464 654341698
548.7F54341698j184285R94325J548290j162171k043128P39276J985371l68595j456201
567F53394580O87897J414538q83461j592814Q13186J661360n83589j323044Q75651
585.4F54464304J556635p57932j663566N97358J669466l98695j447559N43476J410067
603.7F55973554p89106j813948K91824J359045n34057j534045M89950J964987N39004
622.1F55947208m29928J251757K287388M97043q07762P49648K036094N24700p29263
640.4F61326885Q99554K410590J025677l10302J129925K408088Q69751p14302M01318
658.8F69447184J623511K89798j143098K03311K664984J146674l02136R66131K467990
677.2F77364349J474262l2008Q48949K181709J106500n33282J32978J470983P18534
$$ plain form
548.7 654341698 653157413 654151738 655700028 654537857 652494729 653234005 655219376 654850781 653394580
567 653394580 654082477 655497015 654613554 653020740 653833926 655495286 654911697 653588653 654464304
585.4 654464304 656020939 655263007 653599441 654196799 655866265 655467570 654020011 654563487 655973554
603.7 655973554 655184448 653370500 653662324 655021369 654487312 652953267 653443217 655408204 655947208
622.1 655947208 655517280 656769037 659056425 659553468 658745706 659495354 661531448 662056148 661326885
640.4 661326885 662226439 664637029 665662706 665352404 666482329 668890417 669760168 669045866 669447184
658.8 669447184 671070695 671360493 670217395 670420706 673085690 674232364 673930228 674896359 677364349
677.2 677364349 678838611 678806603 679655552 681837261 682943761 682410479 682543457 684014440 684732974
695.5F84732974p23243o4492J500964J228928Q1182O29842K007902J691043L89576
713.9F91474676O31809J964331J951516Q96275J117706K305687K191424J006722Q85904
732.2G04426050J620949J340508K77817K24412J113832J222670L11196K7239P38859
750.6G11303532Q37326o3956m01854K88010O24835K06590K30789R22620J155138P42912
771G15845942O59526J172423J420200J106501J028418J451612J605987J256109J193404
789.3G26740122J463473J364529J032650J001597J063168P48575L47971M02749O26922
807.7G34791756M58955J92702L88205O77526L60310l51190p96437r26495r38535l95179
828.1G33461618R13799J928509J914381J766086K320409K754986K010405Q37565M93645
$$ plain form
695.5 684732974 684009731 683945239 685446203 686675131 686756313 687386155 689394057 691085100 691474676
713.9 691474676 692106485 694070816 696022332 696918607 698036313 700342000 702533424 703540146 704426050
732.2 704426050 706046999 707387507 707665324 707889736 709003568 710226238 710537434 710564673 711303532
750.6 711303532 712140858 712076902 711675048 711963058 712587893 712794483 713025272 713947892 715103030 715845942
771 715845942 716505468 717677891 719098091 720204592 721233010 722684622 724290609 725546718 726740122
789.3 726740122 728203595 729568124 730600774 731602371 732665539 733414114 733762085 734164834 734791756
807.7 734791756 735250711 735443413 735831618 736509144 736869454 736518264 735721827 734795332 733856797 733461618
828.1 733461618 734375417 736303926 738218307 739984393 742304802 745059788 747070193 747907758 748401403
846.4G48401403M92514j22190o89924j12474R43601J008809L53456L26097P27832L56495
866.8G51685619m97222o45637l36111o79433j458347j595855j257240j504660k213478
885.2G41497636k215326j429439j017630j164257p83980K10225O42539K05695k8074
903.5G35917389L11494J75953p16984j209498q17835n50032r50992j115322n68211
921.9G30475962k24948o05464r77933q87811r83298j744449k534449k719701k825260
940.3G16972649l431618l936410l703952l189802k944887k681195j999438j304865
956.6F93780482j210988j411199j302660j214266j646220k215863k467632k719283
972.9F79592371l392398m091084m280448m284859m484654m515767m017710l330827
$$ plain form
846.4 748401403 748893917 748771727 748081803 747969329 748912930 749921739 750275195 750601292 751329124 751685619
866.8 751685619 751188397 750542760 750206649 749527216 748068869 746473014 745215774 743711114 741497636
885.2 741497636 739282310 737852871 736835241 735670984 734887004 735097229 735739768 735945463 735917389
903.5 735917389 736228883 736404836 735687852 734478354 733660519 733110487 732159495 731044173 730475962
921.9 730475962 730251014 729645550 728667617 727779806 726796508 725052059 722517610 719797909 716972649
940.3 716972649 713541031 709604621 705900669 702710867 699765980 697084785 695085347 693780482
956.6 693780482 692569494 691158295 689855635 688641369 686995149 684779286 682311654 679592371
972.9 679592371 676199973 672108889 667828441 663543582 659058928 654543161 650525451 647194624
989.2F47194624k959907k832890k640485k591730k948820l285587l181160k913773
1005.5F23840272k862036k802074k381742j912236j795948j656293j088143m87625
1021.8F08854175l03030k52188J05501N26487N36263L75867O09815R20117O14643l7908
1042.2F11949742k97725j57178j84655m09663k78890J63019K12788j45495j40488L12746
1062.6F11024201L85463j57416n05030k80857q5771j39356K44379J280606K012015
1081F13778234J832962J428127J401782J249671M50134l33905l61204j47343l60191
1099.4F18938267n03599P5280Q70049J092434J041830J541018K328038K436936J996398
1117.7F29816651J940728K273619K167403J614750J522064K025664K087712J295150
$$ plain form
989.2 647194624 644234717 641401827 638761342 636169612 633220792 629935205 626754045 623840272
1005.5 623840272 620978236 618176162 615794420 613882184 612086236 610429943 609341800 608854175
1021.8 608854175 608551145 608298957 608404458 608930945 609467208 609843075 610452890 611373007 611987650 611949742
1042.2 611949742 611652017 611494839 611310184 610900521 610621631 610784650 610997438 610851943 610711455 611024201
1062.6 611024201 611409664 611252248 610747218 610466361 610380590 610241234 610485613 611766219 613778234
1081 613778234 615611196 617039323 618441105 619690776 620140910 619807005 619445801 619298458 618938267
1099.4 618938267 618434668 618509948 619379997 620472431 621514261 623055279 625383317 627820253 629816651
1117.7 629816651 631757379 634030998 636198401 637813151 639335215 641360879 643448591 644743741
1134F44743741N97655N43237L56078l50177o49452n0485N93662O33836O97791J415014
1154.4F48530900K145470K177357K144873K911926M047632M588783M679978N168974
1170.7F76395893N841971N761861N094886M832030M899442M352629L245950K547919
1187.1G12972581K315164J609087L25024n23925n91635o91176j149118j200855n53250
1205.4G12511897j12832l98933p34806o47903p29799j393974j963794j836002j557470
1223.8G03136384j800537k097368j790821j259268j158952j234472q66711l00944j77503
1242.1F92449808l13341n8651M43279N02765J45495R1136M58598N81145L06726K76148
1262.5F94883108O42359P85888N10752L32355N07117N30898Q5056l62694l69847k24054
$$ plain form
1134 644743741 645341396 645884633 646240711 645890534 645241082 645190597 645784259 646418095 647115886 648530900
1154.4 648530900 650676370 652853727 654998600 657910526 661958158 666546941 671226919 676395893
1170.7 676395893 682237864 687999725 693094611 697926641 702826083 707178712 710424662 712972581
1187.1 712972581 715287745 716896832 717221856 716697931 716106296 715415120 714266002 713065147 712511897
1205.4 712511897 712399065 712000132 711265326 710617423 709887624 708493650 706529856 704693854 703136384
1223.8 703136384 701335847 699238479 697447658 696188390 695029438 693794966 692928255 692627311 692449808
1242.1 692449808 692136467 692077816 692521095 693023860 693169355 693260491 693719089 694300234 694606960 694883108
1262.5 694883108 695525467 696311355 696822107 697154462 697661579 698192477 698277533 697914839 697544992 697320938
1282.9F97320938l59476n54800m92036m58062p82489j196742j365245j441359j740218
1301.3F88930511k072274k100706k008975k064764k167464k058744j749873j488686
1317.6F73219025j347363j142442q92401q74579j077235j144230r99808r02832q78751
1336F63959384p19249m20153k76804l19779l33131k48968k28346l06189k90215k18034
1356.4F60598516k80976m69982o56307q12650r53495j146496j314223j533091k009928
1374.7F51421368k777696m974782r761393j1715531l516317Q595586J0885298N314589
1391F43471122J719773L75926k35021m37319m83036l80338j34944J4603Q4996J86920
1411.4F44182682K98679M45485P83205J160383J067579J115620J282215J248300J243592
$$ plain form
1282.9 697320938 696961462 696406662 695914626 695456564 694674075 693477333 692112088 690670729 688930511
1301.3 688930511 686858237 684757531 682748556 680683792 678516328 676457584 674707711 673219025
1317.6 673219025 671871662 670729220 669836819 668962240 667885005 666740775 665740967 664838135 663959384
1336 663959384 663240135 662819982 662543178 662223399 661890268 661641300 661412954 661106765 660816550 660598516
1356.4 660598516 660317540 659847558 659191251 658378601 657425106 656278610 654964387 653431296 651421368
1374.7 651421368 648643672 643668890 633907497 622191966 618675649 627271235 638156533 643471122
1391 643471122 645190895 645566821 645331800 644894481 644411445 644031107 643896163 643910766 643995762 644182682
1411.4 644182682 644481361 644926846 645710051 646870434 647938013 649053633 650335848 651584148 652827740
1429.8F52827740J096666R08017J123011J200974Q42273Q16286Q79585Q96991R71615
1448.1F61563158R30846P85529Q79705J776755K499938J642168J395046K066195K451718
1466.5F75991058K367199L003001M442334M643500L711283L047705K583265K118409
1482.8G01907754J555443J187920P71046q6606p76827j013160j412153k006888k206326
1501.2F97920203k010584j976192k628386k653300k206803k115011j977921j540899
1517.5F80811107q17537l44098o42001r46999r08613q54433q89063j011908r30369
1535.8F73466086n05924j83940n30541n39303k06947n9008R4473M71294Q40127Q89182
1556.2F73735499J213730J019358J9670k52366m51863o42955q24154j236140j735628
$$ plain form
1429.8 652827740 653924406 654832423 655955434 657156408 657998681 658814967 659694552 660591543 661563158
1448.1 661563158 662494004 663279533 664159238 665935993 668435931 670078099 671473145 673539340 675991058
1466.5 675991058 678358257 681361258 685803592 690447092 694158375 697206080 699789345 701907754
1482.8 701907754 703463197 704651117 705422163 705335557 704558730 703545570 702133417 700126529 697920203
1501.2 697920203 695909619 693933427 691305041 688651741 686444938 684329927 682352006 680811107
1517.5 680811107 679993570 679649472 679007471 678060472 677151859 676297426 675408363 674396455 673466086
1535.8 673466086 672960162 672776222 672245681 671706378 671499431 671440423 671534896 672006190 672846317 673735499
1556.2 673735499 674949229 675968587 675988257 675735891 675284028 674641073 673816919 672580779 670845151
1574.6F70845151k427697k633155k681017l170132l495991l468991l529906l884077
1590.9F45554185m032075l799618l514588l463745l467262l244519k988457l072024
1607.2F17971897l368556l301680k954543l026962l538847l098607k537072k733469
1623.5E93412161k895117k683520k327383j803338j234949p44760m54485k88248j6988
1641.9E80963373L92080J188457J483440Q47936J452207K674103J612604J207590J888215
1660.3E93710005K807975L040075K567888L059327L875494L457964L627419M047334
1676.6F20193481L568292L373504M244149N883514M939974L956854M291594M137993
1692.9F54589355M862845N500555N203485N684138M407286L633380L632427K857268
$$ plain form
1574.6 670845151 668417454 665784299 663103282 659933150 656437159 652968168 649438262 645554185
1590.9 645554185 641522110 637722492 634207904 630744159 627276897 624032378 621043921 617971897
1607.2 617971897 614603341 611301661 608347118 605320156 601781309 598682702 596145630 593412161
1623.5 593412161 590517044 587833524 585506141 583702803 582467854 581723094 581268609 580980361 580963373
1641.9 580963373 581355453 582543910 584027350 584875286 586327493 589001596 590614200 591821790 593710005
1660.3 593710005 596517980 599558055 602125943 605185270 609060764 612518728 616146147 620193481
1676.6 620193481 623761773 627135277 631379426 637262940 642202914 646159768 650451362 654589355
1692.9 654589355 659452200 664952755 670156240 675840378 680247664 683881044 687513471 690370739
1709.2F90370739K339303K021194J755177J710296J228392O15120M14372M18961N91933
1727.6G01465487P92146P82788J139939J348853J139402J420796J737535K094686K559901
1745.9G14481533K757191L048659L400087L270566L261984L261804L320694L850341
1762.2G40652859L407717K650440K712607L046751L120005K268136J586675J844049
1778.6G61289239J979291J465857J233161J479447J452148J214206J176119J222431
1794.9G72511899J199842R60708P40051R40442J135170Q74043N52833P85053J072705
1813.2G80772746P98285M15563N65887R26912Q63671M95255M91559R40919Q44956K94447
1833.6G87410200L26633P55012P24256L34978L55184P08402O64234L03626J82450M77910
$$ plain form
1709.2 690370739 692710042 694731236 696486413 698196709 699425101 700040221 700454593 700873554 701465487
1727.6 701465487 702257633 703040421 704180360 705529213 706668615 708089411 709826946 711921632 714481533
1745.9 714481533 717238724 720287383 723687470 726958036 730220020 733481824 736802518 740652859
1762.2 740652859 744060576 746711016 749423623 752470374 755590379 757858515 759445190 761289239
1778.6 761289239 763268530 764734387 765967548 767446995 768899143 770113349 771289468 772511899
1794.9 772511899 773711741 774672449 775412500 776352942 777488112 778362155 778914988 779700041 780772746
1813.2 780772746 781571031 781986594 782552481 783479393 784343064 784838319 785329878 786270797 787115753 787410200
1833.6 787410200 787736833 788491845 789216101 789551079 789906263 790614665 791278899 791582525 791764975 792242885
1854G92242885O46412L75450J75237L75748N65171M05431K42889L82483M75049K88367
1874.4G96175122Q2493J89304M00782L65853K07901K12133L50952L21091J49846J67727
1894.8G98623204L07381K99752J84536J33097J89185K40684K12848J55032J17481J29401
1915.2H00592601K07782K13564J07705Q0764J18792J51635J32620N5671K9921N5433
1935.6H01746488L3617n424R1254J96159P7665j18315j01030R3996J11044q7559j14680
1958.1H01923215J05858J47343o9618j50740L6239J30713n8532j79112L3439K16841
1978.5H02135646J908k54095j28686J25110M0889j95444j03354J22547L2067k25782
1998.8H01550806j86623P7784N4718k21432k14219M1187K1219k64346l07322n3584
$$ plain form
1854 792242885 792889297 793264747 793439984 793815732 794380903 794786334 795029223 795411706 795886755 796175122
1874.4 796175122 796257615 796446919 796847701 797213554 797421455 797633588 797984540 798305631 798455477 798623204
1894.8 798623204 798930585 799230337 799414873 799547970 799737155 799977839 800190687 800345719 800463200 800592601
1915.2 800592601 800800383 801013947 801121652 801202416 801321208 801472843 801605463 801661134 801691055 801746488
1935.6 801746488 801780105 801774681 801865935 802062094 802139759 802021444 801920414 802014410 802125454 802037895 801923215
1958.1 801923215 802029073 802176416 802106798 801956058 801992297 802123010 802064478 801885366 801918805 802135646
1978.5 802135646 802137554 801883459 801754773 801879883 801920772 801725328 801621974 801744521 801776588 801550806
1998.8 801550806 801364183 801441967 801496685 801275253 801061034 801102221 801123440 800859094 800551772 800498188
2019.2H00498188J4126k20239l30448r7991L7671j71423k89977q8513O6698p7844k31683
2041.7G99108565j02461Q0765k7955k29657j29401J11401O5863j40309j15693N5909
2062.1G98677027M0472j34289j22726P1942J08481l8743o9261N6684Q0407m2796p0691
2084.5G98556507L7312M7147m8995m2379P0096O9260l8683l6955O3360Q4281J0728
2106.9G98771679R776R4890Q8096j2458q94J10031J01983M649L2008J40190R9301l5584
2131.4G99403667J0372J76847J30236m4346P331J90318J52171m3154m4644J62303K22385
2153.9H00323486L8386j9670J78874K62499N5551n1618J52767K70963J05321L2485
2174.3H01349044K30908L10064P8261o2824J24872L07202J89841p570P8619L02315
$$ plain form
2019.2 800498188 800512314 800292075 799961627 799863636 799901307 799729884 799439907 799351394 799418092 799340248 799108565
2041.7 799108565 799006104 799086869 799058914 798829257 798699856 798811257 798877120 798736811 798621118 798677027
2062.1 798677027 798717499 798583210 798460484 798532426 798640907 798602164 798532903 798589587 798669994 798627198 798556507
2084.5 798556507 798593819 798640966 798591971 798549592 798619688 798688948 798650265 798613310 798676670 798760951 798771679
2106.9 798771679 798781455 798876345 798964441 798951983 798951089 799061120 799163103 799167752 799199760 799339950 799439251 799403667
2131.4 799403667 799414039 799590886 799721122 799676776 799684107 799874425 800026596 799983442 799938798 800101101 800323486
2153.9 800323486 800361872 800342202 800521076 800783575 800839126 800787508 800940275 801211238 801316559 801349044
2174.3 801349044 801579952 801890016 801968277 801905453 802030325 802337527 802527368 802519798 802598417 802900732
2194.6H02900732J99317p1525J4365K78890K13086m4822k9147K15471K34246n722m6790
2217.1H03858101J56999J95622j3947p6652J44184K23219L815j01685R8586K12371
2237.5H04700613J3709j08600Q9705K26796M2796j34289j8060J71900J13189n1379
2257.9H05046380M828J48534O8426j07884p7426R3996J05798n1438r0361L5584M7684
2280.3H05224121j00553j25230k7299k5510j13547j36912m0174L815r7215j92464j53422
2302.7H04215610p9274j30236k20061k06947j54912j78695k50638k83062k82467k74539
2323.1H02154779k35915k40624k47895j68860k02954l40522l45408k27213o5983J05501
2343.5H00184906J05977k25962n68151o12199m77076m58419m48585k85506j78814j24455
$$ plain form
2194.6 802900732 803100049 803028524 803042889 803321779 803534865 803490043 803460896 803676367 803910613 803904891 803858101
2217.1 803858101 804015100 804210722 804196775 804120123 804264307 804487526 804491341 804389656 804488242 804700613
2237.5 804700613 804714322 804605722 804695427 804922223 804965019 804830730 804812670 804984570 805097759 805046380
2257.9 805046380 805051208 805199742 805268168 805160284 805082858 805176854 805282652 805231214 805140853 805176437 805224121
2280.3 805224121 805123568 804998338 804971039 804945529 804831982 804695070 804654896 804658711 804561496 804369032 804215610
2302.7 804215610 804136336 804006100 803786039 803579092 803424180 803245485 802994847 802711785 802429318 802154779
2323.1 802154779 801918864 801678240 801430345 801261485 801058531 800718009 800372601 800145388 800079405 800184906
2343.5 800184906 800290883 800064921 799496770 798884571 798407495 797949076 797500491 797214985 797036171 796911716
2363.9G96911716N0664J17958l219o3300J3888R7871O5148o0201j33753j07526j40667
2386.4G96748579k53380k79665k13444j88291k46525k62141j99080k20716l12864l13104
2406.8G94259369k38359k24411l23355l88801l05653k37405l59178n41389n18799l04758
2427.2G90817261j54019j47760j73986j96814k47896l06666k91109k28226k42352k99037
2447.6G88529396l02434k81334k98679l32415l31461l08812l12984l30567l22700l13878
2467.9G85394132l44694l92138l81113l46601l76343m23670m01616l48866l63410l98874
2488.3G81616807l60668l28123l76165m20153l97563l52979l53515l74615l37839k96712
2508.7G78018475l46423m07397l66569k88427l02017l71098l47495k88546l48032m47273
$$ plain form
2363.9 796911716 796962380 797080338 797077119 797013819 797027707 797125578 797190726 797130525 796996772 796889246 796748579
2386.4 796748579 796495199 796215534 796002090 795813799 795567274 795305133 795106053 794885337 794572473 794259369
2406.8 794259369 794021010 793796599 793473244 793084443 792778790 792541385 792182207 791640818 791122019 790817261
2427.2 790817261 790663242 790515482 790341496 790144682 789896786 789590120 789299011 789070785 788828433 788529396
2447.6 788529396 788226962 787945628 787646949 787314534 786983073 786674261 786361277 786030710 785708010 785394132
2467.9 785394132 785049438 784657300 784276187 783929586 783553243 783129573 782727957 782379091 782015681 781616807
2488.3 781616807 781256139 780928016 780551851 780131698 779734135 779381156 779027641 778653026 778315187 778018475
2508.7 778018475 777672052 777264655 776898086 776609659 776307642 775936544 775589049 775300503 774952471 774505198
2529.1G74505198m19796l08513l08693l92317l65079k78413l09587m28319m45485l13997
2549.5G70934999k62618l91424m41253l30746l06666m31001m62473l05593k26020l60549
2569.9G67416656m57048l54052k65002l78132n02706m14908k85446l60966n01215m60983
2590.3G63436198l22640l37898m81666m85837l46839l41118m94063n13196l47197l19779
2610.7G59445965m89831n50091m08351l31164m59909n37634l99649l09348m57168n86987
2631.1G54915833m85599l46243l95119n28991n15163l94047l86297m98712n08547m09663
2651.5G50447452m25219n44847n60462m26471l43025m40001n39303m74632l92139m39882
2671.9G45861471m95136m45724m04656m61578n34058n10454m44114m79639n47647n11348
$$ plain form
2529.1 774505198 774085402 773776889 773468196 773075879 772710800 772432387 772122800 771694481 771248996 770934999
2549.5 770934999 770672381 770280957 769839704 769508958 769202292 768771291 768308818 768003225 767777205 767416656
2569.9 767416656 766959608 766605556 766340554 765962422 765459716 765044808 764759362 764398396 763897181 763436198
2590.3 763436198 763113558 762775660 762293994 761808157 761461318 761120200 760626137 760112941 759765744 759445965
2610.7 759445965 758956134 758406043 757997692 757666528 757206619 756668985 756269336 755959988 755502820 754915833
2631.1 754915833 754430234 754083991 753688872 753159881 752644718 752250671 751864374 751365662 750857115 750447452
2651.5 750447452 750022233 749477386 748916924 748490453 748147428 747707427 747168124 746693492 746301353 745861471
2671.9 745861471 745366335 744920611 744515955 744054377 743520319 743009865 742565751 742086112 741538465 741027117
2692.3G41027117m28379m26233m96506n24342n10812n22018n35845n34833n17487m86017
2712.7G36044645m97281n36084n16952m90307n14925n17130m90069m85301n06759n29647
2733.1G30960190m90606m17828l87251m00186m06504l81171l83497m22358m61102m73141
2753.5G26736546m26531m04537m59313m78447m16636l66629m19437m86672m32790l81469
2773.9G22464085m71950n65350n55515n57363n97239n58793m56095m50373n76496o83784
2794.3G16991127o65844o09696o49392p34509p50303p00950o86050p67529q40247q19504
2814.7G09767103q04603q70764r32574r21131r25004j017571j106619j106859j116693
2833G00965285j258313j475573j735330k106607k578377l044963l248572k867759j953661
$$ plain form
2692.3 741027117 740598738 740172505 739675999 739151657 738640845 738118827 737582982 737048149 736530662 736044645
2712.7 736044645 735547364 735011280 734494328 734004021 733489096 732971966 732481897 731996596 731489837 730960190
2733.1 730960190 730469584 730051756 729664505 729264319 728857815 728476644 728093147 727670789 727209687 726736546
2753.5 726736546 726310015 725905478 725446165 724967718 724551082 724184453 723765016 723278344 722845554 722464085
2773.9 722464085 721992135 721426785 720871270 720313907 719716668 719157875 718701780 718251407 717674911 716991127
2794.3 716991127 716325283 715715587 715066195 714331686 713581383 712880433 712194383 711426854 710586607 709767103
2814.7 709767103 708962500 708091736 707159162 706238031 705313027 704295456 703188837 702081978 700965285
2833 700965285 699706972 698231399 696496069 694389462 691811085 688766122 685517550 682649791 680696130
2851.4F80696130r78172l07977O556r477k68936n65350p96318r98318j100362r93430
2871.8F74684346p81894o44863n67317m76479m35651n19752o64413p55787q00192q94726
2892.2F68143272j043915j127541j130939j133442j165688j246273j356364j527250
2908.5F58411860j817762k212465k582312k644062k258539j634896j036405n38290
2924.8F43687129o4611L56495N63264O50287Q32200J098990J334012J408934J281142
2943.2F51147842J038194P23839L74913Q0288j44542k04205k6405K67863O48797J054704
2963.6F54961288J324832J474202J610994J737595J718223J516938J364172J349568
2979.9F67057812J212061R12428P38978P51853P85589O34790K99751J03534L7431j55985
$$ plain form
2851.4 680696130 679717958 679409981 679416537 679407060 679138124 678572774 677776456 676778138 675677776 674684346
2871.8 674684346 673902452 673257589 672690272 672213793 671778142 671258390 670593977 669838190 669037998 668143272
2892.2 668143272 667099357 665971816 664840877 663707435 662541747 661295474 659939110 658411860
2908.5 658411860 656594098 654381633 651799321 649155259 646896720 645261824 644225419 643687129
2924.8 643687129 643622518 643979013 644542277 645192564 646024764 647123754 648457766 649866700 651147842
2943.2 651147842 652186036 652909875 653284788 653365076 653220534 653016329 652989924 653257787 653906584 654961288
2963.6 654961288 656286120 657760322 659371316 661108911 662827134 664344072 665708244 667057812
2979.9 667057812 668269873 669182301 669921279 670673132 671458721 672093511 672393262 672496796 672534227 672378242
3000.3F72378242l66688m05431l28779k78830k99335l55601m37558n60343o89149p33912
3020.7F67922616o69420o57618p64906p89225o70374n82397p00056q74579p74026n82338
3041.1F60857677o71088q87692r25780q25822q00371q51929q43764q17418q32975q11517
3061.5F52589321p04586n86510o47187q29637q11518o03437m87566n48303o69003p00235
3081.9F46001339o84023p72774q13484p00772o90162p80642p52271o39915o43432q06153
3102.2F38717711q73089p20918o51836q20697q85129p24792o67691q35121j069427
3120.6F31469011j187443j110793r65178r21309r85860j049042j036525r58323r54271
3139F22300267j109183j215756j170277j132310j065254r70185j075327j290619j335383
$$ plain form
3000.3 672378242 672011554 671606123 671277344 670998514 670699179 670343578 669906020 669345677 668656528 667922616
3020.7 667922616 667253196 666595578 665830672 665041447 664371073 663788676 663088620 662214041 661440015 660857677
3041.1 660857677 660186589 659298897 658373117 657547295 656746924 655894995 655051231 654233813 653400838 652589321
3061.5 652589321 651884735 651298225 650651038 649821401 649009883 648406446 647918880 647370577 646701574 646001339
3081.9 646001339 645317316 644544542 643731058 643030286 642340124 641559482 640807211 640167296 639523864 638717711
3102.2 638717711 637844622 637123704 636471868 635651171 634766042 634041250 633373559 632538438 631469011
3120.6 631469011 630281568 629170775 628205597 627284288 626298428 625249386 624212861 623254538 622300267
3139 622300267 621191084 619975328 618805051 617672741 616607487 615637302 614561975 613271356 611935973
3157.3F11935973j262843j237750j248420j235544j210332j204968j237213j309574
3173.6F01989329j297355j189828j177966j238704j253784j259327j264512j250685
3189.9E92057168j270174j300216j264692j232206j245320j222730j172006j173854
3206.3E82175970j222372j191616j089275j101971j188933j176000j131713j150072
3222.6E72924018j151145j110971j081109j051843j047790j144469j237571j185417
3238.9E63913703j097977j088619j106739j117111j167774j213610j151145j086711
3255.2E54884017j110375j109243j088142j094282j068175j001596r50873r91047j069307
3273.6E45400977j106918j114607j044452r72926r87769r89735r51409q78274q21352
$$ plain form
3157.3 611935973 610673130 609435380 608186960 606951416 605741084 604536116 603298903 601989329
3173.6 601989329 600691974 599502146 598324180 597085476 595831692 594572365 593307853 592057168
3189.9 592057168 590786994 589486778 588222086 586989880 585744560 584521830 583349824 582175970
3206.3 582175970 580953598 579761982 578672707 577570736 576381803 575205803 574074090 572924018
3222.6 572924018 571772873 570661902 569580793 568528950 567481160 566336691 565099120 563913703
3238.9 563913703 562815726 561727107 560620368 559503257 558335483 557121873 555970728 554884017
3255.2 554884017 553773642 552664399 551576257 550481975 549413800 548412204 547461331 546470284 545400977
3273.6 545400977 544294059 543179452 542135000 541162074 540174305 539184570 538233161 537354887 536533535
3291.9E36533535q90375r94742j028359r97602q85070p82132q46624j058996j245081
3310.3E27804554j253546j163602j174152j221537j214922j225352j258969j358509
3326.6E17933965j484216j469016j384496j325786j250625j297593j485884j562000
3342.9E06674349j519859j446008j352668j403272j568645j606435j503021j393347
3359.2D94881094j372904j387775j275867j166612j293689j523823j564800j398713
3375.5D83896911j240969j185864j202285j177162j026630q25763p18773q33928j069963
3393.9D74615574j060963p48783n85765q13961j055062r41783p11322o15060n95808
3412.3D67487067o64264p17252n80222m34637m02987k96414j16467p16j3768k086J42604
$$ plain form
3291.9 536533535 535643160 534648418 533620059 532622457 531737387 530955255 530108631 529049635 527804554
3310.3 527804554 526551008 525387406 524213254 522991717 521776795 520551443 519292474 517933965
3326.6 517933965 516449749 514980733 513596237 512270451 511019826 509722233 508236349 506674349
3342.9 506674349 505154490 503708482 502355814 500952542 499383897 497777462 496274441 494881094
3359.2 494881094 493508190 492120415 490844548 489677936 488384247 486860424 485295624 483896911
3375.5 483896911 482655942 481470078 480267793 479090631 478064001 477238238 476519465 475685537 474615574
3393.9 474615574 473554611 472805828 472220063 471406102 470351040 469409257 468697935 468082875 467487067
3412.3 467487067 466822803 466105551 465525329 465090692 464687705 464391291 464274824 464274108 464260340 464258254 464400858
3434.7D64400858J16974j28091j60724O7235K85476L92258L56198L28600M24057N82785
3455.1D66665626P38769Q24035P64071P42406R68129J130670R06438O01202O61105
3473.4D74002451Q93056J067072J171440J077384R69738J075297J167029J143456J185894
3491.8D83752817J294702J375050J342833J333356J425057J330733J168341J297057
3508.1D94319946J511603J615226J573265J405537J404107J634598J873850J817227
3524.4E07155359J607775J615882J663924J699328J910627K012730J856565J877427
3540.8E21399617K125025K231479J984179J782596J988351K190292K111316K108991
3557.1E37921846K314866K322852K073169K254844K945303K896131K351641K344609
$$ plain form
3434.7 464400858 464517832 464389741 464229017 464296252 464581728 464973986 465330184 465658784 466082841 466665626
3455.1 466665626 467404395 468228430 468992501 469734907 470703036 471833706 472740144 473341346 474002451
3473.4 474002451 474895507 475962579 477134019 478211403 479181141 480256438 481423467 482566923 483752817
3491.8 483752817 485047519 486422569 487765402 489098758 490523815 491854548 493022889 494319946
3508.1 494319946 495831549 497446775 499020040 500425577 501829684 503464282 505338132 507155359
3524.4 507155359 508763134 510379016 512042940 513742268 515652895 517665625 519522190 521399617
3540.8 521399617 523524642 525756121 527740300 529522896 531511247 533701539 535812855 537921846
3557.1 537921846 540236712 542559564 544632733 546887577 549832880 552729011 555080652 557425261
3573.4E57425261K559959K675832K821207K830386K695322K863228L184080K934814
3589.7E79990089K630114K890885L160358L171265L197193L127217K872289K851605
3606F03891015L192902L339469L359676L339588L154099L522694L857553L044725K236128
3624.4F32937849K523601L998398M308284L060341K804577L015041L048539K955974
3640.7F58652604K644062K398908K943098M200876L881276K295017K255559L049433
3657F82320833K787650K155542J890540J720786J817465K368510K209187J631498K179623
3675.4G01081634K141118J384616J243293J185000J206398J752317K008438J167714
3691.7G13170528O55055P47145Q11755Q87037J034975Q11279M68313N17667R32335
$$ plain form
3573.4 557425261 559985220 562661052 565482259 568312645 571007967 573871195 577055275 579990089
3589.7 579990089 582620203 585511088 588671446 591842711 595039904 598167121 601039410 603891015
3606 603891015 607083917 610423386 613783062 617122650 620276749 623799443 627656996 630701721 632937849
3624.4 632937849 635461450 639459848 643768132 646828473 649633050 652648091 655696630 658652604
3640.7 658652604 661296666 663695574 666638672 670839548 674720824 677015841 679271400 682320833
3657 682320833 685108483 687264025 689154565 690875351 692692816 695061326 697270513 698902011 701081634
3675.4 701081634 703222752 704607368 705850661 707035661 708242059 709994376 712002814 713170528
3691.7 713170528 713825583 714572728 715384483 716271520 717306495 718117774 718586087 719103754 720036089
3710G20036089J168907O92606K45273K42830M04059M72546M79400L85344J33634J09553
3730.4G24370241M95255R35733Q80540K00510l36468k265P14540M52340K25186O78122
3750.8G28613734N25773P1883J40071L99768L02255O9976Q3804J81616M00066M41790
3771.2G31230736J02877m3273K12789L84688J68264J01447K01226J10626M0233K6226
3791.6G32535839K0146J12772O4493J88827M13895M0769K9445K76387l1769k81692
3812G33369112p2122K50221K09272L10301L09110j08898j73986j08063o1869K4020
3832.4G33947098O3718K22146L17693J35600L8743r775k62618n10990k85924O02901
3852.8G34258592P38084j74224l94523j57476R3639L6717j93417m8459J43349J33276
$$ plain form
3710 720036089 721204996 721897602 722142875 722385705 722789764 723262310 723741710 724127054 724260688 724370241
3730.4 724370241 724865496 725801229 726681769 726882279 726545811 726543546 727258086 727710426 727935612 728613734
3750.8 728613734 729139507 729211390 729351461 729751229 730053484 730123460 730207264 730388880 730788946 731230736
3771.2 731230736 731333613 731290340 731503129 731887817 732056081 732157528 732358754 732469380 732509613 732535839
3791.6 732535839 732555985 732668757 732733250 732922077 733335972 733376741 733406186 733682573 733650804 733369112
3812 733369112 733296990 733547211 733756483 734066784 734375894 734266996 734093010 733984947 733923078 733947098
3832.4 733947098 734010816 734232962 734550655 734686255 734724998 734715223 734452605 733941615 733655691 734258592
3852.8 734258592 734996676 734822452 734427929 734270453 734364092 734400809 734207392 734158933 734302282 734435558
3873.2G34435558P451k15054o7711J21177J02639J58071j15215k50996j3828j44660
3893.6G34017432l33250j28507M5061Q1598J95861P9572j83105k42174k28166j72138
3914G33132184N304P1049n2035j16050m3094l2365j10329n9604J1146q4341j78993
3936.4G32542872j60932n0783K9504p8440j28269k4676m5479j08659o5446n0485j00255
3958.9G31758952j26302r4056m4704m2319o7353p2599n4002n960j073p3910o9797J0312
3983.3G31117189m6015j51336r8527j3947k1756q8274r7037
3997.6G30600297
$$ plain form
3873.2 734435558 734443009 734227955 734160244 734281421 734384060 734542131 734426916 734175920 734162092 734017432
3893.6 734017432 733684182 733555675 733600736 733682334 733878195 733957767 733774662 733532488 733304322 733132184
3914 733132184 733137488 733208537 733156502 733040452 732997358 732964993 732854664 732795060 732806206 732721865 732542872
3936.4 732542872 732381940 732331157 732360661 732282221 732153952 732129276 732083797 731975138 731909692 731859207 731758952
3958.9 731758952 731632650 731538594 731493890 731451571 731384218 731311619 731257617 731251657 731250584 731176674 731106877 731117189
3983.3 731117189 731071174 730919838 730821311 730807364 730785608 730697334 730600297
3997.6 730600297
##END=$$ End of the data block
