##TITLE=Francielle I $$ Begin of the data block
##JCAMP-DX=5.00 $$ ACD/SpecManager v 10.08
##SPECTROMETER/DATA SYSTEM=Alpha
##DATE=02 Apr 2015 08:25:20
##DATA TYPE=INFRARED SPECTRUM
##DATA CLASS=XYDATA
##ORIGIN=
##OWNER=
##NPOINTS=1765
##FIRSTX=399.76428223
##LASTX=3997.64306641
##MAXX=3997.64306641
##MINX=399.76428223
##MAXY=1.00000000
##MINY=0.45533240
##XFACTOR=1.0000000000
##YFACTOR=0.000000010000000
##FIRSTY=1.00000000
##DELTAX=2.03961372
##XUNITS=1/CM
##YUNITS=ARBITRARY UNITS
##XYDATA=(X++(Y..Y))
399.8A00000000r1261R1261%r33766j087749r4557Q29053O32387m19205r52947p3564
422.2I7899652Q04281P73024n6278p06673m06134M54998Q25423K57128n47808o29628
442.6I8667985J12325P35307M84383l08782p21115k97135M61841O62941Q684o31386
463I9175048n09155J87308O05648K36530m52352n88983q3608M33088L74001k28465
483.4I9149060p00271m97228L2312J89429l11678j078207j607209k233213l917575
501.7H9025420m971367l140724j820260k258146P54130O336301P673979M507941J638162
520.1I7745436P81221O92606M35322r4122m20188k50817J70195L58385J60974j35791
540.5I9443221j57821J24293L55268K35039j10048k73907q6558K10464K60049%k58982
$$ plain form
399.8 100000000 99908739 100000000 100000000 99066234 97978485 97883928 98712981 99345368 98926163 97973216 97899652
422.2 97899652 98703933 99476957 99420679 98714006 98307872 98762870 99588293 99845421 99297613 98667985
442.6 98667985 98780310 99515617 100000000 99691218 98970103 98672968 99134809 99797750 99806434 99175048
463 99175048 98665893 98853201 99458849 99695379 99243027 98654044 98570436 99003524 99377525 99149060
483.4 99149060 98448789 97951561 97983873 98173302 97861624 96783417 95176208 92942995 89025420
501.7 89025420 84054053 80913329 79093069 76834923 77589053 83925354 91599333 96107274 97745436
520.1 97745436 98526657 99219263 99654585 99560463 99140275 98889458 99059653 99418038 99579012 99443221
540.5 99443221 99285400 99409693 99764961 100000000 99889952 99616045 99529487 99739951 100000000 100000000 99741018
562.9I9741018k46054J0192K13152J38724j13165k47336j19304J04761J64270k56k19107
585.4I9426895k64757j19782O366o6209l14432n81313r14430j633197k383709j475370
605.8I1680062J126540K552819J800298N36031n57745j360446p34192J057869J888097
624.1I7989333J323062N77384J10221j18399q8578P0310J11407q7411m12666m97681
644.5I8976982q1689M37624M80318J29282j57100j64455K9695J77646J06066r7471
664.9I9836898k98256k25806J32853J82461j6814k35647k56878n6654J31827P8851
685.3I9272835j59269l16578k22588N519Q8370r2399l61204m70197l37047m4280J30397
707.7I7493559n5241l47060l51656j31661l7706k20137m92913n84882m29559k27845
$$ plain form
562.9 99741018 99494964 99505156 99718308 99857032 99743867 99496531 99377227 99481988 99646258 99646002 99426895
585.4 99426895 99162138 99042356 99048722 98982513 98668081 98086768 97172338 95539141 93155432 91680062
605.8 91680062 92806602 95359421 97159719 97695750 97138005 95777559 95043367 96101236 97989333
624.1 97989333 99312395 99889779 100000000 99881601 99793023 99863333 99974740 99887329 99474663 98976982
644.5 98976982 98895293 99332917 99813235 99942517 99785417 99620962 99650657 99828303 99934369 99836898
664.9 99836898 99538642 99312836 99445689 99628150 99611336 99375689 99118811 99062157 99193984 99272835
685.3 99272835 99113566 98796988 98574400 98579919 98668289 98575890 98214686 97744489 97407442 97363162 97493559
707.7 97493559 97438318 97091258 96739602 96607941 96570235 96350098 95857185 95272303 94842744 94614899
728.1I4614899k62576n60814q59309r19842q15743q31885j092744j426517j522106
746.5H6323363j252348q01932m27598j90515N9838M92203J050514J445144J418758
764.9H8117427Q76379K1982p1806J372308K644592K116311R11462L61055M07529N21416
785.3I7278655L60047j7434k66278j50239J40595K06471j05733n69040q69703r60654
805.6I5046687j148790j846641l303093n494040p717258p986289m831273J95033M311293
824F7225629O147570O030070N282855M508013L270060J746791Q90363R30494J033038
842.4I7064883O14386o8032n36764n05012K2840O23739P48920M29607K06995L01224
862.8I8902786M19998K77746m6760k14523m2087K59864L39490J03486j60128j57934
$$ plain form
728.1 94614899 94352323 93791509 92932200 92012358 91196615 90364730 89271986 87845469 86323363
746.5 86323363 85071015 84269083 83841485 83650970 83710808 84203011 85253525 86698669 88117427
764.9 88117427 88993806 89015788 88943982 90316290 92960882 95077193 95988655 96349710 96757239 97278655
785.3 97278655 97638702 97621268 97354990 97204751 97345346 97551817 97446084 96877044 96007341 95046687
805.6 95046687 93897897 92051256 88748163 83254123 75536865 67550576 62719303 62914336 67225629
824 67225629 73373199 79403269 84686124 89194137 92464197 94210988 95101351 96031845 97064883
842.4 97064883 97679269 97611237 97074473 96569461 96592301 97216040 97964960 98394567 98601562 98902786
862.8 98902786 99322784 99600530 99553770 99339247 99297160 99557024 99896514 100000000 99839872 99681938
883.2I9681938Q0728K37334%k07269l80582k23148P5305J70719l9792l11279l31962
905.6I8751992p3642J67460J18249j66297l60477k46888K3264J22595o9821l32398
926I7934037l77142j89835r3257m69649j150811j030016K44427J149976Q54987J47724
946.4I7020441l73232n96953n33378l58492l50678o32882p80630m91875p648O22297
966.8I3516970R92673O23870R9689j7643O5559j0085l16930o48546q33040r03362q09974
989.2I1759181k98458M12362P04486N25748K42496q0937n04905r17942j229953j520378
1009.6H9091700j663762j040173N05555J613432J106400M70680R92608J187437M31604
1028I2695481k25085n97120j137483j934522k358967j420993P32672K450735K627474
$$ plain form
883.2 99681938 99762666 100000000 100000000 99792731 99412149 99189001 99264306 99435025 99395233 99083954 98751992
905.6 98751992 98678350 98845810 98964059 98797762 98437285 98190397 98213661 98336256 98266435 97934037
926 97934037 97556895 97367060 97273803 96804154 95653343 94623327 94867754 96017730 96872717 97020441
946.4 97020441 96647209 96050256 95516878 95158386 94807708 94174826 93394196 92902321 92894673 93516970
966.8 93516970 94509643 95133513 95233202 95215559 95281118 95271033 94954103 94305557 93472517 92569155 91759181
989.2 91759181 91460723 91873085 92577571 93103319 93345815 93264878 92759973 91842031 90612078 89091700
1009.6 89091700 87427938 86387765 86893320 88506752 89613152 90083832 91076440 92263877 92695481
1028 92695481 92470396 91873276 90735793 88801271 86442304 85021311 85753983 88204718 90832192
1046.3I0832192J800137R36509M75978L76916L87699K86358P3165p2723k1720J34402
1066.7I5208913J86700O0272j07807j29861R162J46842J31309j5343j23870o6406Q3083
1089.2I5382994J39147K7818j34224j80101r1630l159n3990k56390n20664q03471r79793
1111.6I2526537o04516K36767N71543J93286j05393P5406N22185P58648N68276K98971
1132I5041710K15024J86008P8118n6899r2095o240R2399Q5532k0295j01060o9177K9636
1156.5I5382661O5815k0277j37806j52833n1498M9758K5564j21617l03340n43535q28474
1178.9I3364418n75209M24558R99147O40028K24430J12778K8747j13797k07144j86217
1199.3I4711739j26857j76954m21089p12800n80573P0494M87411L24947O0785o0362
$$ plain form
1046.3 90832192 92632329 93568838 94044816 94421732 94809431 95095789 95168954 95096231 95074511 95208913
1066.7 95208913 95395613 95455885 95348078 95218217 95227379 95374221 95505530 95490187 95366317 95299911 95382994
1089.2 95382994 95522141 95549959 95415735 95235634 95144004 95140845 95086855 94830465 94309801 93506330 92526537
1111.6 92526537 91922021 92158788 92730331 92923617 92818224 92893630 93415815 94174463 94742739 95041710
1132 95041710 95256734 95442742 95520860 95463961 95371866 95365626 95458025 95543557 95523262 95422202 95353025 95382661
1156.5 95382661 95448476 95428199 95290393 95137560 95086062 95135820 95161384 95039767 94736427 94192892 93364418
1178.9 93364418 92789209 93213767 94212914 94852942 95077372 95190150 95218897 95105100 94897956 94711739
1199.3 94711739 94584882 94407928 93986839 93274039 92693466 92763960 93251371 93576318 93637103 93576741
1219.7I3576741j19191j88577l30544m53418l36230k9022J35935L5762j91742m05884
1240.1I1693830n07289m61185l50105l11929m23259o61957r74328j395928k064521
1258.4H4543329k982276l331429j405174K724308N587060M861068K410662O26481j25462
1276.8I2908567l49140m19337n17439o66744p91401q28927p80601p05582p19249r11659
1297.2H6218488j164162j162666n66882J40345l20232j898372l299475m219102m967785
1315.6F8760157n131472m081785j608378K640927P485807R470916P617718M426133
1331.9H9580023K040583P98315J69832l16942p35915r66507r98688r45723j025629
1350.2H7599349j253241j463568j650161k154076l326923m447228k945733J335490
$$ plain form
1219.7 93576741 93457550 93268973 92938429 92485011 92148781 92119759 92255694 92291456 92099714 91693830
1240.1 91693830 91186541 90725356 90375251 90063322 89640063 88978106 88003778 86607850 84543329
1258.4 84543329 81561053 78229624 76824450 79548758 85135818 89996886 92407548 93034029 92908567
1276.8 92908567 92559427 92140090 91622651 90955907 90164506 89335579 88554978 87849396 87130147 86218488
1297.2 86218488 85054326 83891660 83324778 83465123 83144891 81246519 77947044 73727942 68760157
1315.6 68760157 63628685 59546900 57938522 60579449 68065256 77536172 85153890 89580023
1331.9 89580023 91620606 92418921 92588753 92271811 91535896 90569389 89570701 88624978 87599349
1350.2 87599349 86346108 84882540 83232379 81078303 77751380 73304152 70358419 71693909
1366.6G1693909M881090N063337K696991m49163k703183j465434K063793L337043J749069
1384.9H6867452M2438q61132j327330j961237k977490m183054n561007m526782J049602
1403.3F6561460P605571Q765650N210346J993418L40879l20030o77740j024926j174515
1421.6H7280113j329667j476699j443672j439685j327514j217312j597220j996499
1437.9G5451845j567257r22912m10408l35014q76748j609069j920432j303381J042611
1456.3F7549235M477048M646408L343546K301419J089192J48999k96855n31542n23996
1474.7H2203454m47786n01996n96583o46782o74403q24690j059746j102269q93533
1493G5455666r25285j317841j700508j939691k136606l007233m426604k928192l13359
$$ plain form
1366.6 71693909 76574999 81638336 84335327 83886164 81182981 79717547 81781340 85118383 86867452
1384.9 86867452 86909890 86048758 84721428 82760191 79782701 75599647 70038640 65511858 66561460
1403.3 66561460 74167031 82932681 88143027 90136445 90477324 90157294 89479554 88454628 87280113
1421.6 87280113 85950446 84473747 83030075 81590390 80262876 79045564 77448344 75451845
1437.9 75451845 73884588 72961676 72551268 72216254 71339506 69730437 67810005 66506624 67549235
1456.3 67549235 72026283 76672691 80016237 82317656 83406848 83555847 83258992 82727450 82203454
1474.7 82203454 81755668 81253672 80657089 80010307 79335904 78511214 77451468 76349199 75455666
1493 75455666 74530381 73212540 71512032 69572341 67435735 64428502 60001898 57073706 56760347
1511.4E6760347J895320L921014M635919L293597J585210K49642o40601j018065r33886
1529.7F9748497p95311o70182l76243k41476m86916j020974j849252k781493l118503
1548.1E8408147k390933l3158K826393M339277N848301O318575L453481K530354K499187
1566.4H3799624K229691J858723J082480L52681k99299q87412j362562j869440k236134
1584.8H2668352k525985k861005l173751l374785l465909l334743k857154k017301
1601.1E9057719r49443r8640J70321J59949O63495J864761L602701M827047L410512
1619.5G2708422J590842N76395O1744P332o0267l82340r43046j760895j899987j555008
1639.9F8343192j413887j168937r27633p33507p39324j999551m503321m279882l598553
$$ plain form
1511.4 56760347 58655667 62576681 67212600 70506197 72091407 72341049 71700448 70682383 69748497
1529.7 69748497 68953186 68283004 67906761 67665285 67178369 66157395 64308143 61526650 58408147
1548.1 58408147 56017214 55984056 58810449 63149726 68998027 75316602 78770083 81300437 83799624
1566.4 83799624 86029315 87888038 88970518 89323199 89023900 88136488 86773926 84904486 82668352
1584.8 82668352 80142367 77281362 74107611 70732826 67266917 63932174 61075020 59057719
1601.1 59057719 58108276 58009636 58179957 58339906 59003401 60868162 64470863 69297910 72708422
1619.5 72708422 74299264 74875659 74937403 74944735 74884468 74502128 73559082 71798187 69898200 68343192
1639.9 68343192 66929305 65760368 64832735 64099228 63359904 61360353 56857032 52577150 48978597
1658.2D8978597k801704o43653J748589K979645M421478N962211N249745M414540L971482
1676.6G4280930K950775K258241K137810K451575K016062J468062J340193J053208
1692.9H9956856Q83233Q59267Q57168R86547P50815M46731L68989L32576L17490K83021
1713.3I6042693K04754J84279K50250K71654K28042J47503R740p5179m4269J51563
1733.7I7371030L62110K99346J99271J78039K10774K21282J66899P1967L3629L8540
1754.1I9152887N0610N4074k474o0809k8854M3237R8991J03706N8639M8334N6404O7621
1778.6I9642366O2901m703j11097j56623j32954j00261m500Q4054P6103O7270J37639
1801I9560195J96982J37895J9145m8471p712O6811N7667l7181j15896j09797k3026
$$ plain form
1658.2 48978597 46176893 45533240 47281829 50261474 54682952 60645163 65894908 70309448 74280930
1676.6 74280930 77231705 79489946 81627756 84079331 86095393 87563455 88903648 89956856
1692.9 89956856 90840089 91699356 92556524 93543071 94293886 94740617 95109606 95442182 95759672 96042693
1713.3 96042693 96247447 96431726 96681976 96953630 97181672 97329175 97338915 97263736 97219467 97371030
1733.7 97371030 97733140 98032486 98231757 98409796 98620570 98841852 99008751 99080718 99114347 99152887
1754.1 99152887 99203497 99257571 99255097 99194288 99165434 99208671 99307662 99411368 99470007 99518341 99574745 99642366
1778.6 99642366 99705267 99700564 99589467 99432844 99299890 99199629 99195129 99279183 99355286 99422556 99560195
1801 99560195 99757177 99895072 99914217 99865746 99858034 99924845 99982512 99945331 99829435 99719638 99696612
1823.4I9696612P8613P9209j717j8555K7102N8270O5702J4764p4595r6089J5211R2650
1847.9I9937177N2923l5274r4599p3814r489J8972k4635r6458j34224p7134M8739Q5073
1872.4I9597257J9581l8225l0196J8233L9411o378q3828j38664j53011k19399m31907
1894.8I8572874o92773p15655k64054M31054P74527O15072L23028J65873J29450J05458
1915.2I9444854N2798j3536p8905q6891m334O8868N7876m53l7694k7156m965j4443
1939.7I9356019l7777k4307J3805L8564L9905J1665k8384m7392l8850k5326l4642p1424
1964.2I9151856r3496n4318R424L1280R746k2436k7424P099M5550M5252J1480j8269
1988.7I9095744k0599L016J4793j3488m7916m6754j0658K7800L3063N430k3747k6005
$$ plain form
1823.4 99696612 99775225 99854434 99852717 99834162 99861264 99919534 99985236 100000000 99925405 99829316 99844527 99937177
1847.9 99937177 99990100 99954826 99860227 99786413 99776924 99795896 99771261 99674803 99540579 99463445 99512184 99597257
1872.4 99597257 99616838 99578613 99548417 99566650 99606061 99599683 99515855 99377191 99224180 99004781 98572874
1894.8 98572874 97880101 97164446 96900392 97331446 98105973 98721045 99044073 99209946 99339396 99444854
1915.2 99444854 99497652 99484116 99405211 99318320 99313986 99382854 99440730 99440277 99402583 99375427 99370462 99356019
1939.7 99356019 99318242 99293935 99307740 99346304 99386209 99397874 99369490 99322098 99283248 99257922 99223280 99151856
1964.2 99151856 99058360 99004042 99013466 99044746 99054492 99032056 99004632 99011731 99057281 99102533 99114013 99095744
1988.7 99095744 99075145 99078161 99092954 99079466 99031550 98984796 98974138 99001938 99035001 99040431 99016684 98990679
2013.1I8990679o652N996o282l8880o4206n0676R89K8020K629k2835j2761J6785L2431
2039.6I8875237K2459J245o431M739J4775N305j8942l5000k6780p338j245j4961l0822
2066.2I8782241k8348j4370m459q553k3723l5154l2640k2346j6194j3340m643J9628
2090.6I8598099M9674O0547M0006M483j6982j0073O187L374j6529l3432l0053q928
2115.1I8646373P826L719j1212j5443k665J2368P481j8668m2963m2457j7834N061J07
2141.6I8531693k3317l5125k2799k432K772r263j8424p897J2678J7208o944m4245o1798
2168.1I8332107l6043J2845M3690M3398K6381J7846K3788K3538M828j8537k3800l463
2192.6I8446578K1189K2221l708k8157k0236J1331K8903J0967k6673n0468m1836j5491
$$ plain form
2013.1 98990679 98984027 98990023 98983741 98944861 98880655 98829979 98830968 98858988 98861617 98838782 98826021 98842806 98875237
2039.6 98875237 98897696 98898941 98892510 98897249 98912024 98917329 98898387 98863387 98836607 98829269 98828024 98813063 98782241
2066.2 98782241 98753893 98739523 98735064 98726511 98702788 98667634 98634994 98612648 98596454 98583114 98578471 98598099
2090.6 98598099 98647773 98708320 98748326 98752809 98735827 98725754 98731941 98735315 98718786 98685354 98655301 98646373
2115.1 98646373 98654199 98657918 98646706 98631263 98628598 98640966 98648447 98629779 98586816 98544359 98526525 98531586 98531693
2141.6 98531693 98508376 98473251 98450452 98448020 98450792 98441529 98423105 98415208 98427886 98445094 98438150 98393905 98332107
2168.1 98332107 98296064 98308909 98352599 98395997 98422378 98440224 98464012 98487550 98492378 98473841 98450041 98446578
2192.6 98446578 98467767 98489988 98486280 98458123 98437887 98449218 98478121 98489088 98462415 98411947 98370111 98354620
2217.1I8354620k945j3256k5296j4585J8364L9238K1386j5056l6335k8861o527j144
2241.6I8289603k3937m5800l3451N848L3712K6041k491j7721p140R262M757k2382n0384
2268.1I8165917n6380l9261j9986j4937k1338j9485O014L9298M4465J0925l4845n7411
2292.5I8002976m1413j0765r763m9806q5800p1681j3101L8296L6979m447l7956m4823
2317I7708696m4930n1635n9939n4872k3252J7888K7841k402m4626o3664l2752K5707
2341.5I7402060O4796P4268N2726L117m7606q1038j01984j12081r0938l1811L4302
2363.9I7165811O7061O6650O7169Q1420R4711Q5140N5068K8223J7131K3371L2782J9795
2388.4I7804332j6391m1903l2383L40K5886K5696P218l320P683J7995R942q172j9878
$$ plain form
2217.1 98354620 98351675 98338419 98313123 98298538 98316902 98356140 98377526 98362470 98326135 98297274 98290747 98289603
2241.6 98289603 98265666 98219866 98186415 98192263 98225975 98252016 98249525 98231804 98224664 98233926 98238683 98216301 98165917
2268.1 98165917 98109537 98070276 98050290 98035353 98014015 97994530 98000544 98039842 98084307 98095232 98060387 98002976
2292.5 98002976 97961563 97950798 97941035 97891229 97805429 97733748 97720647 97758943 97795922 97791475 97753519 97708696
2317 97708696 97663766 97612131 97552192 97497320 97474068 97491956 97519797 97517395 97472769 97409105 97376353 97402060
2341.5 97402060 97466856 97541124 97593850 97596967 97549361 97468323 97366339 97254258 97163320 97131509 97165811
2363.9 97165811 97232872 97299522 97366691 97448111 97542822 97627962 97683030 97711253 97728384 97751755 97784537 97804332
2388.4 97804332 97787941 97746038 97713655 97713995 97739881 97765577 97772795 97769475 97777158 97795153 97805095 97796923 97777045
2414.9I7777045r275J6403K5124O080j8102k3014o628Q035K724j8811l7837l5119j2482
2441.4I7674143M095n990l1334m4042k8831j484N656j2636k8348j7732J4192L8039
2465.9I7565728K8998n150k6822j4722Q225J0872j0288l1411k7740m733M923j8221
2490.4I7479659n2428o2990l8242N424L5750L4118J5390O580J3626J5622n406l7664
2514.9I7409439n4061m3786l0059m1681o8533p3058l1310L5596P6055O1447J4549j8936
2539.3I7235662k2453j6922k8563n1748n2530j1194M6718P1270M6396L385k0122j1122
2563.8I7188777J1164J6492J109j1981p718J025q857l7688n0438k1052K5803N4484
2588.3I7161120N2184K1112j4287k1780r30J5402j740l8970n6421l9375j6624k5618
$$ plain form
2414.9 97777045 97767770 97784173 97809297 97815377 97797275 97774261 97767633 97775668 97778392 97759581 97721744 97686625 97674143
2441.4 97674143 97678238 97672248 97640914 97596872 97568041 97566557 97572213 97559577 97531229 97513497 97527689 97565728
2465.9 97565728 97594726 97589576 97562754 97548032 97556257 97567129 97556841 97525430 97497690 97492957 97497880 97479659
2490.4 97479659 97427231 97364241 97325999 97331423 97367173 97401291 97416681 97423261 97436887 97452509 97447103 97409439
2514.9 97409439 97355378 97311592 97281533 97239852 97171319 97098261 97066951 97102547 97178602 97240049 97254598 97235662
2539.3 97235662 97213209 97196287 97167724 97115976 97063446 97052252 97098970 97170240 97216636 97220021 97199899 97188777
2563.8 97188777 97199941 97216433 97217542 97205561 97197843 97198868 97190011 97152323 97101885 97080833 97106636 97161120
2588.3 97161120 97213304 97234416 97220129 97198349 97197419 97212821 97211081 97172111 97115690 97076315 97059691 97034073
2612.8I7034073o6412j06692j13451p2104l052M9067O3568O1584P1823R3460R4038
2635.2I7105902N7215J2672l737J0627K7150J0204l8492p6181p3349m7309m0936o8843
2659.7I6874923j01781r5797l3462M4221P1793L9709k843j1766Q285J5563j0956m2241
2684.1I6755648m1187p308K7526K8050p510m1628m1879k0587j2517l0178n9146p4225
2708.6I6475059o4111m5514m3720o1089o8396m0359J717K939p0918j76239j74713J6153
2733.1I5750809K33215K53212J10328j9264n9515l5876j0222k3598n5176o2203m0132
2755.5I6041578k0909l5930p8744j13827j15639q3595m8763m5752p4065j04493j06197
2778I5213664q3477q0239j21046j76990k08681k12598k07031j99443j77914j15746
$$ plain form
2612.8 97034073 96967661 96860969 96747518 96675414 96672362 96721429 96784997 96846581 96918404 97011864 97105902
2635.2 97105902 97163117 97175789 97172052 97182679 97209829 97220033 97181541 97105360 97032011 96984702 96943766 96874923
2659.7 96874923 96773142 96677345 96643883 96688104 96759897 96799606 96796763 96784997 96793282 96808845 96797889 96755648
2684.1 96755648 96714461 96707153 96734679 96762729 96755219 96713591 96671712 96651125 96638608 96608430 96549284 96475059
2708.6 96475059 96410948 96365434 96321714 96260625 96192229 96151870 96153587 96156526 96085608 95909369 95734656 95750809
2733.1 95750809 95984024 96237236 96347564 96328300 96268785 96232909 96222687 96199089 96143913 96081710 96041578
2755.5 96041578 96020669 95984739 95905995 95792168 95676529 95592934 95544171 95498419 95424354 95319861 95213664
2778 95213664 95130187 95049948 94928902 94751912 94543231 94330633 94123602 93924159 93746245 93630499
2798.4I3630499M23J36471K23809K25872J77371J30874J03623Q3375M3488k1494p7420
2820.8I4656891r5904r2817j00207j30743j74218k02888j98353j77037j87028k36702
2841.2I3060994k74134k72661k44766k10578j83445j65391j56033j48189j57684k05809
2861.6I1042304k33346j26738J59121N04559O82962N90629L46404J18792k7853j14399
2882I2942435j77670k29007k50608k18463j35344m4095O872N770j9425l5739m6033
2904.4I1798693r5683k22737m13048o22207p88248p77668m18263K30932P56222Q16256
2924.8I0264249N37824K56056R2810m7528k79916o68037j194542j547545j107705K03365
2945.2H6509031J398361J614475J103628M85283k438l67230o63281q84938q82959n00208
$$ plain form
2798.4 93630499 93630922 93767393 93991202 94217074 94394445 94525319 94628942 94712317 94755805 94734311 94656891
2820.8 94656891 94560987 94468170 94367963 94237220 94063002 93860114 93661761 93484724 93297696 93060994
2841.2 93060994 92786860 92514199 92269433 92058855 91875410 91710019 91553986 91405797 91248113 91042304
2861.6 91042304 90808958 90682220 90841341 91345900 92028862 92619491 92965895 93084687 93056834 92942435
2882 92942435 92764765 92535758 92285150 92066687 91931343 91887248 91894120 91899890 91880465 91844726 91798693
2904.4 91798693 91703010 91480273 91067225 90445018 89656770 88879102 88460839 88691771 89447993 90264249
2924.8 90264249 90802073 91058129 91150939 91103411 90823495 90155458 88960916 87413371 86305666 86509031
2945.2 86509031 87907392 89521867 90625495 91110778 91108340 90741110 90077829 89192891 88309932 87809724
2965.6H7809724J64121P48456R88346R00727O35046L60155J76758Q1968M0001J0901
2986I1916203m0769j09655j68812k05249j96915j27900j0783J24538K19185K18421
3006.4I1618264J29574J7137n2739n8937m4048o8175j43630k50697l69292m77147n54210
3028.8H9746100n66489m63438k68340j27977j45370k37685k52849j57517o2424o2728
3049.2H7401283j41496k36523l09914l56287l67188l28720k43980j22696J7822J62226
3069.6H5474527L15177M62425N59586N78255N28335M43048L51649K69205J92582R9808
3090H9274597k6929j75518l25269m70781n90879o14517m98581l40218k93046m01694
3110.4H5537165n75584p07054p56633p02715n28205k46483J07050M57871P16979Q37022
$$ plain form
2965.6 87809724 87973845 88722301 89710647 90611374 91246420 91606575 91783333 91865301 91905302 91916203
2986 91916203 91875434 91765779 91596967 91391718 91194803 91066903 91056120 91180658 91399843 91618264
3006.4 91618264 91747838 91764975 91712236 91653299 91609251 91541076 91397446 91146749 90777457 90300310 89746100
3028.8 89746100 89179611 88716173 88447833 88319856 88174486 87936801 87683952 87526435 87464011 87401283
3049.2 87401283 87259787 87023264 86713350 86357063 85989875 85661155 85417175 85294479 85312301 85474527
3069.6 85474527 85789704 86252129 86811715 87389970 87918305 88361353 88713002 88982207 89174789 89274597
3090 89274597 89247668 89072150 88746881 88276100 87685221 87070704 86572123 86231905 85938859 85537165
3110.4 85537165 84961581 84254527 83497894 82795179 82266974 82020491 82127541 82585412 83302391 84139413
3130.8H4139413Q34214P52867O28042M80127L29232K14297J43939P8762Q696m8858
3151.2H7560731j17034j99574k47913k70266l06856l52270l90893m29559m81558n41496
3171.6H4223312n96809o37931o52557o29008n73135m81605l25394j07503J36709L69937
3192H0726016N39523O09773N93347N16534L98772K57952J14125j1802j06538j69080
3212.4H3468622k08443k44874k88397l24357l50296l85726m44043n25557o14518o92159
3232.8G9390252p66242q37409q87585r17441r26912r04172q48693p67529o43933m55880
3253.2G1434456k16728L3766K44838L42315K68877N9610j85060l83032n15121n84239
3273.6G0499682o00564o11168o45244o81323o89066o45977n27817l13794j9837L03984
$$ plain form
3130.8 84139413 84973627 85726494 86354536 86834663 87163895 87378192 87522131 87600893 87609589 87560731
3151.2 87560731 87443697 87244123 86996210 86725944 86419088 86066818 85675925 85246366 84764808 84223312
3171.6 84223312 83626503 82988572 82336015 81707007 81133872 80652267 80326873 80219370 80356079 80726016
3192 80726016 81265539 81875312 82468659 82985193 83383965 83641917 83756042 83744240 83637702 83468622
3212.4 83468622 83260179 83015305 82726908 82402551 82052255 81666529 81222486 80696929 80082411 79390252
3232.8 79390252 78624010 77786601 76899016 75981575 75054663 74150491 73301798 72534269 71890336 71434456
3253.2 71434456 71217728 71251494 71496332 71838647 72107524 72167134 71982074 71599042 71083921 70499682
3273.6 70499682 69899118 69287950 68642706 67961383 67272317 66626340 66098523 65784729 65764892 66068876
3294F6068876O10530Q66813J060491J198107J278705J298278J276988J233608J172876
3312.3G6065272J090449R78279Q45033P16406O40184O50865P15518P57611P33763O59495
3332.7H3852875N71329M94301M30518L73215L12954K43497J83707J50413J19626P0602
3353.1H6803037K2942p141k5344m7588o9690o9398o9338j07228j58275j68782j43087
3375.5H5960108j27530j32984j43075j42741j24282r5260p1937q7690j35338j38420
3395.9H4760851q0186m6564r5582j53958j36185q6045o8915q3560j11455j20747q9872
3418.4H3687782o0272n7852m9919k5791q065q505M852L1280Q953m2778m1247Q065M8780
3444.9H3495283O4874O1500N5468O6870Q9729J05888J07711R1410R0879J34713J64872
$$ plain form
3294 66068876 66679406 67546219 68606710 69804817 71083522 72381800 73658788 74892396 76065272
3312.3 76065272 77155721 78134000 78979033 79695439 80335623 80986488 81702006 82459617 83193380 83852875
3332.7 83852875 84424204 84918505 85349023 85722238 86035192 86278689 86462396 86612809 86732435 86803037
3353.1 86803037 86825979 86818838 86793494 86745906 86676216 86606818 86537480 86430252 86271977 86103195 85960108
3375.5 85960108 85832578 85699594 85556519 85413778 85289496 85194236 85122299 85034609 84899271 84760851
3395.9 84760851 84680665 84634101 84538519 84384561 84248376 84162331 84093416 84009856 83898401 83777654 83687782
3418.4 83687782 83627510 83569658 83519739 83493948 83485883 83477378 83482230 83513510 83522463 83479685 83438438 83446503 83495283
3444.9 83495283 83560157 83621657 83677125 83743995 83833724 83939612 84047323 84138733 84229612 84364325 84529197
3467.3H4529197J19680M7750L9935Q9454J40095J45471J01131Q2237J08188J21934
3487.7H5525072J23584J30367J28144J19770J12581J17844J33413J21904R5397J03980
3508.1H6712056J46830J87284J75900J31249J16217J32835J62178J64992J29884J19436
3528.5H8178861J48565J79165J98526J88153J53637J47766J61773J59532J50991J54537
3548.9H9821506J58047J54376J62733J81573J91170J74487J19126Q1629J62225K76947
3569.3I1483819K66690K06166J84852J96636K26092K46221K15739J53875J57768K43967
3589.7I3581825K63632K18963K10244K34276K33281K24375K11746J68317J43409J64938
3610.1I5655006J89668K07043J89227J67077K14798K35253J63633O7919O6895J88529
$$ plain form
3467.3 84529197 84648877 84696627 84736562 84826016 84966111 85111582 85212713 85294950 85403138 85525072
3487.7 85525072 85648656 85779023 85907167 86026937 86139518 86257362 86390775 86512679 86608076 86712056
3508.1 86712056 86858886 87046170 87222070 87353319 87469536 87602371 87764549 87929541 88059425 88178861
3528.5 88178861 88327426 88506591 88705117 88893270 89046907 89194673 89356446 89515978 89666969 89821506
3548.9 89821506 89979553 90133929 90296662 90478235 90669405 90843892 90963018 91044647 91206872 91483819
3569.3 91483819 91750509 91956675 92141527 92338163 92564255 92810476 93026215 93180090 93337858 93581825
3589.7 93581825 93845457 94064420 94274664 94508940 94742221 94966596 95178342 95346659 95490068 95655006
3610.1 95655006 95844674 96051717 96240944 96408021 96622819 96858072 97021705 97089624 97156519 97345048
3630.5I7345048K12217J75106J60176J34802J03181P1579J3042m6718K2566J79434
3650.9I8370433J61028P1198Q6754J41883J05822L7521m744n8878q8715k2424j2129
3673.3I8787749m3607N2625J23584J12015Q5157M0108l779J103O8778J22243J05411
3695.8I9451387M2218j3882p021N1385N0091k3824p9345q494J04267R4836K2448l0661
3720.2I9653405m5311k9052J9860N2000n73q1551o8575N4258J18160L5114r9618j21581
3744.7I9486536j4019l368K849R5207R5504K6149Q428M8411M2486j431j6534o276K9844
3771.2I9793786M9656K1917r203j4526k956M631J7733L0726J9276p451l3783m3422
3795.7I9826384m1753o5482m3345L2527K9784L1334N6356J0241p1162q7059l1722j4472
$$ plain form
3630.5 97345048 97557265 97732371 97892547 98027349 98130530 98202109 98215151 98168433 98190999 98370433
3650.9 98370433 98531461 98602659 98689413 98831296 98937118 98974639 98969895 98911017 98822302 98799878 98787749
3673.3 98787749 98744142 98796767 98920351 99032366 99117523 99157631 99153852 99154955 99223733 99345976 99451387
3695.8 99451387 99493605 99479723 99472702 99524087 99574178 99550354 99471009 99462515 99566782 99661618 99684066 99653405
3720.2 99653405 99608094 99579042 99598902 99650902 99650329 99568778 99500203 99554461 99672621 99707735 99608117 99486536
3744.7 99486536 99472517 99469149 99471998 99567205 99662709 99688858 99697286 99745697 99788183 99786752 99770218 99763942 99793786
3771.2 99793786 99843442 99865359 99856156 99841630 99838674 99843305 99861038 99891764 99911040 99903589 99869806 99826384
3795.7 99826384 99784631 99719149 99675804 99708331 99738115 99769449 99825805 99836046 99764884 99677825 99646103 99631631
3820.2I9631631K4915O2907L1811J2296K617j9127l3498n9730n8758J4561P0739Q0091
3844.6I9760455N1612k5577j33717j73533J4222J46884Q8185L618l7057j5443q667
3867.1I9670982m3654j6636M5586O2561K2387m7820m0317R751K2567K7841j556j3590
3891.6I9698102L4410K9636l8332p5018n0402J2475Q4543J00762N9611J3589k3323
3914I9846053m2754k0194R626L81j7124m542K950n436J5861L9941K5392M315j1134
3940.5I9843335j7375k205K480r00J3405K6768K3347P522m112J931J6814J9694M470
3967I9935174r424l296J3191K5040K2822M799k957O670P981%q392q041k867N001J4299
3997.6A00000000
$$ plain form
3820.2 99631631 99656546 99719453 99751264 99763560 99766177 99747050 99713552 99653822 99595064 99609625 99680364 99760455
3844.6 99760455 99812067 99786490 99652773 99479240 99493462 99640346 99728531 99732149 99695092 99679649 99670982
3867.1 99670982 99627328 99610692 99656278 99718839 99741226 99693406 99653089 99662840 99685407 99713248 99711692 99698102
3891.6 99698102 99732512 99762148 99723816 99648798 99598396 99610871 99695414 99796176 99855787 99869376 99846053
3914 99846053 99803299 99783105 99792731 99793112 99775988 99771446 99774396 99768960 99784821 99824762 99850154 99854469 99843335
3940.5 99843335 99825960 99823755 99826235 99825335 99838740 99865508 99888855 99896377 99892265 99894196 99911010 99930704 99935174
3967 99935174 99925750 99922454 99935645 99960685 99983507 99988306 99985349 99992019 100000000 100000000 99991608 99983567 99980700 99985701 100000000
3997.6 100000000
##END=$$ End of the data block
