##TITLE=Fibregum C $$ Begin of the data block
##JCAMP-DX=5.00 $$ ACD/SpecManager v 10.08
##SPECTROMETER/DATA SYSTEM=Alpha
##DATE=19 Feb 2015 09:45:16
##DATA TYPE=INFRARED SPECTRUM
##DATA CLASS=XYDATA
##ORIGIN=
##OWNER=
##NPOINTS=1765
##FIRSTX=399.76428223
##LASTX=3997.64306641
##MAXX=3997.64306641
##MINX=399.76428223
##MAXY=0.80997705
##MINY=0.30551559
##XFACTOR=1.0000000000
##YFACTOR=1.000000000000000e-9
##FIRSTY=0.51054126
##DELTAX=2.03961372
##XUNITS=1/CM
##YUNITS=ARBITRARY UNITS
##XYDATA=(X++(Y..Y))
399.8E10541260j478195j83105m33624j501501j655876m05491P78675P03991o46591
418.1E05719543k045036j423955l91126o00218j558095j691700m80562M59403k22475
436.5D97765779j490026j554251l95685N75125J99646q79825j074135K3663J222164
454.8D94392455J126319l30001j049191l4124J078010O78450p21395j170725j64688
473.2D93805110Q78156P32004l71635r29385p3999R21249N21779q54939j639545r44734
493.6D92044061K72632K41280j049310j928062j265823l3409l9130j227945j966298
511.9D85047996j304477q3447m1425j334638k178907j523495k97725n7369r27359j715720
532.3D75583434j434177l49879K79158k31087j044929r78291r924P74651M91083k15620
$$ plain form
399.8 510541260 509063065 508879960 508446336 506944835 505288959 504883468 505662143 506366134 505719543
418.1 505719543 503674507 502250552 501859426 501259208 499701113 498009413 497528851 497988254 497765779
436.5 497765779 496275753 494721502 494325817 494900942 495100588 494220763 493146628 493170291 494392455
454.8 494392455 495518774 495188773 494139582 494105458 495183468 495861918 495140523 493969798 493805110
473.2 493805110 494683266 495415270 495043635 494114250 494040251 494961500 495483279 494628340 492988795 492044061
493.6 492044061 492316693 492557973 491508663 489580601 488314778 488281369 488242239 487014294 485047996
511.9 485047996 483743519 483660072 483618647 482284009 480105102 478581607 478283882 478226513 477299154 475583434
532.3 475583434 474149257 473799378 474078536 473847449 472802520 471824229 471814305 472588956 473080039 472864419
552.7D72864419j53363O13660J168430Q91596O6847k22028L50774Q81582O62208O0677
573.1D77184802j73926J18047M89443L26097l78698q24809m37498J54346m6193q91954
593.5D75519657j389772j035630l12418q5086n37693r60618p21544q4162J75714j7374
613.9D70551074r3580M34488J428664K027720J866192J548052J733124K283663K591311
632.3D84370708K248377J616180J468003J846283K044589J702577J096308P84814J089424
650.6D98267263J477301J341075Q49605O07431R41395J460135J418054R46939R00627
669E08209825J462936J987576K233506J914918J508951J556516J825809J692117R71079
687.3E23363233J51336j15991J10746J07109n06639j196087j264512p55966k63870
$$ plain form
552.7 472864419 472711056 473324716 474493146 475384742 475451589 475229561 475580335 476461917 477124125 477184802
573.1 477184802 477010876 477128923 477618366 477944463 477565765 476740956 476303458 476457804 476411611 475519657
593.5 475519657 474129885 473094255 472781837 472696751 472159058 471198440 470476896 470392734 470568448 470551074
613.9 470551074 470457494 470891982 472320646 474348366 476214558 477762610 479495734 481779397 484370708
632.3 484370708 486619085 488235265 489703268 491549551 493594140 495296717 496393025 497177839 498267263
650.6 498267263 499744564 501085639 501935244 502542675 503484070 504944205 506362259 507309198 508209825
669 508209825 509672761 511660337 513893843 515808761 517317712 518874228 520700037 522392154 523363233
687.3 523363233 523514569 523398578 523509324 523616433 523109794 521913707 520649195 519893229 519629359
705.7E19629359j76430l42726j60992P31706J874388K606987K982021L519475M417062
724.1E35080850N233586N214095M297137L265202K773106K733768K454876J565040
740.4E62617660N88417L02612O93083R03726K64883p66993j274883j092077j002252
758.7E61234176j725018k858043l380477k861261j847029j105964o51837K28823J837134
777.1E48870504L508747M268229L954410L510296L776193M489064M695714L921568
793.4E80994725K684236J863956J606345J166404M2379j039029q32557Q42750K833009
811.8E90162218L919482M205584M699588N656243N948901M475176J552284j380026
828.1F19239450l171206l997087m612804m944086l931105j057446K551794M974782
$$ plain form
705.7 519629359 519452929 519110203 518949211 519680917 521555305 524162292 527144313 530663788 535080850
724.1 535080850 540314436 545528531 549825668 553090870 555863976 558597744 561052620 562617660
740.4 562617660 563206077 563508689 564201772 565105498 565370381 564603388 563328505 562236428 561234176
758.7 561234176 559509158 556651115 553270638 550409377 548562348 547456384 546804547 547033370 548870504
777.1 548870504 552379251 556647480 560601890 564112186 567888379 572377443 577073157 580994725
793.4 580994725 583678961 585542917 587149262 588315666 588358045 587319016 586486459 587329209 590162218
811.8 590162218 594081700 598287284 602986872 608643115 614592016 619067192 620619476 619239450
828.1 619239450 616068244 612071157 607458353 602514267 598583162 597525716 600077510 605052292
844.4F05052292N298972M285992L295898K769232J859069K4855j842797k546430k148211
862.8F16048872j963675k963066m459321n017162m392981l675640l790497m404426
879.1E85382104m300177k907574j187802n25593j086355j797378j766741j316130j446903
897.4E69047451k310812k871097k311170j022756p5757m18k26497M4524N96762L58224
917.8E61228454j229823l396034m815459n134702n253911o016612p156670p802606
934.1E20422637p678747p416844p718057q412331q610815p890761o886988o506533
950.5D59301561o932676p541567p648080p262528o940246o940186o858826o183475
966.8D02993977n063623m223943m096418m384310m453986m061312l584355l475875
$$ plain form
844.4 605052292 610351264 614637256 617933154 620702386 622561455 622586310 620743513 618197083 616048872
862.8 616048872 614085197 611122131 606662810 601645648 597252667 593577027 589786530 585382104
879.1 585382104 581081927 578174353 576986551 576460958 575374603 573577225 571810484 570494354 569047451
897.4 569047451 566736639 563865542 561554372 560531616 560455859 560455441 560228944 560273468 560870230 561228454
917.8 561228454 559998631 556602597 551787138 546652436 541398525 535381913 528225243 520422637
934.1 520422637 512743890 505327046 497608989 489196658 480585843 472695082 465808094 459301561
950.5 459301561 452368885 444827318 437179238 429916710 422976464 416036278 409177452 402993977
966.8 402993977 397930354 393706411 389609993 385225683 380771697 376710385 373126030 369650155
983.1C69650155l685951l764182l457278l018648k883076l115118l344029l222585
999.4C43159288k857447k662360k816618l035813k902121k366423j795739j546264
1015.7C23176503j534164j380175r76443o50585o73741r09716r97305p59304m53114
1034.1C14841956m30763o98745r61602r89437q16345o97673q02964r66787r18746o38157
1054.5C06920737l58313k81811l69370l35962n9694K48790L70473L36081L81261P11709
1074.9C07563901J286596J788735K037377K206832K539783L000141L368854L499061
1091.2C27291280L483772L623009L987879M250168M092843L598302L100992K784282
1107.5C56212527K497464K026260J414150R58145R09358J164585J371384J348167J250208
$$ plain form
983.1 369650155 365964204 362200022 358742744 355724096 352841020 349725902 346381873 343159288
999.4 343159288 340301841 337639481 334822863 331787050 328884929 326518506 324722767 323176503
1015.7 323176503 321642339 320262164 319285721 318635136 317961395 317051679 316054374 315295070 314841956
1034.1 314841956 314411193 313712448 312750846 311761409 310945064 310247391 309444427 308477640 307558894 306920737
1054.5 306920737 306562424 306280613 305911243 305575281 305515587 305764377 306134850 306470931 306852192 307563901
1074.9 307563901 308850497 310639232 312676609 314883441 317423224 320423365 323792219 327291280
1091.2 327291280 330775052 334398061 338385940 342636108 346728951 350327253 353428245 356212527
1107.5 356212527 358709991 360736251 362150401 363108546 364017904 365182489 366553873 367902040 369152248
1125.9C69152248J271009J355052J144857M53352l60220q07375p76231m96447j74314
1144.2C70761931J88351P70777J615584K454042L008277L303676L612221M101723M647076
1162.6C94463658N014241N149514N265593N639315O243288O764680P039428P278770
1178.9D42858487P767588Q439809Q908689Q885265Q451104P902980P369846O652057
1195.2E07235825N547822M202246L069699K380252J888215J330317P18653K78890J67370
1213.6E26819289K07424J26719j15573l11673k75314j27852j32322l58701o30617p25269
1234E24476111o16968n13434n69880o47128n26786k27689l100r358j06752n4776K23875
1256.4E21424115N76436Q21829R83417J225531J576603J834869J781225J441717J079917
$$ plain form
1125.9 369152248 370423257 371778309 372923166 373376518 373016298 372208923 371432692 370936245 370761931
1144.2 370761931 370950282 371721059 373336643 375790685 378798962 382102638 385714859 389816582 394463658
1162.6 394463658 399477899 404627413 409893006 415532321 421775609 428540289 435579717 442858487
1178.9 442858487 450626075 459065884 467974573 476859838 485310942 493213922 500583768 507235825
1195.2 507235825 512783647 516985893 520055592 522435844 524324059 525654376 526373029 526651919 526819289
1213.6 526819289 527026713 527153432 527037859 526726186 526450872 526323020 526190698 525831997 525201380 524476111
1234 524476111 523859143 523345709 522775829 522128701 521601915 521374226 521371126 521361768 521255016 521200240 521424115
1256.4 521424115 522000551 522822380 523805797 525031328 526607931 528442800 530224025 531665742 532745659
1274.8E32745659Q82030P33673M15981m7385m45188o64412p61331q72969j064539j178563
1295.2E29742956j014113o20485k73466j99198l09229l45886k47896j78337k44558
1313.5E26309788l24547k59101o5208R1314K4796k55346n28217o63578p48575q99911
1333.9E22681415j107156j278401j281023j003623o44743m48465l47257k03371q6963
1352.3E16280413j88053n37217q88526j102030j352966j571059j636804j715302j546979
1370.6E05741477j083255p31468m84169k51054j21653J88350Q68678J271248P58350
1389E06156504Q1718k46107o57142j191318j798570k156317k101392k134949k203196
1407.3D93749231k241880k311587k060264j424521j046688j259595j126498n20915
$$ plain form
1274.8 532745659 533627689 534361362 534777343 534729958 534284770 533620358 532859027 531986058 530921519 529742956
1295.2 529742956 528728843 528108358 527834892 527635694 527326465 526980579 526732683 526554346 526309788
1313.5 526309788 525985241 525726140 525660932 525752246 525777042 525521696 524993479 524329901 523581326 522681415
1333.9 522681415 521574259 520295858 519014835 518011212 517366469 516918004 516570747 516367376 516280413
1352.3 516280413 516092360 515555143 514666617 513564587 512211621 510640562 509003758 507288456 505741477
1370.6 505741477 504658222 503926754 503442585 503191531 503069878 503258228 504126906 505398154 506156504
1389 506156504 506238222 505992115 505334973 504143655 502345085 500188768 498087376 495952427 493749231
1407.3 493749231 491507351 489195764 487135500 485710979 484664291 483404696 482278198 481757283
1423.7D81757283N3495O68526J085579J258463J597524K173751K371788K083809K009391
1442D95059609J971990J967192J915544J697660J603365J845300K375245K557516K443791
1460.4E13437212K944290L777564M213035M514336N449295O642819O410062N734444
1476.7E53123057N890310O366074O552160O294429O310582O546795O224335N297005
1493F02604747N053103N164206M564345M077136M145324M631699M277765K553046K344310
1511.4F39415681K919615L095030K894879K621949K511322K036154J549185J160025
1527.7F58203840J025558J366019J312554R56595J008451M69863r89735j382291j427174
1546F60543680j561165j812815j819611j478910j137793k585233n537331m403174l426254
$$ plain form
1423.7 481757283 481810778 482479304 483564883 484823346 486420870 488594621 490966409 493050218 495059609
1442 495059609 497031599 498998791 500914335 502611995 504215360 506060660 508435905 510993421 513437212
1460.4 513437212 516381502 520159066 524372101 528886437 534335732 540978551 547388613 553123057
1476.7 553123057 559013367 565379441 571931601 578226030 584536612 591083407 597307742 602604747
1493 602604747 607657850 612822056 617386401 621463537 625608861 630240560 634518325 637071371 639415681
1511.4 639415681 642335296 645430326 648325205 650947154 653458476 655494630 657043815 658203840
1527.7 658203840 659229398 660595417 661907971 662864566 663873017 664342880 663353145 661970854 660543680
1546 660543680 658982515 657169700 655350089 653871179 652733386 650148153 644610822 640207648 636781394
1564.4F36781394l760218m854918o570220o401062o524980r207248r962798r347915
1580.7E80152035r943009j0251283j0116101r961545r729922r170353q339584p289887
1597E05350351o276041n513459m727662l636420k541810j831204j329452o97433o9142
1615.4D78727728L43859Q07435J225292J346737J305014J460612J679212J967549K506137
1633.7D91369575K968997K708554K569855K900838L226161L724993L883361L528417
1650.1E16880751M246175M682124L253877L362953M354656M935801M671395M285514
1666.4E50673246M877568N447387M981280M927575M985094M787445N170584N925954
1682.7E91776133O148636M660845M059016M589618M735648M924119M606604L747642
$$ plain form
1564.4 636781394 633021176 628166258 621596038 615194976 608669996 599462748 589499950 580152035
1580.7 580152035 570209026 559957743 549841642 539880097 530150175 520979822 512640238 505350351
1597 505350351 499074310 493560851 488833189 485196769 482654959 480823755 479494303 478796870 478727728
1615.4 478727728 479071587 479879022 481104314 482451051 483756065 485216677 486895889 488863438 491369575
1633.7 491369575 494338572 497047126 499616981 502517819 505743980 509468973 513352334 516880751
1650.1 516880751 521126926 525809050 529062927 532425880 536780536 541716337 546387732 550673246
1666.4 550673246 555550814 560998201 565979481 570907056 575892150 580679595 585850179 591776133
1682.7 591776133 597924769 602585614 606644630 611234248 615969896 620894015 625500619 629248261
1699F29248261L388525K926051K491713J886546J361311J547277J948476J892566J004041
1717.4F47694767K29060P37608J535952J996875K162277K382279K759993L189265K973140
1735.7F65661216K539933K592682K757430L163875L674089L792525L434896L093660
1752F90710306L249288L647089L534853K936185K566754K529324K808511K916455K469838
1770.4G17368603J758396J440287J769960K054393J798868J346291J307427J666606
1786.7G30510831K026796J924992J250803Q73506J290799J674950J416802Q60036P65204
1805.1G42594719J189053J544237J354516Q41915O58632Q76605J199663J318931J094819
1823.4G52673090P62939Q01861J013756Q75294O37651M91202N00321Q58068J247943
$$ plain form
1699 629248261 632636786 635562837 638054550 639941096 641302407 642849684 644798160 646690726 647694767
1717.4 647694767 647923827 648661435 650197387 652194262 654356539 656738818 659498811 662688076 665661216
1735.7 665661216 668201149 670793831 673551261 676715136 680389225 684181750 687616646 690710306
1752 690710306 693959594 697606683 701141536 704077721 706644475 709173799 711982310 714898765 717368603
1770.4 717368603 719126999 720567286 722337246 724391639 726190507 727536798 728844225 730510831
1786.7 730510831 732537627 734462619 735713422 736586928 737877727 739552677 740969479 741829515 742594719
1805.1 742594719 743783772 745328009 746682525 747524440 748183072 749059677 750259340 751578271 752673090
1823.4 752673090 753436029 754237890 755251646 756126940 756764591 757255793 757756114 758614182 759862125
1841.8G59862125J016259L17097J47044N05090Q78692Q88646N87225L84926N37336
1860.2G65124440Q40008R84073Q57532M63605K25306N08010P82967O25729L38078L03209
1880.5G71052957N39600P50304O98745M06980J79172L64244O29783N70655L08811J73569
1900.9G75674820L07560N68449O41942L96908J16229J85549N33223O57797L96013J27256
1921.3G79605746O1512K01762L91960L50118J38104L8087J56105L74913M67598L04044
1941.7G82089949J9490k2530J69217K92898K09987L6895R358J67489L08037K46644
1962.1G83527434Q1062j7822L9578J91390K19167N7816p7307J490J90854K60353J29521
1984.6G84603536j9908l755J33693J80722O8962p2837j10268J0311J45197J20759m9710
$$ plain form
1841.8 759862125 760878384 761195481 761342525 761847615 762726307 763614953 764202178 764587104 765124440
1860.2 765124440 765964448 766948521 767806053 768269658 768494964 769002974 769785941 770411670 770749748 771052957
1880.5 771052957 771592557 772342861 773041606 773448586 773627758 773992002 774621785 775192440 775501251 775674820
1900.9 775674820 775982380 776550829 777192771 777589679 777705908 777891457 778424680 779082477 779478490 779605746
1921.3 779605746 779667258 779869020 780260980 780611098 780749202 780787289 780943394 781318307 781785905 782089949
1941.7 782089949 782109439 782086909 782256126 782549024 782759011 782795906 782805264 782972753 783280790 783527434
1962.1 783527434 783608496 783590674 783630252 783821642 784040809 784098625 784021318 784022808 784213662 784474015 784603536
1984.6 784603536 784583628 784579873 784713566 784894288 784963250 784890413 784780145 784790456 784935653 785056412 785006702
2007G85006702j78576j30355M3154J05440r7155l56317m16219l56734k32517J7643
2027.4G83405066R1254n1260n6803M4525J8716j46628k50578j41144L2008L0696r6559
2049.8G82879293j90079j43111K8610J24276M2975p9632q1122O8367K11835J49607
2070.2G83011019l0637q7916N1915K12968K02238M8638n0426M6551K10643K39134J02460
2092.7G83956587o0141p8022P9930K12729J37388l9518p6770N5909J66476J39057O259
2115.1G84499884q9288j6809J53602J93595N1558o4373j2934J35005K08556J35661
2135.5G85194457J2636K622J20938K25544K02716R3281O7115J94370L30627L13819
2155.9G86758125J87933J06037J86086L58283L91007K68936K13623L08931M36783M77016
$$ plain form
2007 785006702 784828126 784697771 784740925 784846365 784749210 784392893 783976674 783619940 783387423 783405066
2027.4 783405066 783496320 783445060 783388257 783432782 783451498 783304870 783054292 782913148 782945156 782975852 782879293
2049.8 782879293 782689214 782546103 782574713 782698989 782741964 782662332 782581210 782649577 782861412 783011019
2070.2 783011019 782980382 782892466 782944381 783157349 783359587 783408225 783357799 783404350 783614993 783854127 783956587
2092.7 783956587 783896446 783818424 783898354 784111083 784248471 784208953 784132183 784188092 784354568 784493625 784499884
2115.1 784499884 784410596 784393787 784547389 784740984 784792542 784728169 784715235 784850240 785058796 785194457
2135.5 785194457 785207093 785209715 785330653 785556197 785758913 785852194 785919309 786113679 786444306 786758125
2155.9 786758125 786946058 787052095 787238181 787596464 787987471 788256407 788470030 788778961 789215744 789692760
2176.3G89692760L63767K31385K65419M04179M91143M37975K95400K27988L25203M75645
2196.7G93210864M86314L38257K24709K92599M50790M87864L66807K58625K84791M15087
2217.1G96816707M94420M15087K78890K75910M17232N18203M63963L07858K21371L16143
2237.5H00525784M62890M61400L11851K05934K84553M27127M31180K84075J53006K13503
2257.9H03761303L94345M37140K72870J26005J66475L15726L99172L16859J57296J28806
2278.3H06475997K85089M10199L38435J46449L4988J20520K80023K80798J03831k1577
2298.7H08454752N3167K38538K83539R0301j14023j02997R3341K13623O9320j77264
2319.1H09102297k28346k8073J76310R4116j63496k23934o0141K8252r6619k64287
$$ plain form
2176.3 789692760 790056527 790287912 790553331 790957510 791448653 791886628 792182028 792410016 792735219 793210864
2196.7 793210864 793697178 794035435 794260144 794552743 795003533 795491397 795858204 796116829 796401620 796816707
2217.1 796816707 797311127 797726214 798005104 798281014 798698246 799216449 799680412 799988270 800209641 800525784
2237.5 800525784 800988674 801450074 801761925 801967859 802252412 802679539 803110719 803394794 803547800 803761303
2257.9 803761303 804155648 804592788 804865658 804991663 805158138 805473864 805873036 806189895 806347191 806475997
2278.3 806475997 806761086 807171285 807509720 807656169 807691157 807811677 808091700 808372498 808476329 808454752
2298.7 808454752 808507919 808746457 809029996 809120297 809006274 808903277 808996618 809210241 809279561 809102297
2319.1 809102297 808873951 808845878 809022188 809116304 808952808 808728874 808668733 808696985 808600366 808336079
2339.5H08336079k44617J9788L87311N12958K48671j38104l12448j81973p7128j94967
2359.9H08355570k64645p0154K33233L77833K29299j8775j6093K46942M06503K75434
2380.2H09755147M2676n4776K5213J39355O9440j89484l55601k53975n3466m7981k74182
2402.7H08802366m36961l10243o7651k9981k57611m86374m57883k31802j11044k86221
2423.1H06126595n46992n62012l14773j23918k44856n26547o29365m45545k23100k63810
2443.5H02245677n37038p16389n67138k82645k54571m90487o92844o54459m15266k78890
2463.9G97355950m39525o98626p13408m43101k56657m09365o82771p44701n33700l08275
2484.3G92125821l85165o57737p47800n50509l02314k93851n21064p05719o32882l83675
$$ plain form
2339.5 808336079 808091462 808111250 808498561 809011519 809260190 809122086 808809638 808627665 808550537 808355570
2359.9 808355570 808090925 808020771 808254004 808631837 808861136 808842361 808826268 809073210 809479713 809755147
2380.2 809755147 809797823 809743047 809768260 809907615 809977055 809787571 809431970 809177995 809124529 809076548 808802366
2402.7 808802366 808365405 808055162 807987511 807957530 807699919 807213545 806755662 806523860 806412816 806126595
2423.1 806126595 805579603 805017591 804702818 804578900 804334044 803807497 803178132 802732587 802509487 802245677
2443.5 802245677 801708639 800992250 800425112 800142467 799887896 799397409 798704565 798050106 797634840 797355950
2463.9 797355950 796916425 796217799 795504391 795061290 794804633 794395268 793712497 792967796 792434096 792125821
2484.3 792125821 791740656 791082919 790335119 789784610 789482296 789188445 788667381 787961662 787328780 786945105
2504.7G86945105k91765m97818p10964o37055l71575k44975m00305o44803o84559m63784
2525.1G81997502k56181l37899n95390o70314m65751k37942k63810n08189o74307n56112
2545.5G77431607k94804k40505m53413o42478n85198l32118j80065l56734o44684o74486
2565.8G73027122m51148k92837m00126o45518p41065n48661l12030l56674o25909q22305
2586.2G67830849p64788n40375m49479o30975q40902q26001o40154n26428o66023r20355
2606.6G61025369r83000q24213o98626q08239j025676j075209r37104p93457q25941
2625G53053904j044393j225591j191258j021803r66191j121878j279712j263201j132250
2643.4G42807627j052976j149595j321971j363158j239241j102387j105130j218200
$$ plain form
2504.7 786945105 786653340 786155522 785444558 784807503 784435928 784190953 783790648 783145845 782461286 781997502
2525.1 781997502 781741321 781403422 780808032 780137718 779671967 779434025 779170215 778662026 777987719 777431607
2545.5 777431607 777136803 776896298 776442885 775800407 775215209 774883091 774703026 774346292 773701608 773027122
2565.8 773027122 772575974 772283137 771883011 771237493 770496428 769947767 769635737 769279063 768653154 767830849
2586.2 767830849 767066061 766525686 766076207 765445232 764604330 763778329 763138175 762611747 761945724 761025369
2606.6 761025369 760042369 759218156 758519530 757711291 756685615 755610406 754673302 753879845 753053904
2625 753053904 752009511 750783920 749592662 748570859 747604668 746482790 745203078 743939877 742807627
2643.4 742807627 741754651 740605056 739283085 737919927 736680686 735578299 734473169 733254969
2659.7G33254969j272082j173735j040935j034320j151621j235366j151919r80199
2676G24214792r20474j004637j078724j044989r18210q08298q39114r61662r97364
2694.3G15641320q89659p71582p65562q44896q88229q34524p40946p15136p85351q62896
2714.7G07542539q51333p61807p12157p57217q47578q65698p48456o38067o54579p32958
2735.1F99972689p75099p38620o67692o55532p16805p71582p61986p07686o85751p77662
2755.5F92714274r16243r55999r04500q74341r16957j005829j080692j066565j008451
2773.9F83984697j043260j156450j231789j234055j222491j246989j317799j406312
2790.2F74125552j431346j408100j432896j522600j637638j716196j725078j737833
$$ plain form
2659.7 733254969 731982887 730809152 729768217 728733897 727582276 726346910 725194991 724214792
2676 724214792 723294318 722289681 721210957 720165968 719247758 718439460 717600346 716638684 715641320
2694.3 715641320 714751661 713980079 713214517 712369621 711481392 710646868 709905922 709190786 708405435 707542539
2714.7 707542539 706691206 705929399 705217242 704460025 703612447 702746749 701998293 701360226 700705647 699972689
2735.1 699972689 699197590 698458970 697791278 697135746 696418941 695647359 694885373 694177687 693491936 692714274
2755.5 692714274 691798031 690842032 689937532 689063191 688146234 687140405 686059713 684993148 683984697
2773.9 683984697 682941437 681784987 680553198 679319143 678096652 676849663 675531864 674125552
2790.2 674125552 672694206 671286106 669853210 668330610 666692972 664976776 663251698 661513865
2806.5F61513865j842082j987934k067148k076328k077103k136409k298534k478600
2822.8F44549727k556681k574265k636671k766609k885879k886533k789617k698481
2839.1F22754991k662122k662420k675176k702654k759695k857983k969145l057480
2855.5F00408316l115774l188908l325224l471911l555119l528714l382861l200114
2871.8E73639691l050208k893210k669573k387285k126813j958012j835943j708686
2888.1E55009961j549363j366496j255274j231670j227618j184403j111329j117826
2904.4E44965982j220762j314462j330673j316309j367867j436949j406789j248598
2920.7E34323573r97245p32720n00798l02017o0856L08096P58410J208484J656413
$$ plain form
2806.5 661513865 659671783 657683849 655616701 653540373 651463270 649326861 647028327 644549727
2822.8 644549727 641993046 639418781 636782110 634015501 631129622 628243089 625453472 622754991
2839.1 622754991 620092869 617430449 614755273 612052619 609292924 606434941 603465796 600408316
2855.5 600408316 597292542 594103634 590778410 587306499 583751380 580222666 576839805 573639691
2871.8 573639691 570589483 567696273 565026700 562639415 560512602 558554590 556718647 555009961
2888.1 555009961 553460598 552094102 550838828 549607158 548379540 547195137 546083808 544965982
2904.4 544965982 543745220 542430758 541100085 539783776 538415909 536978960 535572171 534323573
2920.7 534323573 533326328 532593608 532092810 531790793 531729937 532038033 532796443 534004927 535661340
2939.1E35661340K154886K676368L112376L432393L693163L931463M123867M238307
2955.4E63024163M298508M340291M280806M081070L845394L610790L386140L220618
2971.7E94087780L081858K955496K897382K805769K559901K329647K254307K178490
2988F15150630K008796J760960J439810J146853R08374O61135M27485K17139J6749
3006.4F23737931j32501k74777n23866q28742j058341j194119j268685j331746j456798
3024.7F15668356j585245j593888j571476j642764j770258j864135j872182j867473
3041.1F01900935j946688k070307k117396k054691k025843k110660k185821k198577
3057.4E85190952k189219k163649k136767k127051k189815k294898k308607k224267
$$ plain form
2939.1 535661340 537816226 540492594 543604970 547037363 550730526 554661989 558785856 563024163
2955.4 563024163 567322671 571662962 575943768 580024838 583870232 587481022 590867162 594087780
2971.7 594087780 597169638 600125134 603022516 605828285 608388186 610717833 612972140 615150630
2988 615150630 617159426 618920386 620360196 621507049 622415423 623076558 623504043 623721182 623737931
3006.4 623737931 623605430 623330653 622806787 621978045 620919704 619725585 618456900 617125154 615668356
3024.7 615668356 614083111 612489223 610917747 609274983 607504725 605640590 603768408 601900935
3041.1 601900935 599954247 597883940 595766544 593711853 591686010 589575350 587389529 585190952
3057.4 585190952 583001733 580838084 578701317 576574266 574384451 572089553 569780946 567556679
3073.7E67556679k101123k062023k181768k265573k258837k324223k364159k305448
3090E49693525k289593k288282k229750k170384k183021k254366k243638k136648k125383
3108.4E29772460k219080k170444k001584j987397k131045k297104k396285k325475
3124.7E12244046k163589k077341k082825k101004k058029k007485k042413k119988
3141D95591372k121299k047867j985937j931697j896203j973301k084702k047807j955271
3159.4D77547288j943588j941324j895785j857191j875818j910090j884073j821846
3175.7D62417573j787812j773357j777709j788914j777500j755446j735121j728296
3192D48293418j719266j692802j687855j677662j618296j581847j573414j562059j554221
$$ plain form
3073.7 567556679 565455556 563393533 561211765 558946192 556687355 554363132 551998973 549693525
3090 549693525 547403932 545115650 542885900 540715516 538532495 536278129 534034491 531897843 529772460
3108.4 529772460 527553380 525382936 523381352 521393955 519262910 516965806 514569521 512244046
3124.7 512244046 510080457 508003116 505920291 503819287 501761258 499753773 497711360 495591372
3141 495591372 493470073 491422206 489436269 487504572 485608369 483635068 481550366 479502559 477547288
3159.4 477547288 475603700 473662376 471766591 469909400 468033582 466123492 464239419 462417573
3175.7 462417573 460629761 458856404 457078695 455289781 453512281 451756835 450021714 448293418
3192 448293418 446574152 444881350 443193495 441515833 439897537 438315690 436742276 435180217 433625996
3210.3D33625996j539886j534641j528471j490355j457423j466602j460046j415342
3226.7D21733230j355439j289368j277536j357317j405090j344293j261801j192301
3243D11250085j172066j218975j235515j151114j063049j057059j064568j045973j015514
3261.3D01226252r74506r38952q94964q42273q60959r31621r86844j008451r70095
3279.7C92817587r27180r08941q81851q58098q36641q38697q79705r21398r87321j032114
3300.1C83745641r29118p69466q10206j055509j230448j217514j129032j065194j055122
3318.4C74484032j077562j074076j069009j159907j266866j261324j193136j102358
3334.8C65279794j040727j133502j286536j327962j324206j281649j171410j211912
$$ plain form
3210.3 433625996 432086110 430551469 429022998 427532643 426075220 424608618 423148572 421733230
3226.7 421733230 420377791 419088423 417810887 416453570 415048480 413704187 412442386 411250085
3243 411250085 410078019 408859044 407623529 406472415 405409366 404352307 403287739 402241766 401226252
3261.3 401226252 400251746 399312794 398417830 397575557 396714598 395782977 394796133 393787682 392817587
3279.7 392817587 391890407 390981466 390099615 389241517 388404876 387566179 386686474 385765076 384777755 383745641
3300.1 383745641 382816523 382047057 381236851 380181342 378950894 377733380 376604348 375539154 374484032
3318.4 374484032 373406470 372332394 371263385 370103478 368836612 367575288 366382152 365279794
3334.8 365279794 364239067 363105565 361819029 360491067 359166861 357885212 356713802 355501890
3351.1C55501890j412183j468658j326531j209826j240074j272142j162857j095653
3367.4C45313966j249730j460374j440137j198978j036018j045406j087129j035869
3383.7C35760325r02116p27385n51463o13272q89003q72523n12719l69042o36458q75205
3404.1C28811139p64698n60701m71443m50521m78328m70876l83437l08961k83390k15709
3424.5C24423075q0735K6018L7580R1285J75148N3376j22011l8743J91361L39210L53098
3446.9C25448662L00229L39895M61608N58913O22124O60866O02961O01977Q37683R74209
3467.3C31409127P26640M02808M30584P04050R31352R23992P30514P30068R17464R16123
3487.7C38822722Q11339Q87483J042426J116931J072526J040012J069307J015008R73791
$$ plain form
3351.1 355501890 354089707 352621049 351294518 350084692 348844618 347572476 346409619 345313966
3367.4 345313966 344064236 342603862 341163725 339964747 338928729 337883323 336796194 335760325
3383.7 335760325 334858209 334130824 333579361 332966089 332077086 331204563 330691844 330322802 329686344 328811139
3404.1 328811139 328046441 327485740 327014297 326563776 326085448 325614572 325231135 324922174 324638784 324423075
3424.5 324423075 324342340 324368358 324405938 324497223 324672371 324725747 324603736 324564993 324756354 325095564 325448662
3446.9 325448662 325748891 326088786 326550394 327109307 327731431 328392297 328995258 329597235 330434918 331409127
3467.3 331409127 332135767 332538575 332969159 333673209 334604561 335528553 336259067 336989135 337906599 338822722
3487.7 338822722 339634061 340521544 341563970 342680901 343753427 344793439 345862746 346877754 347851545
3506.1C47851545J087367J240164J346648J325458J217962J256227J455963J641482
3522.4C58422816J563281J356095J359015J518101J677573J821875J836121J761079
3538.7C71315956J904428K125740K072245J813263J805424K005339K082497K102315
3555C87227207K223581K412409K503902K477556K489507K668471K778649K718627K739400
3573.4D10239309K890229L056586L238589L406673L468484L390908L288299L403157
3589.7D36382234L547847L643573L770232L903896L926843L885329L931194L992141
3606D66983289M096567M167169M189730M267365M252046M226327M281789M171282M130841
3624.4E04766405M216015M320264M389882M231393M186571M216492M223108M258335
$$ plain form
3506.1 347851545 348938912 350179076 351525724 352851182 354069144 355325371 356781334 358422816
3522.4 358422816 359986097 361342192 362701207 364219308 365896881 367718756 369554877 371315956
3538.7 371315956 373220384 375346124 377418369 379231632 381037056 383042395 385124892 387227207
3555 387227207 389450788 391863197 394367099 396844655 399334162 402002633 404781282 407499909 410239309
3573.4 410239309 413129538 416186124 419424713 422831386 426299870 429690778 432979077 436382234
3589.7 436382234 439930081 443573654 447343886 451247782 455174625 459059954 462991148 466983289
3606 466983289 471079856 475247025 479436755 483704120 487956166 492182493 496464282 500635564 504766405
3624.4 504766405 508982420 513302684 517692566 521923959 526110530 530327022 534550130 538808465
3640.7E38808465M303396M405617M508615M447162M094780L765702L754616L974020
3657E72062373L960788L693402L547311L670871L752590L570318L454327L294587K904237
3675.4F03910804K671182K624571K630592K796828K976895K907097K345443J839161
3691.7F24702573J864075K011478K083600K050698J875043J788199J940548K061963
3708F40378177J792014J252830J251697J511276J585364J533866J381636J216948J159191
3726.4F53062999J388490J663208J689852J307487Q20279R34482J322567J138330P12573
3744.7F64040267J095832J179457N13553M18544R11415J029312P83682P20859Q96036
3763.1F71588957R46224Q86977O97911N32388O68943R24885J024008P97808N92053
$$ plain form
3640.7 538808465 543111861 547517478 552026093 556473255 560568035 564333737 568088353 572062373
3657 572062373 576023161 579716563 583263874 586934745 590687335 594257653 597711980 601006567 603910804
3675.4 603910804 606581986 609206557 611837149 614633977 617610872 620517969 622863412 624702573
3691.7 624702573 626566648 628578126 630661726 632712424 634587467 636375666 638316214 640378177
3708 640378177 642170191 643423021 644674718 646185994 647771358 649305224 650686860 651903808 653062999
3726.4 653062999 654451489 656114697 657804549 659112036 659932315 660866797 662189364 663327694 664040267
3744.7 664040267 665136099 666315556 666829109 667247653 668159068 669188380 669972062 670692921 671588957
3763.1 671588957 672535181 673422158 674120069 674652457 675321400 676246285 677270293 678068101 678660154
3781.4F78660154O33955O81281O80566O82414P67290Q84951R06348R50634P64430L59774
3801.8F85971797M98592N23031K74837N45442R14753Q17895N78224P72238N43594N3764
3822.2F91494167L12626N52714N98371O44565P07328Q58486O16371J43171J65522K74241
3842.6F96367562L11494N96106J022458J037478l338o67035K52664P52926P19666M91679
3863G00881660L18766M45604L54528K02060K43306K36333L79979M26054M29988M42445
3883.4G04360723Q7202O9380L51310K07305J90317N14150N99682L70562J03712j08420
3903.8G06745923j22130R3758K48372L54767M43638L22759P5876M1604J64330J52648
3924.2G08521545J05143J86502K20955J32799R5844J38223J59324J20580P1347J67250
$$ plain form
3781.4 678660154 679294109 679975390 680655956 681338370 682105660 682990611 683896959 684847593 685612023 685971797
3801.8 685971797 686470389 686993420 687268257 687813699 688728452 689546347 690124571 690896809 691440403 691494167
3822.2 691494167 691806793 692359507 692957878 693602443 694309771 695168257 695784628 695927799 696093321 696367562
3842.6 696367562 696679056 697275162 698297620 699335098 699331760 698664725 698917389 699670315 700389981 700881660
3863 700881660 701200426 701646030 702000558 702202618 702445924 702682257 703062236 703488290 703918278 704360723
3883.4 704360723 704447925 704517305 704868615 705075920 705266237 705780387 706380069 706750631 706854343 706745923
3903.8 706745923 706623793 706717551 706965923 707320690 707764328 708087087 708162963 708204567 708368897 708521545
3924.2 708521545 708626688 708813190 709034145 709166944 709262788 709401011 709560335 709680915 709752262 709919512
3944.6G09919512K65599J32262j2397L1948J38402K00748K00987J27017K7359L1412
3965G11062849J48177J91092J13011N9366Q2910J23262J24991J40131J18673K3305
3985.4G12187767K7239J05977J32502J13844Q1242J17838
3997.6G12766409
$$ plain form
3944.6 709919512 710185111 710317373 710304976 710336924 710475326 710676074 710877061 711004078 711031437 711062849
3965 711062849 711211026 711402118 711515129 711574495 711657405 711780667 711905658 712045789 712164462 712187767
3985.4 712187767 712215006 712320983 712453485 712567329 712648571 712766409
3997.6 712766409
##END=$$ End of the data block
