##TITLE=Fibregum Bio L $$ Begin of the data block
##JCAMP-DX=5.00 $$ ACD/SpecManager v 10.08
##SPECTROMETER/DATA SYSTEM=Alpha
##DATE=19 Feb 2015 09:45:16
##DATA TYPE=INFRARED SPECTRUM
##DATA CLASS=XYDATA
##ORIGIN=
##OWNER=
##NPOINTS=1765
##FIRSTX=399.76428223
##LASTX=3997.64306641
##MAXX=3997.64306641
##MINX=399.76428223
##MAXY=0.81836730
##MINY=0.47966835
##XFACTOR=1.0000000000
##YFACTOR=1.000000000000000e-9
##FIRSTY=0.61303067
##DELTAX=2.03961372
##XUNITS=1/CM
##YUNITS=ARBITRARY UNITS
##XYDATA=(X++(Y..Y))
$$ plain form
399.8 613030672 612691879 612386882 611800611 611364543 611669242 612060785 611770034 611271679 611028254 610539317
420.2 610539317 609787583 609290242 609247148 609466255 609248817 608268559 607481778 607698441 608154833 607853770
440.6 607853770 607115388 607024968 607547820 607611954 607200027 607372642 608303249 608859658 608349442 607887506
461 607887506 608481944 609437048 609445691 608579397 608269036 609033406 609665930 609356165 609053373 609725475
481.3 609725475 610634029 610529006 609567821 609164178 609816074 610152483 609222531 608199060 608377993 609027565
501.7 609027565 608524144 607088029 606356680 606635869 606574059 605409086 604195714 604154706 604611874 604072332
522.1 604072332 602618694 601769507 602104902 602280319 601270854 600137055 600319326 601149440 600983322
540.5 600983322 599918723 599539757 600384653 601134062 600733638 600147545 600818932 602316916 602990150
$$ packed form
399.8F13030672l38793l04997n86271m36068L04699L91543k90751m98355k43425m88937
420.2F10539317p51734m97341m3094K19107k17438r80258p86781K16663M56392l01063
440.6F07853770p38382r0420N22852O4134m11927J72615R30607N56409n10216m61936
461F07887506N94438R55104Q643q66294l10361P64370O32524l09765l02792O72102
481.3F09725475R08554j05023r61185m03643O51896L36409r29952j023471J78933O49572
501.7F09027565n03421j436115p31349K79189o1810j164973j213372m1008M57168n39542
522.1F04072332j453638q49187L35395J75417j009465j133799J82271Q30114j66118
540.5F00983322j064599l78966Q44896P49409m00424n86093O71387J497984O73234
$$ plain form
558.9 602990150 602551281 602452636 603526711 604598284 604430139 603848755 604321659 605553865 606020808
577.2 606020808 605405867 605049014 605833054 606777608 606516659 605494499 605259955 605946064 606134832 605285585
597.6 605285585 604651093 605210662 606093943 606051803 605332375 605259657 606133461 606774986 606479108 606278777
618 606278777 607407212 609308660 610624969 611313760 612527132 614555359 616429925 617469907 618248820
636.4 618248820 619671702 621513247 622716725 623112798 623740613 625114322 626394093 626791298 626889110
654.7 626889110 627692759 629064918 630033731 630344808 630577981 631236374 632607877 633851290 634718359
673.1 634718359 635939658 637676239 639090061 639742672 640247047 641193867 642181039 642432034 642099917
691.4 642099917 641970217 642184377 642095685 641371787 640555918 640253544 640277922 640105903 639838457 640089869
$$ packed form
558.9F02990150m38869r8645J074075J071573j68145n81384M72904J232206M66943
577.2F06020808o14941l56853P84040R44554k60949j022160k34544O86109J88768q49247
597.6F05285585o34492N59569Q83281m2140p19428p2718Q73804O41525k95878k00331
618F06278777J128435J901448J316309O88791J213372K028227J874566J039982P78913
636.4F18248820J422882J841545J203478L96073O27815J373709J279771L97205R7812
654.7F26889110Q03649J372159R68813L11077K33173O58393J371503J243413Q67069
673.1F34718359J221299J736581J413822O52611N04375R46820R87172K50995l32117
691.4F42099917j29700K14160q8692p23898q15869l02374K4378j72019k67446K51412
$$ plain form
711.8 640089869 641060591 642305136 643603265 645420432 648174644 651501596 654679358 657480836 660172939
730.2 660172939 662764549 664837539 666199446 667190194 668174148 669017375 669443905 669619441 669934988
748.5 669934988 670329988 670341432 669826388 669114709 668387532 667407632 665986896 664357483 662936807
766.9 662936807 661830664 660938859 660476148 660947382 662494838 664618790 666809916 669131696 671843827
785.3 671843827 674723685 677303493 679557502 681849182 684226453 686140358 687102914 687409759 687770903
803.6 687770903 688334465 688746631 689137459 690360427 692908466 696181118 699366927 702464640 705755770
822 705755770 708659887 709963441 709243238 707289159 704953372 702337027 699498057 697385609 697192311
840.3 697192311 698970437 701551259 703932822 706142783 708341122 709894419 710033178 709008753 707813621
$$ packed form
711.8F40089869R70722J244545J298129J817167K754212L326952L177762K801478K692103
730.2F60172939K591610K072990J361907R90748R83954Q43227M26530J75536L15547
748.5F69934988L95000J1444n15044p11679p27177r79900j420736j629413j420676
766.9F62936807j106143q91805m62711M71234J547456K123952K191126K321780K712131
785.3F71843827K879858K579808K254009K291680K377271J913905R62556L06845L61144
803.6F87770903N63562M12166L90828J222968K548039L272652L185809L097713L291130
822G05755770K904117J303554p20203j954079k335787k616345k838970k112448j93298
840.3F97192311J778126K580822K381563K209961K198339J553297J38759j024425j195132
$$ plain form
858.7 707813621 706789076 705263376 702764630 699884892 697439611 695248783 692493856 689204216
875 689204216 686413705 684673071 683363974 681800842 680346608 679785728 679890692 679493189 678078473
893.4 678078473 676464856 675466895 674688816 673339546 671682119 670716345 670650542 670634985 670087278 669498146
913.7 669498146 669425070 669284940 667943299 665243745 662133873 659201264 655888617 651575446 646708429
932.1 646708429 642165244 637918532 633169115 627725482 622431397 617989063 614000738 609687448
948.4 609687448 605097532 600926161 597296894 593495011 589083970 584628165 580936670 577957392
964.7 577957392 574998081 571880758 569144666 567071080 565138161 562768281 560199261 558087111
981.1 558087111 556481302 554782510 552656949 550501287 548795342 547337592 545541346 543349922
$$ packed form
858.7G07813621j024545j525700k498746k879738k445281k190828k754927l289640
875F89204216k790511j740634j309097j563132j454234n60880J04964l97503j414716
893.4F78078473j613617r97961p78079j349270j657427r65774o5803j5557n47707n89132
913.7F69498146p3076j40130j341641k699554l109872k932609l312647m313171m867017
932.1F46708429m543185m246712m749417n443633n294085m442334l988325m313290
948.4F09687448m589916m171371l629267l801883m411041m455805l691495k979278
964.7E77957392k959311l117323k736092k073586j932919k369880k569020k112150
981.1E58087111j605809j698792k125561k155662j705945j457750j796246k191424
$$ plain form
997.4 543349922 541344106 539804995 538280129 536334932 534238756 532586336 531456470 530386090
1013.7 530386090 529155076 528113544 527562678 527240038 526672602 525861979 525267601 525085151 524935663
1032 524935663 524439096 523807049 523499608 523500264 523344278 522855878 522398710 522274256 522283256 522072613 521693587
1054.5 521693587 521506011 521598935 521650493 521448016 521199286 521209717 521411419 521479189 521401286 521578789
1074.9 521578789 522296309 523385465 524562597 525856614 527531564 529607832 531782448 533858240
1091.2 533858240 535978198 538396060 541072190 543707192 546114683 548367798 550578833 552595258
1107.5 552595258 554095268 555076063 555893421 556726158 557420015 557905674 558402300 559144914 560091734
1125.9 560091734 560983479 561713278 562348068 562854826 563100159 562981486 562572658 562171936 562051117 562238097
$$ packed form
997.4E43349922k005816j539111j524866j945197k096176j652420j129866j070380
1013.7E30386090j231014j041532n50866l22640n67436q10623n94378j82450j49488
1032E24935663m96567o32047l07441O56j55986m88400m57168j24454R000k10643l79026
1054.5E21693587j87576R2924N1558k02477k48730J0431K01702O7770p7903J77503
1074.9E21578789P17520J089156J177132J294017J674950K076268K174616K075792
1091.2E33858240K119958K417862K676130K635002K407491K253115K211035K016425
1107.5E52595258J500010R80795Q17358Q32737O93857M85659M96626P42614R46820
1125.9E60091734Q91745P29799O34790N06758K45333j18673m08828m00722j20819J86980
$$ plain form
1146.3 562238097 562661350 563349485 564397991 565825760 567508578 569294274 571212053 573410213 575886667
1164.6 575886667 578504920 581231892 584211946 587545693 591145992 594890416 598811448 603100657
1180.9 603100657 607863009 612917066 617966235 622875273 627643943 632201672 636292279 639649391
1197.3 639649391 642305136 644531310 646415651 647797585 648636758 649180830 649712920 650189459 650341690
1215.6 650341690 650145590 649904132 649809539 649673462 649253190 648660779 648186743 647848070 647377133 646639824
1236 646639824 645854354 645296454 644906580 644390106 643709660 643164039 642929614 642804325 642522395 642195940
1256.4 642195940 642195523 642628610 643173456 643598199 644151747 645108342 646267295 647201121 647820294 648427308
1276.8 648427308 649177253 649769783 649890244 649691880 649562418 649557710 649352789 648814976 648293078 648166478
$$ packed form
1146.3E62238097M23253O88135J048506J427769J682818J785696J917779K198160K476454
1164.6E75886667K618253K726972K980054L333747L600299L744424L921032M289209
1180.9F03100657M762352N054057N049169M909038M768670M557729M090607L357112
1197.3F39649391K655745K226174J884341J381934Q39173N44072N32090M76539J52231
1215.6F50341690j96100k41458r4593j36077m20272n92411m74036l38673m70937p37309
1236F46639824p85470n57900l89874n16474o80446n45621k34425j25289k81930l26455
1256.4F42195940m17M33087N44846M24743N53548R56595J158953R33826O19173O07014
1276.8F48427308P49945N92530J20461j98364j29462m708k04921n37813n21898j26600
$$ plain form
1297.2 648166478 648343444 648448646 648413002 648559570 649054587 649576426 649778306 649854779 650252819 650948167
1317.6 650948167 651480436 651660264 651773155 652048051 652272522 652062297 651434183 650825620 650456071 650003135
1338 650003135 649200141 648425102 648124218 648181379 648136914 647807121 647486925 647383988 647222459 646599531
1358.4 646599531 645474613 644194424 643125832 642066121 640670955 639255047 638234496 637568116
1374.7 637568116 637023032 636443079 635946214 635941207 636732936 637977421 638998508 639715493 640206933 640215695
1395.1 640215695 639626205 638689220 637874544 637152135 636026382 634551108 633181214 632108569 631196380
1413.5 631196380 630189180 628918827 627711475 627158582 626883805 626503289 626280546 626527250 627276599
1431.8 627276599 628124654 628780544 629643023 630990148 632431149 633537471 634298027 635081708 636107147
$$ packed form
1297.2F48166478J76966J05202l5644J46568M95017N21839K01880P6473L98040O95348
1317.6F50948167N32269J79828J12891K74896K24471k10225o28114o08563l69549m52936
1338F50003135q02994p75039l00884N7161m4465l29793l20196j02937j61529o22928
1358.4F46599531j124918j280189j068592j059711j395166j415908j020551o66380
1374.7F37568116n45084n79953m96865n007P91729J244485J021087P16985M91440Q762
1395.1F40215695n89490r36985q14676p22409j125753j475274j369894j072645r12189
1413.5F31196380j007200j270353j207352n52893k74777l80516k22743K46704P49349
1431.8F27276599Q48055O55890Q62479J347125J441001J106322P60556P83681J025439
$$ plain form
1450.2 636107147 637118280 637866497 638432860 639431000 641029000 642714202 644476295 646685243 649407029
1468.5 649407029 652410507 655670524 659048736 662598610 666340947 670007944 673467338 676840425
1484.9 676840425 680438280 684236586 687784374 690768480 693641663 696824670 699858367 702372193
1501.2 702372193 704568803 706857979 709500790 711728573 713412464 715071082 716950536 718970776
1517.5 718970776 720639586 721903443 723231673 724740982 726167202 727285504 728203118 729226828
1533.8 729226828 730447710 731452584 731909513 732098579 732513785 732940376 733055055 732847393 732666850
1552.2 732666850 732659698 732497036 731184006 728873909 727396369 725887954 723646462 720351517 716105700
1570.5 716105700 712151289 707594454 700842321 694044113 688089252 681826174 675222099 668524683
$$ packed form
1450.2F36107147J011133P48217N66363R98140J598000J685202J762093K208948K721786
1468.5F49407029L003478L260017L378212L549874L742337L666997L459394L373087
1484.9F76840425L597855L798306L547788K984106K873183L183007L033697K513826
1501.2G02372193K196610K289176K642811K227783J683891J658618J879454K020240
1517.5G18970776J668810J263857J328230J509309J426220J118302R17614J023710
1533.8G29226828J220882J004874M56929J89066M15206M26591J14679k07662j80543
1552.2G32666850p152j62662j313030k310097j477540j508415k241492l294945m245817
1570.5G16105700l954411m556835o752133o798208n954861o263078o604075o697416
$$ plain form
1586.8 668524683 662011266 655916452 650253594 644857943 639859021 635514379 631816387 628615260
1603.2 628615260 625806212 623357058 621302843 619714320 618455470 617100120 615800023 615410030
1619.5 615410030 615464568 615360260 615283489 615411401 615785301 616524994 617584884 618986368 620716691
1637.8 620716691 622552216 624498427 626547694 628905237 631711125 634287238 636780262 639908969
1654.1 639908969 642888010 645597041 648385823 651333213 654410720 657366812 660335779 663475335
1670.5 663475335 666483521 669590771 672950029 676121593 679095805 682149708 685690820 689070344
1686.8 689070344 691937804 694800258 697558999 700237036 702790022 704854488 706748188 708451569
1703.1 708451569 709582746 710154176 710387409 710477889 710422456 709952414 708875716 707973003 707770467 707817256
$$ packed form
1586.8F68524683o513417o094814n662858n395651m998922m344642l697992l201127
1603.2F28615260k809048k449154k054215j588523j258850j355350j300097l89993
1619.5F15410030N4538j04308p6771J27912L73900P39693J059890J401484J730323
1637.8F20716691J835525J946211K049267K357543K805888K576113K493024L128707
1654.1F39908969K979041K709031K788782K947390L077507K956092K968967L139556
1670.5F63475335L008186L107250L359258L171564K974212L053903L541112L379524
1686.8F89070344K867460K862454K758741K678037K552986K064466J893700J703381
1703.1G08451569J131177N71430K33233R0480n5433m70042j076698r02713k02536M6789
$$ plain form
1723.5 707817256 708020806 708590388 709717512 711273611 713083208 715115428 717120528 719308376 721732914
1741.9 721732914 724119544 726484716 729036450 731986821 735205173 738193929 741024554 743954360
1758.2 743954360 746783912 749388814 751636565 753637671 755664349 757558525 759090781 760464728
1774.5 760464728 761909783 763412595 764794111 765883446 766852736 768017411 769284368 770280421 771029711
1792.8 771029711 771915138 773010492 774028242 774744332 775363863 776191354 777192831 778052270 778627396
1811.2 778627396 779189289 779980958 780842960 781515658 782005131 782526255 783249021 783984840 784434378 784803808
1831.6 784803808 785424769 786146879 786701620 787069798 787439466 787954509 788566828 789023519 789326131 789761841
1852 789761841 790387928 790940642 791246116 791514218 792008400 792638898 793073535 793230057 793496668 794073820
$$ packed form
1723.5G07817256K03550N69582J127124J556099J809597K032220K005100K187848K424538
1741.9G21732914K386630K365172K551734K950371L218352K988756K830625K929806
1758.2G43954360K829552K604902K247751K001106K026678J894176J532256J373947
1774.5G60464728J445055J502812J381516J089335R69290J164675J266957R96053P49290
1792.8G71029711Q85427J095354J017750P16090O19531Q27491J001477Q59439N75126
1811.2G78627396N61893P91669Q62002O72698M89473N21124P22766P35819M49538L69430
1831.6G84803808O20961P22110N54741L68178L69668N15043O12319M56691L02612M35710
1852G89761841O26087N52714L05474K68102M94182O30498M34637J56522K66611N77152
$$ plain form
1872.4 794073820 794653952 794958293 795110404 795423746 795939922 796371162 796549618 796663880 796986878 797432363
1892.8 797432363 797702491 797808349 798003674 798394442 798779011 798957169 799033940 799248815 799623549 799928725
1913.2 799928725 800031304 800071061 800291300 800610483 800776899 800833702 800980389 801256239 801498353 801549375
1933.6 801549375 801521182 801647127 801882267 801991701 801957846 801977396 802137673 802336872 802409470 802364171
1954 802364171 802392244 802555323 802689731 802678466 802637935 802707970 802859426 802951813 802927494 802893877 802959800
1976.4 802959800 803073764 803104103 803049326 803046525 803159058 803262830 803246260 803185880 803196847 803242743 803258777
1998.8 803258777 803244293 803217471 803220332 803227782 803175330 803073585 802989841 802951694 802889824 802698851 802363276
2021.3 802363276 801932752 801601112 801665723 801948130 802059710 802025497 801971972 801912189 801837027 801745236 801688135
$$ packed form
1872.4G94073820N80132L04341J52111L13342N16176M31240J78456J14262L22998M45485
1892.8G97432363K70128J05858J95325L90768L84569J78158P6771K14875L74734L05176
1913.2G99928725J02579L9757K20239L19183J66416N6803J46687K75850K42114N1022
1933.6H01549375k8193J25945K35140J09434l3855J9550J60277J99199P2598m5299
1954H02364171K8073J63079J34408j1265m0531P0035J51456R2387k4319l3617O5923
1976.4H02959800J13964L0339n4777k801J12533J03772j6570o0380J0967M5896J6034
1998.8H03258777j4484k6822K861P450n2452j01745q3744l8147o1870j90973l35575
2021.3H02363276m30524l31640O4611K82407J11580l4213n3525n9783p5162r1791n7101
$$ plain form
2043.7 801688135 801686466 801655114 801554859 801458180 801437020 801472485 801490188 801465809 801441729 801450372 801468134 801461220
2068.2 801461220 801434457 801438749 801509857 801606596 801649213 801652431 801716030 801844120 801932931 801925004 801904321 801962554
2092.7 801962554 802074075 802143097 802127600 802116334 802187681 802277148 802274585 802199006 802181304 802264869 802352726
2115.1 802352726 802359760 802328169 802365124 802475750 802534819 802494884 802484274 802588284 802708924 802731693 802704871
2137.5 802704871 802771807 802953124 803102493 803133786 803163826 803295672 803476930 803615510 803696156 803813338
2157.9 803813338 804031014 804278314 804430544 804476619 804568172 804832935 805172205 805398941 805562079 805832684
2178.3 805832684 806190848 806460142 806593835 806755960 807037711 807324290 807509065 807658732 807901561 808230817
2198.7 808230817 808498502 808643103 808779776 809021115 809332788 809587181 809750140 809945643 810263097 810597420
$$ packed form
2043.7H01688135j669l1352j00255r6679k1160L5465J7703k4379k4080Q643J7762o914
2068.2H01461220k6763M292P1108R6739M2617L218O3599J28090Q8811p927k0683N8233
2092.7H01962554J11521O9022j5497j1266P1347Q9467k563p5579j7702Q3565Q7857
2115.1H02352726P034l1591L6955J10626N9069l9935j0610J04010J20640K2769k6822
2137.5H02704871O6936J81317J49369L1293L0040J31846J81258J38580Q0646J17182
2157.9H03813338K17676K47300J52230M6075R1553K64763L39270K26736J63138K70605
2178.3H05832684L58164K69294J33693J62125K81751K86579J84775J49667K42829L29256
2198.7H08230817K67685J44601J36673K41339L11673K54393J62959J95503L17454L34323
$$ plain form
2219.1 810597420 810803831 810923696 811127841 811452210 811744332 811908305 812048674 812302411 812630713 812869132
2239.5 812869132 812978745 813121140 813397110 813689590 813870132 813982487 814150631 814409554 814651489 814783573
2259.9 814783573 814877331 815041661 815276742 815473795 815577388 815702796 815939248 816189051 816324115 816371500
2280.3 816371500 816473365 816693902 816898167 816941619 816912591 816999793 817192554 817302525 817256033 817189455
2300.7 817189455 817249179 817355573 817314982 817153454 817075491 817144334 817203641 817069888 816783547 816574872
2321.1 816574872 816513062 816454411 816285670 816110015 816091120 816109478 815944195 815614879 815339327 815314591
2341.5 815314591 815505087 815828919 816204846 816385686 816252470 815883875 815421343 815071762 814985752 815100014
2361.9 815100014 815244436 815377355 815644205 816072822 816493571 816784918 817012727 817347825 817790389 818114638
$$ packed form
2219.1H10597420K06411J19865K04145L24369K92122J63973J40369K53737L28302K38419
2239.5H12869132J09613J42395K75970K92480J80542J12355J68144K58923K41935J32084
2259.9H14783573R3758J64330K35081J97053J03593J25408K36452K49803J35064M7385
2280.3H16371500J01865K20537K04265M3452k9028Q7202J92761J09971m6492o6578
2300.7H17189455N9724J06394m0591j61528p7963O8843N9307j33753k86341k08675
2321.1H16574872o1810n8651j68741j75655j8895J8358j65283l29316k75552k4736
2341.5H15314591J90496L23832L75927J80840j33216l68595m62532l49581q6010J14262
2361.9H15100014J44422J32919K66850M28617M20749K91347K27809L35098M42564L24249
$$ plain form
2382.3 818114638 818204880 818209052 818291366 818367302 818246126 817975283 817806184 817820251 817803800 817588747 817327619
2404.7 817327619 817240834 817244053 817091048 816760063 816471636 816363335 816296756 816082418 815768421 815545380
2425.1 815545380 815458179 815347314 815053761 814669728 814412773 814271331 814048350 813700855 813400567 813243628
2445.5 813243628 813088298 812746227 812279403 811945319 811795712 811603487 811246991 810865879 810620308 810445070
2465.9 810445070 810124815 809638679 809207737 808967769 808781743 808461428 808053434 807740450 807549596 807299137
2486.3 807299137 806883395 806443155 806141376 805938661 805654705 805249095 804906666 804706931 804490924 804137945
2506.7 804137945 803726614 803411841 803205967 802950740 802575171 802217901 802003443 801841855 801559210 801161170
2527.1 801161170 800798595 800547063 800327778 800027192 799681127 799427748 799277544 799056709 798681140 798302472
$$ packed form
2382.3H18114638R0242M172Q2314P5936j21176k70843j69099J4067j6451k15053k61128
2404.7H17327619q6785L219j53005l30985k88427j08301o6579k14338l13997k23041
2425.1H15545380q7201j10865k93553l84033k56955j41442k22981l47495l00288j56939
2445.5H13243628j55330l42071m66824l34084j49607j92225l56496l81112k45571j75238
2465.9H10445070l20255m86136m30942k39968j86026l20315m07994l12984j90854k50459
2486.3H07299137m15742m40240l01779k02715k83956m05610l42429j99735k16007l52979
2506.7H04137945m11331l14773k05874k55227l75569l57270k14458j61588k82645l98040
2527.1H01161170l62575k51532k19285l00586l46065k53379j50204k20835l75569l78668
$$ plain form
2547.5 798302472 798056901 797885537 797645807 797311723 797005951 796816528 796643734 796332836 795930564 795617938
2567.9 795617938 795418143 795174778 794818759 794467270 794212878 793971181 793623567 793179870 792741537 792386234
2588.3 792386234 792070568 791689754 791237891 790809989 790441692 790034115 789523184 788997054 788540542 788120806
2608.7 788120806 787657320 787128747 786590815 786068559 785515308 784884453 784195721 783543468 782982528 782432795
2629.1 782432795 781787038 781079054 780416727 779793441 779101670 778305233 777515531 776833475 776193023 775467157
2649.5 775467157 774670899 773927748 773270726 772603214 771843135 771058798 770395875 769828320 769194841 768487096
2669.9 768487096 767821848 767242372 766698599 766091526 765410006 764780104 764254272 763734460 763140678 762538791
2690.3 762538791 762038767 761608899 761108518 760510743 759945452 759497106 759094000 758610070 758047819 757515669
$$ packed form
2547.5G98302472k45571j71364k39730l34084l05772j89423j72794l10898m02272l12626
2567.9G95617938j99795k43365l56019l51489k54392k41697l47614m43697m38333l55303
2588.3G92386234l15666l80814m51863m27902l68297m07577n10931n26130m56512m19736
2608.7G88120806m63486n28573n37932n22256n53251o30855o88732o52253n60940n49733
2629.1G82432795o45757p07984o62327o23286o91771p96437p89702o82056o40452p25866
2649.5G75467157p96258p43151o57022o67512p60079p84337o62923n67555o33479p07745
2669.9G68487096o65248n79476n43773o07073o81520o29902n25832n19812n93782o01887
2690.3G62538791n00024m29868n00381n97775n65291m48346m03106m83930n62251n32150
$$ plain form
2710.7 757515669 757065594 756639004 756131351 755565464 755075276 754678667 754248261 753717482 753184199 752754867
2731.1 752754867 752380013 751957119 751478076 750999808 750586569 750218213 749808848 749356985 748915017 748479068
2751.4 748479068 747994661 747434616 746861637 746354043 745870411 745320082 744701684 744089901 743527114 742943823
2771.8 742943823 742264450 741519570 740795732 740105033 739382207 738619328 737858236 737127602 736383677 735537469
2792.2 735537469 734613121 733712375 732834816 731883585 730820060 729727030 728687882 727656305 726538122
2810.6 726538122 725308955 724002242 722698390 721430540 720115423 718696892 717209756 715678632
2826.9 715678632 714097142 712450266 710753441 709077656 707452476 705775917 703965008 702143312
2843.2 702143312 700435162 698749959 696931541 694985330 693077087 691271901 689471722 687623143
$$ packed form
2710.7G57515669m50075m26590n07653n65887m90188l96609m30406n30779n33283m29332
2731.1G52754867l74854m22894m79043m78268m13239l68356m09365m51863m41968m35949
2751.4G48479068m84407n60045n72979n07594m83632n50329o18398o11783n62787n83291
2771.8G42943823o79373p44880p23838o90699p22826p62879p61092p30634p43925q46208
2792.2G35537469r24348r00746q77559r51231j063525j093030j039148j031577j118183
2810.6G26538122j229167j306713j303852j267850j315117j418531j487136j531124
2826.9G15678632j581490j646876j696825j675785j625180j676559j810909j821696
2843.2G02143312j708150j685203j818418j946211j908243j805186j800179j848579
$$ plain form
2859.5 687623143 685746431 683853209 681933939 679954827 677970886 676134586 674464107 672895014
2875.9 672895014 671461105 670194149 669059277 668012738 667016506 666065812 665170193 664336562 663585603
2894.2 663585603 662860513 662082732 661305666 660583198 659882903 659172475 658427298 657657325 656889677 656061232
2914.6 656061232 655126035 654162228 653262794 652526200 652007580 651692867 651588380 651665390 651930332 652474403
2935 652474403 653315902 654413164 655778885 657396317 659130275 660862088 662639201 664575398 666612387
2953.4 666612387 668624103 670680881 672890961 675211191 677532077 679798722 682013214 684172332
2969.7 684172332 686287045 688337088 690258563 692070365 693812847 695405483 696774185 697994769
2986 697994769 699174523 700370133 701501489 702368379 702976525 703460574 703834534 704090476 704192221
$$ packed form
2859.5F87623143j876712j893222j919270j979112j983941j836300j670479j569093
2875.9F72895014j433909j266956j134872j046539r96232r50694q95619q33631p50959
2894.2F63585603p25090p77781p77066p22468p00295p10428p45177p69973p67648q28445
2914.6F56061232r35197r63807q99434p36594n18620l14713j04487P7010K64942N44071
2935F52474403Q41499J097262J365721J617432J733958J731813J777113J936197K036989
2953.4F66612387K011716K056778K210080K320230K320886K266645K214492K159118
2969.7F84172332K114713K050043J921475J811802J742482J592636J368702J220584
2986F97994769J179754J195610J131356Q66890O08146M84049L73960K55942J01745
$$ plain form
3004.4 704192221 704114079 703990042 703897834 703686416 703218758 702526510 701739252 700929463 700084209 699187398
3024.7 699187398 698240399 697296500 696378231 695449829 694423497 693272412 692182660 691199481 690122664
3043.1 690122664 688874543 687568486 686337829 685128868 683825552 682518363 681267500 679988682
3059.4 679988682 678683639 677414119 676216185 675013721 673670352 672249198 670931220 669798732
3075.7 669798732 668758035 667561352 666156590 664757013 663418949 662082553 660731137 659318328
3092.1 659318328 657900453 656587422 655360639 654093027 652700961 651314139 650100529 648959935
3108.4 648959935 647674024 646368325 645290911 644272804 643067420 641663969 640143216 638672054
3124.7 638672054 637348175 636095941 634822249 633541703 632341981 631244063 630129755 628870189
$$ packed form
3004.4G04192221p8142j24037r2208k11418m67658o92248p87258q09789q45254q96811
3024.7F99187398r46999r43899r18269r28402j026332j151085j089752r83179j076817
3043.1F90122664j248121j306057j230657j208961j303316j307189j250863j278818
3059.4F79988682j305043j269520j197934j202464j343369j421154j317978j132488
3075.7F69798732j040697j196683j404762j399577j338064j336396j351416j412809
3092.1F59318328j417875j313031j226783j267612j392066j386822j213610j140594
3108.4F48959935j285911j305699j077414j018107j205384j403451j520753j471162
3124.7F38672054j323879j252234j273692j280546j199722j097918j114308j259566
$$ plain form
3141 628870189 627524137 626218915 624979556 623835623 622788191 621655941 620339513 619001925 617732346
3159.4 617732346 616502523 615310252 614115953 612902820 611727417 610591292 609423280 608219147
3175.7 608219147 607037723 605895400 604742706 603558540 602389753 601269603 600161672 599001646
3192 599001646 597802281 596626818 595488012 594375789 593293607 592211306 591086149 589943707 588849723
3210.3 588849723 587809920 586774170 585711658 584648132 583613753 582590640 581544638 580487132
3226.7 580487132 579463899 578529418 577682972 576761425 575689614 574606597 573607266 572708011 571890116
3245 571890116 571081758 570208490 569314957 568503618 567752242 566975713 566184640 565447450 564754903 564061463
3265.4 564061463 563401759 562834322 562238812 561492801 560682058 559871733 559089243 558361471 557648122 556947052
$$ packed form
3141F28870189j346052j305222j239359j143933j047432j132250j316428j337588j269579
3159.4F17732346j229823j192271j194299j213133j175403j136125j168012j204133
3175.7F08219147j181424j142323j152694j184166j168787j120150j107931j160026
3192E99001646j199365j175463j138806j112223j082182j082301j125157j142442j093984
3210.3E88849723j039803j035750j062512j063526j034379j023113j046002j057506
3226.7E80487132j023233r34481q46446r21547j071811j083017r99331q99255q17895
3245E71890116q08358q73268q93533q11339p51376p76529p91073p37190o92547o93440
3265.4E64061463o59704n67437n95510p46011q10743q10325p82490p27772p13349p01070
$$ plain form
3285.8 556947052 556294203 555679858 555022538 554253101 553392708 552470922 551529646 550678372 549955845 549201846
3306.2 549201846 548245609 547092855 545862377 544672787 543534815 542409241 541287124 540178657
3322.5 540178657 539074659 537887275 536591887 535242677 533859015 532540798 531351686 530094028
3338.8 530094028 528625965 527091384 525575697 524093866 522710621 521268427 519577503 517803192
3355.2 517803192 516169667 514619112 512997627 511354625 509884417 508518398 506954849 505143762
3371.5 505143762 503360689 501825154 500451624 499086618 497731090 496460646 495315880 494327754
3387.8 494327754 493521184 492699116 491640955 490540981 489722490 489107639 488298744 487211317 486184269
3406.1 486184269 485353619 484617263 483915746 483179122 482437938 481818050 481298357 480822265 480453759 480239600
$$ packed form
3285.8E56947052o52849o14345o57320p69437q60393r21786r41276q51274p22527p53999
3306.2E49201846r56237j152754j230478j189590j137972j125574j122117j108467
3322.5E40178657j103998j187384j295388j349210j383662j318217j189112j257658
3338.8E30094028j468063j534581j515687j481831j383245j442194j690924j774311
3355.2E17803192j633525j550555j621485j643002j470208j366019j563549j811087
3371.5E05143762j783073j535535j373530j365006j355528j270444j144766r88126
3387.8D94327754q06570q22068j058161j099974q18491o14851q08895j087427j027048
3406.1D86184269q30650p36356p01517p36624p41184o19888n19693m76092l68506k14159
$$ plain form
3426.5 480239600 480123997 480000108 479943603 480035067 480033606 479817957 479668349 479783446 480044991 480324239
3446.9 480324239 480639189 481026918 481440723 481881768 482451022 483154982 483821660 484450519 485277712 486265182
3467.3 486265182 487054050 487496942 487866640 488461554 489356786 490315318 491042674 491683632 492490083 493348956
3487.7 493348956 494145602 494955540 495818913 496777147 497775733 498740315 499709368 500607491 501399815 502277195
3508.1 502277195 503343642 504537106 505706429 506753922 507783532 508911252 510189593 511468053
3524.4 511468053 512585998 513707578 514965355 516291320 517702401 519167840 520560741 521994591
3540.8 521994591 523578644 525156200 526546776 527842164 529226065 530751824 532386422 534084618
3557.1 534084618 535862744 537689149 539422274 541075587 542984962 545159638 547208190 549171567
$$ packed form
3426.5D80239600j15603j23889n6505R1464j461k15649j49608J15097K61545K79248
3446.9D80324239L14950L87729M13805M41045N69254P03960O66678O28859Q27193R87470
3467.3D86265182P88868M42892L69698N94914Q95232R58532P27356O40958Q06451Q58873
3487.7D93348956P96646Q09938Q63373R58234R98586R64582R69053Q98123P92324Q77380
3508.1E02277195J066447J193464J169323J047493J029610J127720J278341J278460
3524.4E11468053J117945J121580J257777J325965J411081J465439J392901J433850
3540.8E21994591J584053J577556J390576J295388J383901J525759J634598J698196
3557.1E34084618J778126J826405J733125J653313J909375K174676K048552J963377
$$ plain form
3573.4 549171567 551299214 553559780 555911303 558404446 560921490 563265264 565555811 568095863
3589.7 568095863 570722938 573348582 576093614 578911841 581730425 584587872 587421656 590101957
3606 590101957 592845142 595793009 598778248 601804852 604671359 607383966 610404730 613541722 616388440
3624.4 616388440 618840277 621404231 624604583 627710700 630550325 633344471 636095941 638904512
3640.7 638904512 641790271 644514620 646958947 649558008 652598441 655365705 657685816 660251975
3657 660251975 663053274 665543437 667763293 669947982 671963036 673892200 676096559 677989125 679561675
3675.4 679561675 681491554 683473885 685355604 687196791 688877881 690480590 692080438 693530917
3691.7 693530917 694856644 696199775 697543621 698743403 699850202 701042414 702250540 703324914
$$ packed form
3573.4E49171567K127647K260566K351523K493143K517044K343774K290547K540052
3589.7E68095863K627075K625644K745032K818227K818584K857447K833784K680301
3606E90101957K743185K947867K985239L026604K866507K712607L020764L136992K846718
3624.4F16388440K451837K563954L200352L106117K839625K794146K751470K808571
3640.7F38904512K885759K724349K444327K599061L040433K767264K320111K566159
3657F60251975K801299K490163K219856K184689K015054J929164K204359J892566J572550
3675.4F79561675J929879J982331J881719J841187J681090J602709J599848J450479
3691.7F93530917J325727J343131J343846J199782J106799J192212J208126J074374
$$ plain form
3708 703324914 704142749 704939246 706038296 707174003 708147883 708934784 709566057 710171938 710959554 711923003
3728.4 711923003 712758899 713398039 713977575 714761257 715788662 716489673 716559768 716863275 717861831 718434393
3748.8 718434393 718634605 719325781 720233917 720854580 721280754 721810460 722392797 722957790 723455906 723801732
3769.2 723801732 724236965 724857152 725475967 725968540 726348281 726725996 727077425 727421105 727836668 728311539
3789.6 728311539 728814662 729242086 729624569 730029702 730181694 730314016 730754316 731051624 731320500 731849968
3810 731849968 732372522 732593000 732743979 733004868 733058751 733376741 733980834 734341323 734607756 734908998
3830.4 734908998 735286593 735698640 735818267 735757709 735936880 736275434 736688256 737185478 737625659 737591386
3850.8 737591386 736950159 736907244 737658560 738289714 738626420 738761663 738940954 739125788 739177167 739360571
$$ packed form
3708G03324914Q17835P96497J099050J135707R73880P86901O31273O05881P87616R63449
3728.4G11923003Q35896O39140N79536P83682J027405P01011P0095L03507R98556N72562
3748.8G18434393K00212O91176R08136O20663M26174N29706N82337N64993M98116L45826
3769.2G23801732M35233O20187O18815M92573L79741L77715L51429L43680M15563M74871
3789.6G28311539N03123M27424L82483M05133J51992J32322M40300K97308K68876N29468
3810G31849968N22554K20478J50979K60889N3883L17990O04093L60489K66433L01242
3830.4G34908998L77595M12047J19627o0558J79171L38554M12822M97222M40181l4273
3850.8G37591386o41227m2915P51316O31154L36706J35243J79291J84834N1379J83404
$$ plain form
3871.2 739360571 739589691 739797294 740030885 740187883 740444005 740642130 740727425 740984201 741110504 741057038
3891.6 741057038 741238296 741561651 741730273 741759121 741722941 741695642 741882026 742184937 742396474 742543757
3912 742543757 742619872 742595792 742610097 742724359 742798865 742855549 743061066 743285179 743313313 743286848 743384600
3934.4 743384600 743524909 743619978 743624151 743588150 743669212 743796349 743824601 743814588 743852854 743956447 744081616
3956.8 744081616 744163632 744210601 744269967 744337320 744374692 744401634 744472384 744568706 744639099 744691849 744706094
3979.3 744706094 744719625 744806170 744871676 744868696 744872987 744928956 745042443 745155692 745203197
3997.6 745203197
$$ packed form
3871.2G39360571K29120K07603K33591J56998K56122J98125Q5295K56776J26303n3466
3891.6G41057038J81258L23355J68622K8848l6180k7299J86384L02911K11537J47283
3912G42543757P6115k4080J4305J14262P4506N6684K05517K24113K8134k6465R7752
3934.4G43384600J40309R5069M173l6001Q1062J27137K8252j0013L8266J03593J25169
3956.8G44081616Q2016M6969N9366O7353L7372K6942P0750R6322P0393N2750J4245
3979.3G44706094J3531Q6545O5506k980M291N5969J13487J13249M7505
3997.6G45203197
##END=$$ End of the data block
