##TITLE=FibraC $$ Begin of the data block
##JCAMP-DX=5.00 $$ ACD/SpecManager v 10.08
##SPECTROMETER/DATA SYSTEM=Alpha
##DATE=09 Jun 2015 08:49:18
##DATA TYPE=INFRARED SPECTRUM
##DATA CLASS=XYDATA
##ORIGIN=
##OWNER=
##NPOINTS=1765
##FIRSTX=399.76428223
##LASTX=3997.64306641
##MAXX=3997.64306641
##MINX=399.76428223
##MAXY=1.00106132
##MINY=0.76490688
##XFACTOR=1.0000000000
##YFACTOR=0.000000010000000
##FIRSTY=1.00000000
##DELTAX=2.03961372
##XUNITS=1/CM
##YUNITS=ARBITRARY UNITS
##XYDATA=(X++(Y..Y))
399.8 100000000 100101829 100030112 100022721 100000000 99904519 99791867 99773741 99555230 99070299 98942012 99209458
422.2 99209458 99344343 99326986 99337983 99393100 99373156 99281520 99268049 99286872 99156111 98988217 99022073
444.6 99022073 99131227 99096239 98992717 98985475 98970139 98830158 98796010 98947221 99047112 98990965 98908120
467.1 98908120 98896945 98841512 98739266 98758864 98867089 98887217 98786581 98724836 98776698 98799330 98735976
489.5 98735976 98722464 98782802 98768771 98669744 98600614 98574799 98523676 98452407 98459822 98511696 98462194 98332417
514 98332417 98248255 98224103 98189038 98137748 98108310 98098671 98081517 98069954 98096269 98106670 98034787 97957993
538.5 97957993 97964132 97962022 97872388 97804987 97830248 97842962 97777027 97718257 97726935 97718358 97637361 97578663 97598398
565 97598398 97600216 97536027 97508901 97543657 97533923 97470361 97463095 97536457 97570693 97529995 97535676 97604877 97623098
591.5 97623098 97584480 97603786 97690231 97728872 97702473 97731441 97842491 97894835 97859550 97887516 97981763 97988468
616 97988468 97940123 98009431 98156482 98200548 98176527 98261374 98403817 98426521 98386097 98456293 98569036 98560399
640.4 98560399 98510903 98581868 98681027 98639303 98574823 98659706 98771220 98753756 98733371 98849678 98957479
662.9 98957479 98849702 98571253 98581547 98851269 98923677 98918635 99035084 99124610 99066120 99040198 99150199
685.3 99150199 99212021 99148816 99152344 99285966 99351645 99286896 99285406 99394077 99418759 99332422 99344605 99472094
709.8 99472094 99495620 99404001 99414504 99522185 99516273 99423707 99459332 99591416 99597043 99506706 99540234 99650717
734.3 99650717 99628794 99531651 99565649 99671537 99639779 99539971 99587697 99695957 99649549 99552357 99609232
756.7 99609232 99703068 99641573 99552536 99624991 99726993 99671638 99598056 99679512 99764138 99694985 99634725 99735552
781.2 99735552 99833941 99778485 99724835 99811292 99877894 99802077 99761617 99873304 99952954 99890751 99863851 99966854
805.6 99966854 100022233 99949074 99931860 100043094 100094593 100013351 99984777 100075638 100105345 100023067 100004566 100090814
830.1 100090814 100106132 100011611 99984795 100061524 100068164 99979937 99968547 100047755 100041771 99942178 99928463 100007093
854.6 100007093 100000000 99915290 99910557 99989724 99986517 99906331 99914390 100000298 99997586 99918878 99931848 100016785 100005245
881.1 100005245 99923605 99934059 100000000 99971336 99885416 99900281 99972892 99950051 99877453 99903029 99974042 99947232
905.6 99947232 99877667 99900407 99954796 99910772 99836916 99865496 99922210 99874902 99804556 99837691 99893433 99851489
930.1 99851489 99787980 99816948 99862194 99818158 99768502 99810565 99849510 99788624 99724221 99747968 99760771 99677867
954.5 99677867 99600697 99608982 99605888 99516976 99437201 99438226 99425459 99333346 99254835 99246436 99214196 99103045
979 99103045 99009252 98993462 98966599 98879004 98819607 98832577 98829192 98765451 98730415 98761761 98765290 98704046 98665380
1005.5 98665380 98681545 98667020 98590606 98540920 98553926 98548818 98495364 98472840 98505670 98511434 98467004 98451447
1030 98451447 98483407 98490041 98461127 98463786 98500186 98502153 98467499 98466158 98499876 98499918 98468596 98473889 98513871 98522866
1058.6 98522866 98504716 98526347 98582083 98602396 98581064 98570961 98574972 98549688 98509532 98509473 98537678 98541397 98526132
1085.1 98526132 98537225 98571175 98584300 98580074 98596907 98623073 98622763 98608547 98611885 98622626 98611403 98589951
1109.6 98589951 98592401 98611897 98618126 98615390 98629963 98655808 98663294 98656201 98668891 98712075 98758149 98789418 98820579
1136.1 98820579 98852032 98863041 98857224 98857081 98863482 98857832 98838347 98825812 98826224 98823392 98815626 98819548 98836941 98850930
1164.6 98850930 98861766 98890948 98940372 98986560 99023354 99067539 99119157 99160743 99188030 99215931 99251759 99280655
1189.1 99280655 99295580 99309319 99326015 99335128 99335074 99340552 99357575 99370277 99371624 99378920 99403560 99429584 99438775
1215.6 99438775 99441707 99454719 99466318 99462867 99459243 99468428 99472016 99457675 99447542 99455446 99460119 99448156 99438274
1242.1 99438274 99445897 99452925 99439913 99426341 99431938 99435884 99417198 99392658 99386466 99385583 99367207 99349773 99351239
1268.6 99351239 99354535 99354368 99367332 99392682 99406260 99401444 99404013 99421340 99427795 99420297 99425316 99444669 99449337
1295.2 99449337 99432236 99424273 99436629 99439782 99420327 99407405 99413532 99405348 99376267 99359053 99361622 99376351 99398130
1321.7 99398130 99423856 99450850 99456513 99437183 99426562 99415535 99340099 99217409 99197578 99316049 99412334
1344.1 99412334 99418122 99407268 99422783 99424726 99393791 99376011 99345613 99223459 99108642 99159813 99255985 99254674
1368.6 99254674 99175620 99055612 98992962 99020791 99024260 98966855 98876089 98780996 98788667 98965639 99098760
1391 99098760 99005371 98845607 98831415 98940635 99067527 99098134 99105191 99186695 99234241 99223214 99201852 99080980
1415.5 99080980 98829228 98743457 98922163 99072134 99131137 99115545 99075311 99091679 99017060 98839390 98911101
1437.9 98911101 99159253 99265182 99227512 99126601 99063355 99079245 99020863 98732764 98292333 98282343 98682475
1460.4 98682475 98883700 98872316 98943740 99006957 98823357 98587978 98674911 98970646 99227864 99360061
1480.8 99360061 99389577 99302989 99071407 98872602 98969710 99165475 99131393 98995996 99066317 99214083 99102741
1503.2 99102741 98558527 98156446 98505366 98931593 99050695 98891449 98680657 98528087 98454994 98585135
1523.6 98585135 98779547 98977733 99107999 99003017 98879945 98880357 98588884 98039597 98036879 98473722 98862690
1546 98862690 99018729 98992926 98912305 98707783 98245132 97707939 97989076 98612785 98837334 98778856 98625106
1568.5 98625106 98590785 98627454 98456836 98296547 98422468 98520929 98468918 98361218 98210162 98006910
1588.9 98006910 97788340 97570282 97337991 97097248 96847802 96575147 96279407 95960462 95626634 95313835
1609.3 95313835 95007831 94599038 94045293 93641800 93522900 93324703 93061727 92950553 92903137 92877913
1629.7 92877913 92811221 92558646 92391032 92721707 93194562 93493527 93542373 93494147 93768221 94094384
1650.1 94094384 94122642 94550139 95434135 96032649 96287364 96450198 96748698 96959931 96936381 97009772
1670.5 97009772 97259945 97472799 97727525 97949028 97915775 97645289 97630632 98071802 98444873 98646241
1690.9 98646241 98631406 98351949 98073870 97957963 98108864 98436052 98650432 98855925 99059910 99095684
1711.3 99095684 98926973 98625916 98503113 98825747 99216759 99405926 99463320 99425989 99288684 99050349
1731.7 99050349 98851824 99016762 99247700 99307615 99350375 99400723 99376434 99269921 99219960 99394625 99609476
1754.1 99609476 99668658 99655074 99623954 99646139 99755597 99744731 99573106 99378020 99332434 99531245 99740380
1776.5 99740380 99803680 99800342 99810416 99835330 99877244 99824673 99619377 99532717 99686050 99796587 99756318
1799 99756318 99728823 99829906 99940687 99942350 99878597 99871302 99939579 99980444 99977285 99986160 99963289 99854642
1823.4 99854642 99754316 99704129 99676794 99767458 99905849 99960572 99969494 99938715 99794418 99634176 99679494
1845.9 99679494 99834377 99935251 99985325 100000000 99987096 99969065 99969900 99969542 99909633 99757129 99637145 99720675
1870.3 99720675 99886072 99961746 99974120 99975467 99964517 99948460 99939787 99903840 99830186 99816144 99863386 99886644
1894.8 99886644 99896306 99910027 99920118 99923640 99902999 99858934 99834973 99853337 99862558 99806088 99730855 99723572
1919.3 99723572 99737340 99746996 99802327 99851555 99846876 99826604 99826860 99833179 99809742 99742335 99672556 99671268 99712688
1945.8 99712688 99741524 99764478 99771488 99749070 99730313 99737209 99740696 99718797 99681932 99655759 99663103 99681830
1970.3 99681830 99685049 99685544 99684596 99670798 99659473 99665046 99664724 99635804 99590296 99553186 99553776 99582893 99600947 99610448
1998.8 99610448 99615562 99602348 99585092 99584043 99585539 99570274 99547774 99529707 99515122 99495721 99458897 99389535
2023.3 99389535 99319977 99334270 99419326 99487895 99516779 99519432 99512959 99510866 99509889 99505800 99506909 99520314 99531806
2049.8 99531806 99527115 99520546 99529505 99538136 99528122 99514657 99518454 99532503 99537045 99537092 99548763 99559551 99554223 99551797
2078.4 99551797 99569815 99587184 99583864 99578702 99590051 99604744 99607611 99608088 99620765 99634981 99633747 99631613 99647295
2104.9 99647295 99662673 99659663 99656731 99671161 99685830 99684149 99682617 99697673 99711043 99705648 99703312 99722892 99741250
2131.4 99741250 99736333 99729615 99741447 99751633 99746525 99748534 99769527 99785167 99779695 99775374 99789172 99801284 99795228
2157.9 99795228 99791169 99808127 99825811 99821967 99813032 99822819 99837780 99837285 99839807 99861228 99875253 99866027 99861616
2184.5 99861616 99877858 99888009 99879199 99879068 99900174 99914539 99907047 99901158 99912167 99920088 99912173 99911636 99930364
2211 99930364 99939919 99927372 99922293 99937588 99944204 99931341 99929363 99948752 99957925 99944180 99938989 99955094 99960583
2237.5 99960583 99946058 99945432 99966961 99975038 99958968 99950701 99960595 99960315 99943334 99939924 99955255 99957800 99941534
2264 99941534 99936825 99948961 99948150 99933153 99936897 99959463 99965936 99953932 99955225 99967206 99955171 99921519 99900991
2290.5 99900991 99895012 99873048 99833053 99801302 99777341 99734724 99670178 99608409 99552804 99482602 99407768 99347824
2315 99347824 99272019 99152756 99032336 98962116 98922795 98863220 98780322 98720574 98699909 98674423 98626876 98589218
2339.5 98589218 98578876 98610812 98743570 98924553 98972851 98813218 98546857 98327631 98193049 98122096
2359.9 98122096 98114234 98182142 98313802 98472613 98652536 98859245 99067438 99258912 99443406 99625301
2380.2 99625301 99781770 99884129 99936104 99968827 99994028 99999011 99988282 99988025 100000000 99999481 99987906 99988574 99999279
2406.8 99999279 100000000 99992317 99992204 99997693 99992871 99984044 99988133 99998057 99995303 99983424 99982184 99993390 99996907 99987572
2435.3 99987572 99986279 99998331 100002468 99992847 99989033 99997342 99999666 99990171 99986494 99994051 99995893 99987775 99986070 99993151
2463.9 99993151 99991703 99980128 99979025 99990779 99993289 99983603 99983740 99995601 99996138 99986184 99988014 100000203 100002062 99992222
2492.4 99992222 99989879 99996829 99993807 99982625 99986595 100001538 99999911 99983931 99980754 99991375 99991924 99981946 99985474 100000000
2521 100000000 99999785 99988043 99989754 100000465 99997836 99987817 99992996 100006497 100004351 99990684 99989206 99998289 99996394 99984837
2549.5 99984837 99985975 100000203 100002301 99990302 99989939 100001585 99999648 99987644 99990201 100000000 99994451 99982405 99985439
2576 99985439 99993724 99985951 99974746 99984783 100002754 100001061 99989647 99992514 100000763 99994093 99983341 99991095 100006068
2602.6 100006068 100003147 99992853 99997920 100005901 99996352 99986023 99996167 100008273 100001013 99989605 99993205 100000000 99994028
2629.1 99994028 99988419 99996436 100002170 99993688 99985832 99991143 99996060 99986666 99978161 99986267 99995822 99990004 99979883 99981016
2657.6 99981016 99985284 99978364 99972403 99983335 99994659 99989593 99984354 99993420 100000536 99993354 99986517 99991417 99995750 99987549
2686.2 99987549 99979585 99983412 99985093 99974799 99967510 99973851 99980026 99975991 99973851 99980813 99982089 99971861 99967384 99975461
2714.7 99975461 99980491 99973863 99969703 99978387 99985713 99977016 99964529 99965775 99969590 99963623 99960566 99964857 99964237 99957240
2743.3 99957240 99959469 99973667 99979579 99969995 99960357 99959081 99955946 99945182 99938631 99943531 99949181 99945855 99942887 99952805
2771.8 99952805 99965394 99960154 99941838 99930125 99925113 99919689 99924761 99944913 99953979 99938303 99922454 99924111 99925500
2798.4 99925500 99909443 99890041 99882346 99879557 99875045 99870396 99863088 99851078 99839056 99831903 99827528 99818784 99806035
2824.9 99806035 99797744 99792236 99780458 99762946 99748123 99737269 99709481 99647963 99575472 99513113 99446702 99367452
2849.3 99367452 99296093 99255860 99251282 99274230 99312347 99352485 99382210 99394947 99396765 99402535 99418706 99427646
2873.8 99427646 99416673 99403244 99395806 99386024 99376309 99367440 99353117 99333340 99316841 99307227 99287695 99248469 99210310
2900.3 99210310 99184710 99156976 99120879 99085540 99054539 99012679 98938668 98837638 98736304 98656011 98609972
2922.8 98609972 98601890 98631465 98688310 98743093 98786783 98838586 98904043 98972303 99040973 99110377 99161321 99174720
2947.2 99174720 99168575 99169105 99165350 99146885 99137396 99153602 99183512 99211025 99239945 99281788 99328130 99369937 99413717
2973.8 99413717 99459726 99499136 99522895 99526817 99520814 99517727 99522889 99544573 99571967 99576312 99564970 99556577 99545169
3000.3 99545169 99530941 99518716 99512088 99521261 99544579 99562573 99561387 99544549 99517620 99487442 99469048 99459255
3024.7 99459255 99439245 99414361 99403858 99409819 99406922 99383742 99375284 99389404 99384987 99348879 99310458 99293178
3049.2 99293178 99280995 99253416 99228096 99211085 99182975 99152946 99140602 99145126 99144065 99117291 99080575 99057925
3073.7 99057925 99054348 99057263 99045426 99018967 98987764 98949909 98916823 98892283 98851728 98796290 98755842 98736382
3098.2 98736382 98716247 98684138 98654026 98637533 98619610 98581707 98546910 98541850 98541069 98515838 98461795 98387355
3122.6 98387355 98318803 98273355 98241812 98200250 98145413 98105437 98090190 98070639 98017138 97944558 97884065 97835588
3147.1 97835588 97795129 97763389 97716975 97641796 97559291 97485709 97420079 97357035 97290611 97220445 97151613 97087127
3171.6 97087127 97018254 96935219 96847546 96769565 96692979 96606719 96521425 96445215 96364504 96267986 96162397
3194 96162397 96056485 95953792 95854872 95759243 95666981 95570689 95465803 95363253 95265329 95163649 95060223
3216.5 95060223 94957685 94856155 94754165 94646639 94537318 94434118 94340706 94251221 94145459 94021964
3236.9 94021964 93901086 93789661 93688613 93604928 93528205 93434513 93331283 93242210 93163073 93077135 92988914
3259.3 92988914 92908919 92830962 92755431 92696404 92648882 92580354 92482543 92379820 92281026 92182374 92085481
3281.7 92085481 91993213 91900325 91800606 91703600 91613436 91511059 91380286 91227394 91079223 90958226 90850770
3304.2 90850770 90715027 90529269 90314037 90099490 89900124 89707053 89504385 89293706 89089632 88889903
3324.6 88889903 88664740 88407791 88144875 87889749 87645459 87407970 87153369 86870074 86570376 86259162
3345 86259162 85954577 85677677 85389608 85050869 84695315 84360319 84036428 83705914 83378679 83078325
3365.4 83078325 82791150 82475150 82119358 81761986 81439847 81147766 80869180 80595511 80327111 80077004
3385.7 80077004 79861033 79677939 79486775 79257464 79027927 78849739 78703469 78516608 78282905 78070670
3406.1 78070670 77902365 77748460 77590549 77425414 77260244 77104366 76965308 76857221 76779878 76721781
3426.5 76721781 76679403 76641363 76610649 76599783 76583749 76542300 76501995 76490688 76508152 76554567 76631337 76719218
3451 76719218 76804495 76894480 76996785 77108592 77217722 77338070 77498424 77677488 77820039 77914363 78008962
3473.4 78008962 78141183 78300756 78450781 78577352 78714502 78876603 79039937 79199773 79364949 79534274
3493.8 79534274 79708254 79878193 80030006 80175471 80338418 80510312 80675858 80861765 81086397 81305993
3514.2 81305993 81486899 81646818 81806159 81976891 82153547 82329786 82531816 82771361 83016193 83246177
3534.6 83246177 83466691 83680820 83885968 84072304 84254289 84469271 84708279 84934235 85170835 85437948
3555 85437948 85690248 85910791 86108541 86240298 86311787 86521840 86969042 87428558 87765092 88043213
3575.4 88043213 88328415 88631105 88924253 89141226 89275396 89496630 89908040 90312195 90614092 90925974
3595.8 90925974 91287303 91649479 92002481 92300743 92491996 92667305 92929274 93235010 93539053 93798941
3616.2 93798941 94041723 94420713 94855988 95099366 95089746 95086813 95440644 95927340 96297526 96580547
3636.6 96580547 96802795 96970451 97066671 96997452 96748996 96640176 96987581 97448778 97707063 97900248
3657 97900248 98160404 98362619 98444533 98413205 98232925 97999084 97916597 97876704 97846693 98091507 98461503
3679.4 98461503 98719692 98823595 98746461 98544997 98472530 98695797 99001634 99183202 99218017 99163681
3699.8 99163681 99139440 99220192 99251688 99094087 98875690 98899180 99174201 99383819 99398530 99302495 99212152
3722.3 99212152 99187559 99235237 99278867 99167764 98888773 98697948 98838085 99123853 99197567 98976088
3742.7 98976088 98754638 98775542 98771697 98759764 99010360 99302638 99404943 99429119 99531090 99614859 99585027
3765.1 99585027 99527723 99527383 99635625 99791038 99840093 99761087 99688691 99716580 99763721 99798143 99859852 99910319
3789.6 99910319 99898601 99795979 99626315 99468476 99319434 99250913 99348933 99450564 99568766 99741805
3810 99741805 99776554 99600440 99373788 99237508 99153918 99247664 99486136 99618900 99633336 99578375 99477619
3832.4 99477619 99359542 99207073 99116069 99209112 99405819 99605548 99713361 99601078 99227923 98846108
3852.8 98846108 98973602 99380904 99589801 99548018 99410170 99359143 99347061 99271190 99273139 99409813 99557751
3875.2 99557751 99607956 99515885 99439007 99452722 99486339 99561667 99590623 99571842 99640220 99680352 99541467
3897.7 99541467 99320793 99204457 99280089 99523103 99772757 99896127 99903113 99831355 99720955 99670696 99708515
3920.1 99708515 99741852 99745655 99771863 99784088 99741256 99733025 99813032 99891067 99895149 99839008 99788916 99794972
3944.6 99794972 99809766 99807453 99836147 99891245 99928588 99937505 99928021 99918199 99927300 99944997 99949390 99943167 99938285
3971.1 99938285 99935842 99939102 99955326 99971861 99977964 99987197 100000000 99996334 99978757 99969512 99975336 99990261 100004339
3997.6 100004339
##END=$$ End of the data block
