##TITLE=$$ Begin of the data block
##JCAMP-DX=5.00 $$ ACD/SpecManager v 10.08
##SPECTROMETER/DATA SYSTEM=Varian
##DATE=02 Apr 2013 14:47:48
##DATA TYPE=INFRARED SPECTRUM
##DATA CLASS=XYDATA
##ORIGIN=
##OWNER=
##NPOINTS=3735
##FIRSTX=399.26403809
##LASTX=4000.35498047
##MAXX=4000.35498047
##MINX=399.26403809
##MAXY=67.65030670
##MINY=34.38629913
##XFACTOR=1.0000000000
##YFACTOR=0.000000100000000
##FIRSTY=40.56636429
##DELTAX=0.96440572
##XUNITS=1/CM
##YUNITS=TRANSMITTANCE
##XYDATA=(X++(Y..Y))
399.3 405663643 523360977 606531143 469350204 347102203 436949348 617829094 656902847
406 656902847 594006844 566781578 547252846 542494240 532295303 534111710 582327080 627675018
413.7 627675018 580647278 476850433 513165474 631720085 567431793 343862991 419144135
420.5 419144135 538362045 582261009 545910339 587703629 676503067 609412842 485609932
427.2 485609932 505991783 574220581 557482033 526793938 566955795 633209724 626810226 551497612
434.9 551497612 490430145 514040756 540958290 531915627 531492615 535920982 529809837 508768959
442.7 508768959 519428787 553461685 570003510 538037186 494657135 516155052 568071938
449.4 568071938 595036087 572772827 559045372 514001312 475040283 525146103 563252869
456.2 563252869 561238861 579218102 608938408 580528717 523230629 562249336 557971077 510673218
463.9 510673218 537993774 558638611 554653091 595425301 617966499 533860626 482378616 503837929
471.6 503837929 531203575 558689499 538227577 515301590 520801582 521425171 555226250 566389503
479.3 566389503 541369286 551699524 564405708 571224937 587429619 559395866 521415787 521306992
487 521306992 532442589 539457626 533213539 520110855 533537903 541149750 544507790 561682243
494.7 561682243 581391907 584592667 561312637 541190567 551279106 571843796 540163994 497975006
502.5 497975006 502569275 516227188 559540215 550685768 518297272 549821091 582319908 575999947
510.2 575999947 539683571 539033852 527612076 524420891 572235641 580341759 545941315 529068604
517.9 529068604 555175667 569451218 565502052 562676735 536913376 534395409 535253220 527341766
525.6 527341766 532734871 541868706 555431175 558107605 559282265 556751518 555833092 550955582
533.3 550955582 542572212 549525948 549495468 554151077 553145561 532775154 529141197 546336365
541 546336365 555302353 544429588 538882866 538341599 536979752 550735283 554918022 540885124
548.7 540885124 544604683 564353828 573332253 565711823 557158394 568592033 568031921 551777039
556.5 551777039 546309471 539031792 544033432 558454475 556148376 544024773 544557800 553783264
564.2 553783264 549849472 547970886 556726799 561037979 553069000 541186104 549886208 563194160
571.9 563194160 551867485 540451813 546808815 553397064 555382690 559663811 566408844 565696907
579.6 565696907 556797905 545860405 542872887 551250610 546189804 539063301 552888756 565222855
587.3 565222855 561713753 555025101 545568657 528609924 530763855 536337166 532735481 539871368
595 539871368 545466156 554899635 565539589 561557961 545551186 542567444 556179161 560190773
602.8 560190773 563000603 562840576 562357521 561496391 555570793 555645218 550000458 545778656 543198509
611.4 543198509 540467453 543477402 546931725 552224579 550535393 545824623 541461143 542607613
619.2 542607613 554980011 565816765 563399506 551476746 547072525 550143814 554858818 553293343
626.9 553293343 551612816 553291893 543135223 544888229 557085114 550023575 542994270 554265137
634.6 554265137 557335052 543381004 540847321 546826363 546963844 544142189 550122185 556328468
642.3 556328468 549100304 546530914 547643471 552710915 562086716 560834389 556951218 552517624
650 552517624 554265671 566986847 571405334 559233131 552429237 558820839 556607475 555213547
657.7 555213547 562949638 562060356 557813568 558367271 557626534 556175728 556170235 557368088 556497040
666.4 556497040 539136734 534345779 561593666 560154037 559700699 555273972 549983826 550855331
674.1 550855331 548376007 553404427 557200089 552348213 551638451 552225075 555675812 558794212 556613503
682.8 556613503 552022781 548637505 554161644 564844131 567511940 561983566 561168098 562231827
690.5 562231827 557278023 553685913 553430481 552976456 553930511 559651337 563316154 560902328 565554352
699.2 565554352 572401657 566397438 560956421 565803604 566428185 563257141 563821144 562506828 559638100
707.9 559638100 555202446 555743065 565161209 566132736 558791656 556960487 560145493 561984673 558972321
716.6 558972321 560556641 564808121 556616325 550528984 555617523 554912910 555422516 561111336 559462700
725.2 559462700 557684937 559446297 557921219 561546135 566658707 564410324 564587822 568397293 569212685
733.9 569212685 562617378 555572281 555734291 557751198 558904877 558347321 563434868 567598152 562185860
742.6 562185860 559342804 558648567 561819267 562845192 556969643 559336205 567061653 569636879 563242073
751.3 563242073 557720451 562715683 568281593 568604355 565567131 563801231 567815361 571361961 569828835
760 569828835 569618034 568550758 564672127 562164116 559035339 560975571 564244766 560983810 562948799
768.6 562948799 571615944 570674095 562073288 563054657 566331749 563116875 563240204 565439682 564369545
777.3 564369545 562284393 559806938 556738281 559209900 563390083 560817451 565017242 575729332
785 575729332 572168045 562499504 564800644 569086456 564653854 562211075 566696663 569595909 568323288
793.7 568323288 564906960 562048912 561937218 564596291 566222763 562874260 561972656 562867928 561785622
802.4 561785622 562273560 561287994 565426102 571358528 569377060 567432251 567127380 565942039 564780235
811.1 564780235 566320572 569784546 571385994 571634674 572328873 571799355 571715813 573456535 564512558
819.7 564512558 556757927 562431831 561679649 556539154 559383736 568093109 572283554 571021690 570615273
828.4 570615273 566408539 563674812 566345291 570476646 574245491 576247177 575194740 568627892
836.1 568627892 565123253 564392738 559551277 560049171 563329430 563562317 569572296 575080757 572778549
844.8 572778549 568332176 566186142 567945709 568434639 570932236 577140846 577292709 568601151 562737961
853.5 562737961 570203209 575372887 570951691 566726456 566972580 572287407 572631340 569346123 572087212
862.2 572087212 574846268 571144257 569518623 568694954 566169472 571552162 573423157 570467453 569183655
870.9 569183655 567974968 569921036 567037621 563759727 565095482 569231186 573548393 572043610
878.6 572043610 573158722 577340279 578043785 575841560 573448219 570944824 565760155 563796005 570570450
887.3 570570450 576704597 571764641 568377151 571129074 570441589 570022774 570310555 571341782 572983284
895.9 572983284 572247734 574693069 578353653 577599220 577172432 573454514 568837624 572786522 573589706
904.6 573589706 570718613 571510887 572154732 573649025 575274124 576853294 574561501 570249519 571892433
913.3 571892433 573122635 569941063 568717880 571085434 571490898 570069847 570813637 572286758 570931282
922 570931282 568974648 569285011 571046448 576563072 579163704 575734673 573286209 572113571 572108116
930.7 572108116 570245514 568941040 572636986 573428917 569520149 568427162 569553757 569508743 571313400
939.3 571313400 574192619 575215225 575537376 576888466 576944580 574246254 571215591 567454414 566781311
948 566781311 567362175 565041275 567549286 575060577 579584007 576466980 570328102 569014015 568481522
956.7 568481522 566881371 567765923 567224197 566008835 569701691 574281082 574023705 572085342 572130814
965.4 572130814 569642601 567169609 567355843 565373039 565641518 567524796 570523033 574653549 573847656
974.1 573847656 572329521 571569138 569530182 567569771 568976059 571248360 570107269 570725212 570733604
982.7 570733604 570558662 572107735 570685768 569758644 570655670 570308495 569338913 572285690 575723801
991.4 575723801 572759132 568952637 569404564 569760780 567559700 568491364 571316605 570954208 569220924
1000.1 569220924 569627991 573355560 572413521 565964203 564614677 567895851 569418335 569547501 570012474
1008.8 570012474 570373840 569581337 567455902 566094894 565618095 565599213 566774445 568024979 569039764
1017.5 569039764 570374069 569867897 567038651 566610069 567691574 568341370 568720932 566663132 566516991
1026.1 566516991 569464188 571702118 571802711 570012932 567694969 564493446 564249306 567700996 570401230
1034.8 570401230 570066681 568227577 569765739 570751419 568196144 568888092 570497665 568237724 567164230
1043.5 567164230 568093033 568889847 567429581 564737549 567279243 568153419 567396507 570431213 568765793
1052.2 568765793 567089539 568451538 567876701 564640465 562102356 566333923 567149696 564354630 566845016
1060.9 566845016 568226509 569286842 570901527 570881500 568997955 566385078 567118263 568010406 568690720
1069.5 568690720 569986610 568951111 567863579 569534836 570918465 567911568 567186966 569797668
1077.2 569797668 567242241 565235977 570305901 575386162 573733482 568629761 565275536 564385071
1085 564385071 565870781 569130821 571237335 570178680 568607101 567720032 566487808 567297668 569253235
1093.6 569253235 566164284 561031265 561707191 566138611 570692520 571889305 570307465 571727333
1101.4 571727333 571693573 567530479 565540237 565451164 565824242 569009285 570893402 568751755 567054596
1110 567054596 566931343 567325554 567316666 569159088 571916046 571834259 571490669 568106003 562804337 564161263
1119.7 564161263 569133377 569490051 566275826 566585541 570068703 570351753 567306366 568083916 571753311
1128.4 571753311 570496025 567480621 566637497 566771927 567791405 567702980 567561417 569220886 570150833
1137 570150833 569898071 569306679 569016228 568770218 567734756 568645859 570599632 571616173 573677559
1145.7 573677559 575914421 576092796 573526154 569682236 567605324 569397430 571390686 571665154 571902924
1154.4 571902924 570764236 570343094 570304031 570381432 571403160 572616043 573462601 571314964 571134720
1163.1 571134720 572434998 573105431 574290695 572427864 571563072 571222954 570608559 571081924 571785355
1171.8 571785355 574720688 575672989 574635048 573377609 572213173 573120003 573105049 571863823 571988144
1180.4 571988144 572479095 572058105 572889824 572622643 571491852 573647423 575799103 576229019 575164604
1189.1 575164604 573315887 572850571 574605560 575828819 575314102 576312141 575721855 575091629 577485886
1197.8 577485886 576911774 574010277 573627930 575314217 575815163 574809723 573707733 573382835 574714127
1206.5 574714127 575971298 574879608 572759323 572885056 573878326 574230385 574467049 573918686 574844589
1215.1 574844589 576245804 574962463 573442955 572764397 573818970 576527748 575282593 573326912
1222.9 573326912 575412178 576170197 575131149 575112915 575381126 574708099 573879814 573158760 571349907
1231.5 571349907 571705437 574133072 574447441 572921562 572952690 575255089 576506081 576400375 576711311
1240.2 576711311 576463013 574936218 573849487 574429817 576169319 577109261 575922546 574232254 573903770
1248.9 573903770 575286980 575706100 575259438 576158562 576738281 575907669 574086838 573825912 574202919
1257.6 574202919 573343430 573653984 575055504 576299477 576745682 576720963 575353928 574420624 575806007
1266.3 575806007 576757965 577106171 576083755 574921570 575236397 576234322 577180138 577293282 577203445
1274.9 577203445 575316582 574693604 575473633 574623795 575905876 578403893 579896355 579052620 577423515
1283.6 577423515 577820168 576760445 575127983 575317993 575644264 576012611 577665329 578628540 577707176
1292.3 577707176 576490173 575673676 575815620 575373802 574892464 575620499 576567726 578264503 579840851
1301 579840851 579322205 577357292 576670113 576715355 577354851 578548164 577530937 577687263 579660339
1309.7 579660339 579007759 577079201 576486359 576250114 575381699 576111031 576649780 575232086 575956535
1318.3 575956535 578415108 579567871 579878883 578965492 577510452 576741791 576340027 576759796 577613487
1327 577613487 578541870 579056396 579290771 580137558 579096794 577608757 578185196 578633080 579789009
1335.7 579789009 580963554 579776001 578378830 577915077 578287201 579167671 579492836 578770523 577709160
1344.4 577709160 577461395 578140831 578565865 578736191 579373398 579032402 577667961 576802864 576930733
1353.1 576930733 577672348 578555832 579142113 579766350 580696831 580212250 579346008 578713951 576999702
1361.7 576999702 576799927 577199860 577589264 579596138 581068916 581303864 580726814 578779831 576455383
1370.4 576455383 576093864 578097610 579203758 579271660 579229622 578340607 577185326 578440933 581389885
1379.1 581389885 580503922 578336067 578490219 579010544 578171539 577943420 579958954 580385666 578482094
1387.8 578482094 578237495 578257523 578383636 577969208 577551689 578148651 578310204 576210670 575577469 577167587
1397.4 577167587 578236198 577080078 577084579 578065948 578922920 580025139 579119644 576466293 576696892
1406.1 576696892 577475090 577396469 577059746 578261452 578893204 578425560 579292984 579221191 579245148 579766731
1415.7 579766731 579859200 579763374 579018784 577655449 577215729 578915787 579505005 578186340 578272705 577096748
1425.4 577096748 576715355 578799133 580156975 579711342 578659821 578481178 577868385 577300644 577164497
1434.1 577164497 577599373 578933182 576442451 576103477 578871651 579778366 579235268 579087105 578511696
1442.7 578511696 578696136 579275475 578308907 576826363 575515633 575408669 575842896 575652733 576617279
1451.4 576617279 578292580 578128204 577806854 577956429 577966805 578098183 579017601 580054893 578678360
1460.1 578678360 578082466 578466835 577654572 576002922 574384689 577798615 580623436 580844879 579851990
1468.8 579851990 579043350 578502922 575200768 571701355 574695549 577204933 579573364 580380859 579771843
1477.5 579771843 580314713 580018578 579367981 578896561 579342537 581576195 583663025 582618523 580347824
1486.1 580347824 579978828 579872169 579780655 579407387 579350815 580649147 580553474 581097794 582759666 582414970
1495.8 582414970 579667435 579945526 581207924 582435760 582594147 581572990 580962334 581887665 582531815
1504.5 582531815 583253365 583807602 578500824 576332817 576441994 577621078 579334373 581541100 582492943
1513.1 582492943 582361259 581434517 579957657 580580673 580261154 580235367 578681717 571318321 575144348
1521.8 575144348 581936264 581722412 581346512 580630302 580156212 581223793 582338753 583061600 584812279
1530.5 584812279 585070343 583225403 581388893 578725281 579678993 581301041 581028137 580457687 583816109
1539.2 583816109 584769325 583645668 581029053 578077049 579596252 579134369 578696747 580314941 581429176
1547.9 581429176 582593231 582242126 581339951 582539825 582445297 582200737 582101555 580300560 579484787
1556.5 579484787 575721970 571469231 587507820 581270523 581171722 582536201 583064232 582368774 580732040
1565.2 580732040 581386604 582391014 583598404 585867805 583024063 580731964 581035614 580890884 580545502
1573.9 580545502 581832886 583898315 580676765 580386047 581710892 582221451 581605721 580898476 580084343
1582.6 580084343 579594078 580394478 581234779 581767044 581794586 582109451 582025108 580194855 579004974 578650551
1592.2 578650551 579306145 580422363 581045380 581225166 579665489 577707100 576768417 576762276 576672630 576483574
1601.9 576483574 576485252 576233025 576332397 576269150 576251221 576106071 574504471 571207962 571352196 574044991
1611.5 574044991 573954620 572800522 572057076 572649841 572321167 567546616 569256516 569682884 570342026
1620.2 570342026 570720978 569402618 568373871 568865623 570107956 570157166 569353256 567374306 566452827
1628.9 566452827 567545738 568528137 568557625 567689514 567856750 569688034 568422203 565500946 567379951
1637.5 567379951 568295670 568481293 570165215 570878830 571272430 571563187 570689812 570561066 570168571
1646.2 570168571 570433121 571617279 571018639 572048950 574180946 575986176 576200294 572732620 574060402
1654.9 574060402 574729118 575453873 576109123 575826759 575743790 576903572 577118874 576070366 577450676
1663.6 577450676 578156204 578240623 578234482 578766365 581413841 581401367 579071503 579941940 579938850 579895973
1673.2 579895973 581142731 581473312 580121346 581799850 583294373 583972893 584431648 583495407 582349167
1681.9 582349167 581111221 575670967 575023308 582062569 583665962 584152794 584201889 583861580 583848534
1690.6 583848534 583866348 583929863 583950043 584338455 585229149 582811012 582479210 584222183 585988617 582892647
1700.2 582892647 579348755 582254791 583507347 583732605 583814163 584120636 585574455 586299019 585477409
1708.9 585477409 584817657 584467850 584677811 585822563 586833191 586372833 584523697 585501823 587145882
1717.6 587145882 584682465 585175171 586075974 586957436 587492447 587023468 585978851 586063652 587462845
1726.3 587462845 588303719 587308083 585100060 583228645 584120903 585776711 586896629 585243187 583479118
1734.9 583479118 585335999 586361465 585476036 585436707 587078209 586913643 587641144 588390388 588511353
1743.6 588511353 589364090 589782410 588492737 586899872 588152351 589432907 589319458 588376236 588081970
1752.3 588081970 589617157 589904518 588498268 587405968 586613197 586745148 587323723 587790756 588157654
1761 588157654 588009300 588536644 589412689 589583054 589228630 589043808 589228554 587476807 587737656 591221886
1770.6 591221886 593810692 592135391 589462471 588868599 589327278 589225159 589114799 589183083 590189972
1779.3 590189972 591255951 590062599 589279861 590084648 590788155 589707184 589339256 590092506 590674973
1788 590674973 591251984 590945053 590149231 589699478 589412231 589257126 589013863 589820900 590874748 591205597
1797.6 591205597 591933899 592012444 590745544 590351677 590161400 588909760 588824997 589956322 590951195
1806.3 590951195 592480087 592368355 591861267 591892700 589259644 588184090 588599739 589363174 590816689
1815 590816689 592112198 593883820 593772583 591713867 590493965 590113678 590006485 589565430 590329018
1823.7 590329018 591953850 592203369 591559143 591439323 591171379 589887543 588583908 588914795 590143967
1832.3 590143967 592220650 593152809 592650108 592193947 591842308 591553688 590907288 589858131 589591751
1841 589591751 589744797 590790558 592707520 592477341 591637001 592336960 593157158 591953354 591184616
1849.7 591184616 591160316 591996460 593424377 592942429 592761078 592823982 591957932 591898727 591828003 590975494
1859.3 590975494 591185532 592152176 591569099 592059212 592635307 591461182 591411819 591487579 590513649 588196182
1869 588196182 589298172 592647438 593693199 594064789 593790741 592466354 591212997 590607643 590847740
1877.7 590847740 592003899 592341537 591870842 592650833 592354774 591894150 591801796 590703850 590296211
1886.3 590296211 590227814 591771851 594470711 595522156 594393730 592242088 591013031 590833778 591246643
1895 591246643 591493263 591827431 592909126 593104782 592624969 592606163 592641106 591911278 591626358 592000313
1904.7 592000313 591967087 591744537 592358894 593938828 594016075 593278580 592774239 591689758 590909805 591204147
1914.3 591204147 592032204 592603607 593948097 594724541 593428764 592712784 591870956 591338577 590278702
1923 590278702 589377365 590530930 592554626 593974953 594084663 593709679 593176422 593054695 592745285
1931.7 592745285 591371803 591205406 592121658 592939377 593332253 592428894 592165413 592657471 591775742
1940.3 591775742 591192207 592122269 592658005 592077217 592166557 593251076 593402214 592568703 591696701 591304817
1950 591304817 591101875 591021614 592127037 593220825 593725586 593901405 593649216 593095703 591713638 590530167
1959.6 590530167 591137199 593243332 593679581 592724800 592924614 592911301 592807770 592865715 592283325 591651344
1969.3 591651344 591590996 592399292 593223610 593347168 592372551 592235947 592715225 592322960 592141075 592035332
1978.9 592035332 593129730 594236298 594183502 593841667 592688522 592135239 591739960 591358185 591201096
1987.6 591201096 590610275 591048660 592242775 593283310 593273888 592627602 591865959 591094475 591034622 591832962
1997.2 591832962 593298264 593552704 593523865 594036255 593898659 593071365 591647644 591452751 591894760
2005.9 591894760 592595787 593583107 593456841 593381996 593363953 593257790 592543755 591769905 591874542 591314507
2015.6 591314507 591107521 591639748 591695480 591602440 591997566 592575150 592496529 592084732 591467209 591706429
2025.2 591706429 592479858 592875175 593527679 593430023 592592964 591974258 592051620 592530327 592818794 592788048
2034.9 592788048 592323570 593025169 594264259 593964386 593309059 593052330 592565346 592194023 592438774
2043.5 592438774 592879906 592981567 592748871 592456818 592375946 592541580 592607880 592292519 591979485 592024078
2053.2 592024078 592515106 593157196 593540001 593957024 594295120 593693581 592679329 592409439 592485809 592615814
2062.8 592615814 592897072 593129959 593421249 593747520 593449898 592329865 591653023 591505127 591760483
2071.5 591760483 592881355 593569641 593575935 593464241 592918320 592243233 591757889 591668854 592496758 593532295
2081.1 593532295 593570824 593403053 593275032 592714043 592731743 592881393 592355576 592278519 592915115 593795815
2090.8 593795815 594872017 594923782 593974876 593837090 593198204 591847572 592222366 593247070 593718414
2099.5 593718414 593764458 593462639 593474007 592789497 592080421 592412529 592726746 592870140 593204613 594346352
2109.1 594346352 594145660 592713203 593051414 593114777 592927856 593582687 593022308 592257385 592844048 593225174
2118.7 593225174 593254166 594064445 594286156 594297867 594120674 592926178 592693748 593537827 594455643 594245377
2128.4 594245377 593754234 594011459 593136978 592652740 593421898 593342934 592935104 593552780 594410973 594540634
2138 594540634 593643456 592578087 593174171 593783798 593480034 594096489 595018234 594882545 594061432 593366966
2147.7 593366966 592911720 593176804 593274612 592832222 592962570 593506432 594333496 594566841 594680748 594752769
2157.3 594752769 594469452 595064125 594629555 593274918 593050499 593417358 593724518 593838234 594226036
2166 594226036 594269295 593525162 592948380 592946167 593293648 593906898 594601326 594854927 595181046 595374718
2175.6 595374718 594685097 593885040 593014069 592464790 593526726 594906082 594936981 594606247 594694710 594429245
2185.3 594429245 593983612 594358482 595075302 594972382 594470367 594681931 594734879 594299965 594519539 594749222
2194.9 594749222 594783325 594382782 593583450 593843117 594598312 595002899 594849472 594512100 594390869 594509239
2204.6 594509239 594762573 594069290 593670731 594472084 595206070 595513115 595577812 595785255 595574036 594721642
2214.2 594721642 594555855 595215149 594821014 593961334 594324303 595174789 595796204 595216064 594453888 594617882
2223.9 594617882 594785652 594776306 594269753 593939323 594052811 594897957 595545464 594595680 594344749 594759102
2233.5 594759102 595315170 596412621 596228409 595471764 595429649 595285072 594568329 594065056 594194756 594265137
2243.2 594265137 594725380 595314941 595134392 595115776 594997635 594687843 594638443 594206276 594003448 593905411
2252.8 593905411 594302902 595441895 595870132 596281929 596099434 594636421 594332504 595189285 595293961
2261.5 595293961 594691544 593991356 594206276 595375748 595622635 595067062 594432678 593962898 593875389 593892288
2271.1 593892288 594236183 594624214 595556755 596345978 595762329 595065498 594937019 594888496 594645424 594771805
2280.8 594771805 595216827 595586662 595526314 594909554 594498062 594626656 594815559 594364815 594491806 594800377
2290.4 594800377 594661484 594870224 594546623 594287682 593788071 593670883 594137535 593997917 594113731 593820305
2300 593820305 594282341 594560280 593512497 593047638 592787209 593341217 593371849 592322044 592441940 593444328
2309.7 593444328 593279991 592341805 592642059 592751312 592758942 592671509 592041321 592197762 592496643 592181892
2319.3 592181892 591123505 590997162 589934502 587081871 586699829 587594299 588066635 588604431 590298309
2328 590298309 590816154 588173599 588372955 591012573 590747643 589012070 587402153 586654549 587454605
2336.7 587454605 588790703 588540192 586616135 586382866 587065430 588403587 589139061 587404518 588178787
2345.4 588178787 589276199 589918137 591220169 590871086 589362450 588183861 588281136 587393456 587261467
2354.1 587261467 589333000 590214691 588080330 584631691 586106300 585362701 583776474 586140709 585495758
2362.7 585495758 584756737 585240860 587136765 588535843 588719635 588268585 588253517 589620552 589326553
2371.4 589326553 589920502 590492630 590487938 591324997 591787109 592288132 592421341 592627068 592838364 593436279
2381.1 593436279 594230385 594882126 596168251 596536140 596086693 595960960 595388298 594240074 594190598
2389.7 594190598 594974709 595033302 595301476 596434135 597283897 596214142 595363007 596194191 596680565
2398.4 596680565 596372871 595473557 595679092 596021423 595694275 596440697 596619835 596265831 595928383 594735947
2408.1 594735947 593863449 594355011 595193024 595718880 596411934 596752052 596718254 596438904 595720673 594955406
2417.7 594955406 595334282 596170845 595562935 595489922 596039352 595694275 595930176 596494484 596038094 594638443
2427.3 594638443 593878326 594860458 595924225 596037483 596119728 596286659 596489220 596581841 596345100 596106911
2437 596106911 596272507 597217598 596962166 595829430 596238136 596363411 595782471 595458336 595273705 595733795
2446.6 595733795 596141357 596162262 595997810 595795097 596024094 596186371 596244087 596378326 596374512 596684341
2456.3 596684341 596431389 595552597 595585365 596153679 596496887 596352768 596220055 596622925 596890373 596416016
2465.9 596416016 595672722 595144005 594755096 595492363 595928612 594942665 595134544 596507492 597080002
2474.6 597080002 596790047 596693802 596451645 596397781 596603813 596259804 596331902 596292534 596399078 596405602 595787048
2485.2 595787048 595846062 595680885 595518532 595678673 595951385 596546783 596568985 595745811 595095406 595904160
2494.8 595904160 596720276 596851273 596897583 596457062 596140213 596390457 596813583 596534500 595960426 595755234
2504.5 595755234 596333580 596887512 595816040 595174942 595661163 595667877 595648880 596025429 596092529 595527115
2514.1 595527115 594712448 594648132 595327415 595309486 595713692 596374626 596099548 596397171 596765022 596494942
2523.8 596494942 596109581 596151886 596592293 597262878 597252502 596062584 596393661 597273331 597171249 597076492
2533.4 597076492 596669846 596442604 595897179 595448074 595748062 596030426 595917130 595571175 595846329 595885162
2543.1 595885162 596122055 597133904 597288513 596772118 596771126 597309914 597018738 596158524 596148872 596150551 595480003
2553.7 595480003 595542526 596283455 595915451 595535660 596193352 596682739 596160355 595443153 596291847 596829414
2563.3 596829414 596038666 596215248 596495857 596350899 596311646 595792961 595959511 596263847 595668297 595864487
2573 595864487 596761551 597197800 596829872 596179276 596155663 596094475 596152763 596630287 596635246 596366806 596183853
2583.6 596183853 595887604 595697136 595631371 594762001 594190331 595295410 596453171 596719780 596133614
2592.2 596133614 595866508 596497688 596749039 596901054 596609459 595875969 595741119 595899849 596163483 596200180
2601.9 596200180 596135941 596497726 596597290 596134682 596337395 596787033 596509666 596613350 597049599 597184982
2611.5 597184982 597076263 596531143 595085793 594347878 595841675 596783180 596391068 595823097 596064415
2620.2 596064415 597218018 597129326 597085342 597229042 596238365 595472260 595012436 595074387 595839424 596542854
2629.9 596542854 596977654 597129364 596822548 596608009 596541290 596046524 595765152 595860481 596257286 596275177
2639.5 596275177 595627632 595283203 595647125 596093903 595543671 595566101 596346741 596485748 596226425 595527916
2649.1 595527916 595903893 596672821 595810318 594884262 594950943 594970474 594858551 595315971 595832596 596203194
2658.8 596203194 596493301 596377373 595913620 595312271 594872932 595260696 596355476 596824684 596787262 596534729
2668.4 596534729 596137199 595758820 595177269 594576950 594289818 595544167 596892281 597105751 597386208
2677.1 597386208 597220612 596970749 596772308 596015015 595373917 595590858 595582085 595519905 596756744 597461891
2686.8 597461891 596934891 595821075 595482101 595784798 595145645 595449295 596301003 596189156 595887642
2695.4 595887642 596175499 596301994 595393257 595413322 595994225 595543175 595368958 595770760 595845566 596346169
2705.1 596346169 596653900 595949669 595693512 595623131 595769348 595807076 595491714 595575943 595701714 595637169
2714.7 595637169 594382172 593793564 594309311 594558029 595468674 595851364 596176529 596271744 595590057 595501137
2724.4 595501137 595480690 595813522 595940094 595483780 595514526 595404625 595434608 596010170 595908318 595725098
2734 595725098 596064262 596161003 595677490 594891167 595138359 595389786 595435524 595891151 595228500 595003471
2743.7 595003471 595673828 595476265 594765015 595396614 596658363 596483841 596162262 595502472 594559250
2752.3 594559250 594525375 594983597 595236130 594869347 595106735 596024361 596783524 596482582 595576515 595008354
2762 595008354 594713287 595487556 595650253 595101547 595432777 595922623 595990829 595452309 595368614 595743828
2771.6 595743828 595398521 594901390 595410957 596284523 596917076 596889153 595697060 595172501 595216713 595217857
2781.3 595217857 595413017 595450897 595995216 596437302 596097984 595228996 595026436 595326729 595275803 595190239
2790.9 595190239 594660454 595084953 596190071 596092110 595289574 594911652 595421715 595829849 595121613 594090996
2800.5 594090996 594850655 595910759 595709915 595428963 595042572 595073967 594617195 594078484 594122353 593898392
2810.2 593898392 595003395 596103516 596076279 595945740 595373344 594583817 593663177 593545303 594048195
2818.9 594048195 594075165 594838638 595758400 595582085 595656395 595757484 594998970 594029732 593349419 593633537
2828.5 593633537 594608192 595656967 596215515 595507431 594572258 594392509 594444313 594071770 593449898 593261528
2838.2 593261528 593491173 593755150 594546776 595265617 594295311 593340149 593270378 592318153 591556015 592291145
2847.8 592291145 592932968 592425156 592193489 592204056 592176819 593227806 593578644 592908058 592467003 591749954
2857.4 591749954 592333946 593969612 593910027 592797890 592346039 592513618 592614975 592627525 593133621 593791046
2867.1 593791046 594037209 593900642 593454094 593003769 592885246 593329201 593427353 592524300 592263412 592734985
2876.7 592734985 592989273 593297882 593184853 592760544 592485886 592484360 592663651 592789841 592815285 591956635
2886.4 591956635 591757545 592595863 592168808 591842117 592549057 593571854 594473648 593982353 592624817
2895.1 592624817 592419243 593668747 593693962 592409592 591828384 591303062 591219978 591583862 592034798 592546043
2904.7 592546043 591713943 590958633 591912308 593402443 593663330 592565231 591890717 592088661 593107529
2913.4 593107529 593501358 592484474 591776543 590971718 591141281 591843605 590237503 589556160 590840988
2922.1 590840988 590060921 588283615 588168411 588824425 590346260 591578140 590929031 590702629 590570374
2930.7 590570374 589785767 589771996 589536476 589762077 591602478 592393951 591689987 591442108 590960503 590676765
2940.4 590676765 590992355 591149864 591547546 591406364 591654701 592311630 591899338 592120247 593113785 593210564
2950 593210564 592707825 592243690 591239815 590742226 591396713 592007828 592222404 591621475 591095390 590836449
2959.7 590836449 590388680 589928932 589702492 590015907 590030403 590671501 591701736 592281036 592432976 591716003
2969.3 591716003 591349106 591140099 591456604 591778946 591231308 591503143 592338867 592669067 592171898 592582817
2979 592582817 593158035 592325668 592474213 592984352 593053093 592968864 592532997 592462044 592183075 592205582 592868042
2989.6 592868042 592517166 591732597 592312241 592759361 592430916 593136253 593539505 592562599 591987114 592116165
2999.2 592116165 592433777 593180580 593019104 591841965 592028122 593066635 593348846 592946472 591953278
3007.9 591953278 590846558 590478058 591226120 591978416 591933708 592228394 592842484 592940559 592853432 592376328
3017.5 592376328 591769218 591549225 591100655 590912476 591760483 592760735 592781830 592208710 591843529 591693497
3027.2 591693497 591463737 591065483 590990868 591345558 591750412 592022629 592296829 592705574 592827034 592353516
3036.8 592353516 591948051 591872292 591683044 591916924 591868362 591430397 592098312 592500229 591335983 589737434
3046.5 589737434 589324112 590149994 591116333 591619682 592008324 592622337 592397881 592174835 592268372 591693802
3056.1 591693802 591312866 591050720 590962067 590874214 590747147 590654221 590720749 591428604 590965042 590252953
3065.7 590252953 590532684 589980087 589528618 589966927 589946251 589879227 590208206 590199394 590426903 590795212
3075.4 590795212 590688286 589959602 589396019 590036240 590326157 589939690 589972916 590383720 589778404 588363266
3085 588363266 588144913 588536301 589600296 590453148 590528717 590812225 590190201 589972649 589939690 589056282
3094.7 589056282 589158859 589550743 589326134 588873672 588623314 588699112 588319740 588036346 588183937 588283348
3104.3 588283348 588565788 588202248 587824249 588486061 588707085 588969879 589333687 589023018 588880997 588502693
3114 588502693 588316002 588875542 588571243 587567024 587645912 588280602 588384285 588080330 587667427 587501297
3123.6 587501297 587069626 586685753 586843452 586826859 586537666 586395416 585893669 584972839 584578819 584423103
3133.3 584423103 585498161 587561874 587349854 585557060 585163116 585674591 585973511 586336021 586258392
3141.9 586258392 586842194 587597618 586800461 586313477 585480614 584177322 583739281 583880005 584583092
3150.6 584583092 584800949 585165405 585526161 584336739 583303528 584090805 584287605 583526001 584224472
3159.3 584224472 584559212 584021912 583804970 583912010 584345512 583977966 582933159 582029266 581694870
3168 581694870 581790733 582730827 583868294 584554977 584748383 583405800 582205162 581231537 581065407 581788445
3177.6 581788445 581576080 581475563 580869904 580810051 580765419 580485153 581254768 580764618 580301933 579964180
3187.3 579964180 579720535 579335022 578137093 579282875 580415573 579799118 579392815 579327202 579538498
3195.9 579538498 579308929 578734512 578365707 578974876 579734192 579001274 578221931 578697014 578648949 577344933
3205.6 577344933 576661148 576522102 576701202 577363930 577129478 576445427 576282997 576792564 577194519 576358719
3215.2 576358719 576216507 577029381 576580772 575774651 575004578 573739586 573590164 574197273 573974876
3223.9 573974876 574364777 575580864 575280342 574601135 574558716 574002800 573626328 573706245 573915291 573762817
3233.5 573762817 573383789 573910904 574878120 574433022 572744904 572093506 572311897 572667656 573069420
3242.2 573069420 572546616 571693611 571408463 571353912 571177788 570632515 569666862 569864426 571301994 571599274
3251.9 571599274 570401497 569380913 569944992 570189896 568972549 568348618 568645897 569141464 569621086
3260.5 569621086 570004463 569902687 568674164 566929588 566844635 567954102 568501015 569416161 569725151
3269.2 569725151 568787766 567664299 567174149 567608147 567296753 566732140 566708374 566705894 566464806 566269188
3278.9 566269188 567060051 567671700 566934242 565993919 566253242 565949326 565062790 565486031 565349197 565546761
3288.5 565546761 566453896 565669785 565174179 566173553 566109734 564887505 564283905 564190483 564310684 563745613
3298.2 563745613 563190117 563731346 563855019 563551559 562254066 560541039 560586395 561424713 562050819
3306.8 562050819 562457390 562604218 562440338 561539764 559969101 559603729 560084534 559242783 558557320
3315.5 558557320 558313293 557787361 558048477 558685646 558641548 558223381 558419266 558727074 558097992 556960335
3325.2 556960335 556021767 555219650 555082130 555352364 554643173 554019661 553731117 553787422 555171776 555310249
3334.8 555310249 553484764 552255630 552407417 552675323 551949883 551921997 552640076 552364464 551657867
3343.5 551657867 550770264 550381317 550489235 549440117 548121185 548373833 549076042 548338242 547540207
3352.2 547540207 547856445 548293648 547613792 545634117 544775810 544414749 543371735 543535652 544115448
3360.8 544115448 544224586 543881645 543303757 543331680 543336143 542950172 542204971 541557503 541920013 541842194
3370.5 541842194 539672012 537420998 536607895 536747284 537253304 536638107 536003342 536057968 536290588
3379.2 536290588 537486610 537285576 536060448 536303864 536321793 535451202 534711304 534577408 534198761
3387.8 534198761 533413506 533933907 534376793 533332863 532463760 532205429 532435493 532928886 532869911 531657715
3397.5 531657715 530021439 530514374 531288567 529884377 529415855 529979630 529999504 530054703 529632263 529221001
3407.1 529221001 528679276 528482170 529221115 528456268 527535362 527786942 527358398 527199860 527441292 527501488
3416.8 527501488 527644577 527525444 526867447 525629845 525206947 526088371 526388969 524684105 523854904
3425.5 523854904 525344048 525660477 524976273 525317383 525936356 525726471 525430717 525559959 525613785 525807457
3435.1 525807457 524787331 523689003 523953514 524403648 524795380 524832611 524979935 524528008 524100990
3443.8 524100990 524253654 524029007 523975677 522964211 522598000 523106346 523269196 524245911 524940910 524838791
3453.4 524838791 524671402 524631615 524751015 525254593 525878143 525813751 525354691 525238838 525781555 525555000
3463.1 525555000 525481796 526620903 527422638 527481422 526745758 526421318 526348228 526733894 527586060 526788597
3472.7 526788597 526292305 526570015 526004791 526385536 528411255 529744568 529552994 529659653 529457207
3481.4 529457207 528279762 528130684 529234276 529314537 528485603 529255486 530191956 530438766 531448288
3490.1 531448288 531797943 530965462 530440140 530364304 530436707 530761070 531065483 531074333 531410828 532327423
3499.7 532327423 532192459 532121010 533479347 533848495 533895836 533703384 533442955 534282074 534903641 535180817
3509.4 535180817 534149857 533383484 534386024 535236359 536156197 536702766 536111832 535636368 535906982
3518 535906982 536047134 535851097 536376762 536914406 537126846 537275848 537537537 538164024 538530388 539607430
3527.7 539607430 540510559 540027885 540050125 540427551 540917854 541351280 542048950 543653030 543310776 541640015
3537.3 541640015 542112045 543329544 543875351 543417664 543048592 543678856 545044823 545424423 544153214
3546 544153214 544453888 545146408 544676476 544994011 546458092 546708755 544508591 543970222 545169296
3554.7 545169296 547085686 548855095 549187584 548834229 548957710 550328751 550878525 550799332 549944839
3563.4 549944839 549126778 551774330 552599373 551126060 551415215 550649529 551280251 551845207 553092499
3572 553092499 554329605 554875183 555128593 554232216 554005814 554165916 555660896 556869354 556240387
3580.7 556240387 556696815 557665482 558402748 557949142 558489914 560015526 558922691 557314148 557192764
3589.4 557192764 559483490 560677795 561562424 561709328 560089912 560501862 559742470 560894394 563683624
3598.1 563683624 564614639 565138893 564079323 563765640 564715881 565234222 566120987 567789307 568012123
3606.8 568012123 564731636 564683952 564771271 564431419 566926193 568307610 569128914 571364517 569870872
3615.4 569870872 569274597 571074982 571231842 570942535 569524193 569311867 571193581 571769562 571867142
3624.1 571867142 572579422 572950172 573413391 575703049 573574600 568429260 571955185 573401833 574240189
3632.8 574240189 574027977 573964272 575821877 576989937 577656517 576123199 575274239 576177673 576578178
3641.5 576578178 576450005 576152725 577727661 579220314 580662384 581765099 579480934 579551697 579997330
3650.1 579997330 579837952 578252831 579783211 582133942 582650566 581989632 577283478 578258018 580888252
3658.8 580888252 581601944 582238998 581982841 582130470 582132988 581972122 582081261 581874695 583475075 583557091
3668.5 583557091 581480293 581972084 579556541 580994835 584289436 586398735 584546089 576127052
3676.2 576127052 577794266 581488724 583002014 581423073 581525269 582774200 583341026 583947639 583693428
3684.9 583693428 582998619 584286652 587819672 585870667 583606491 586239204 582761841 582846260 584469719
3693.5 584469719 583612289 583928413 583735313 583913765 584178505 584077492 584563522 585719757 587077446
3702.2 587077446 585162849 585152702 585719719 585587006 585721245 586674156 588613739 584586143 585115585
3710.9 585115585 587297630 580938606 583016434 585336800 585597343 585880089 586994972 587309227 584870491
3719.6 584870491 584118347 586167908 587704239 585800285 586217537 586623840 585205688 583405724 583636017
3728.3 583636017 584956245 584740562 586253853 585309296 583085213 586317482 587042732 585738602 584952965
3736.9 584952965 586628571 586693764 585971222 586812553 584029961 585288620 590757256 584261856 578505363
3745.6 578505363 582915115 585477524 588719826 589503632 584076767 586144371 584065971 582223320
3753.3 582223320 585619164 587554092 588081589 585358391 585727234 588542519 585341072 583499565 585566750
3762 585566750 586428452 586561165 588269844 586767502 584907951 585799713 586661072 587682343 584231224
3770.7 584231224 584943504 586345100 584484177 584632492 585534401 585539207 585841942 588547592 590237503
3779.4 590237503 585874138 586722260 587778091 587062302 588240623 587318459 585934906 586552582 587467537
3788 587467537 587291451 586107101 586303940 586441307 586409760 586338501 585965500 586872635 586145554 585013962
3797.7 585013962 584772987 584755974 588404312 589984932 585501862 585532036 585702324 587784462 590034561
3806.4 590034561 585222855 583149719 585352783 586110764 584758034 584216499 585074272 586426582 589236183
3815.1 589236183 588791237 582629013 584487953 585959511 586783104 588402443 580486679 581276550 585392151
3823.7 585392151 586915054 587556725 587539902 585794220 585010910 585533180 586794968 587977219 586225624
3832.4 586225624 585846786 587554054 585435638 584851112 588435326 583600769 581686211 585949783 583473358
3841.1 583473358 583797226 587287483 585945778 582990112 584279213 585362167 584780312 585541267 585656281
3849.8 585656281 585918884 585873032 581881218 586090202 581465645 582417793 586876907 586031227 585527916
3858.4 585527916 585694504 585429459 586706886 584425697 583768654 587887421 586657219 583594627 585582657
3867.1 585582657 587790947 589949722 583815460 578378258 581520386 585615807 589536896 586056442
3874.8 586056442 584016266 584582062 585380859 586977386 589082222 588342171 582977982 584542961 586455650
3883.5 586455650 587286453 588430252 581074524 581510353 583600616 584931602 587464752 586156158 583381577
3892.2 583381577 583995399 585218925 585127678 585624504 585554962 585267258 586055031 582443924 586064110
3900.9 586064110 589349937 584541283 584209175 582190933 582915001 584662819 585061646 585878181 585434685
3909.6 585434685 585414658 585198631 585325432 585052605 583964844 584417076 585227737 584921455 583824768
3918.2 583824768 584896126 585635262 584320450 584686012 585357628 585766678 584095345 582594299 583900490
3926.9 583900490 584677734 584619522 583955879 584727669 587236023 587321091 585369034 584553871 584577942 584460907
3936.6 584460907 584882698 585730057 586006622 586089668 586510201 587123528 586502571 585904846 584631958 583880920
3946.2 583880920 584140205 582942276 584623375 585295677 583888550 585623283 586227570 586394234 586986275
3954.9 586986275 586482315 584912796 584159889 585917816 585457382 585171852 586468353 585058556 584120445
3963.6 584120445 584849548 585577393 586110001 586174202 585019951 584029884 584295349 584507561 584562645 584147758
3973.2 584147758 584077759 584819717 585360451 584837341 583919258 583687134 583766594 584744186 585943375 586748581
3982.8 586748581 586761818 585019722 583558807 584016228 585397682 585338554 584240723 584387360 585228615
3991.5 585228615 585621033 585482979 585824738 585848618 584326668 583344154 583754845 584939003 585788803
4000.2 585788803
##END=$$ End of the data block
