##TITLE=Fibra Torta - Bianca $$ Begin of the data block
##JCAMP-DX=5.00 $$ ACD/SpecManager v 10.08
##SPECTROMETER/DATA SYSTEM=Alpha
##DATE=24 Oct 2013 13:19:44
##DATA TYPE=INFRARED SPECTRUM
##DATA CLASS=XYDATA
##ORIGIN=
##OWNER=
##NPOINTS=1765
##FIRSTX=399.75695801
##LASTX=3997.56933594
##MAXX=3997.56933594
##MINX=399.75695801
##MAXY=0.81960684
##MINY=0.31851488
##XFACTOR=1.0000000000
##YFACTOR=1.000000000000000e-9
##FIRSTY=0.60573572
##DELTAX=2.03957629
##XUNITS=1/CM
##YUNITS=ARBITRARY UNITS
##XYDATA=(X++(Y..Y))
399.8F05735719m041850m361153l401279p85470J645028J869738N09680m4883M11570
418.1E97537100l43740k362191l508032l096997j692951j231134k423048l224909j948417
436.5E77705681M55916K188921K621055K530634K916336L312707K585948P18117o14465
454.8E94420850m15623n8055p90834k222181l142058k611220j644135k087176l460169
473.2E77989399l398239j750708m32491m65870j157463j091837P1883O44445m82678
491.5E69926441j990974k126396j048863m93646j406252k816379l152370k491594k318978
509.9E52080989l219426m178643m119456l200829k580285k701819k752066j928031
526.2E27400434k26855J018703J080751J327276K831757M700005N365551M210413K235531
$$ plain form
399.8 605735719 601693869 597332716 593931437 593145967 594790995 596660733 597170413 597125530 597537100
418.1 597537100 597193360 594831169 591323137 588226140 586533189 585302055 582879007 579654098 577705681
436.5 577705681 578161597 580350518 582971573 585502207 588418543 591731250 594317198 595035315 594420850
454.8 594420850 594005227 593947172 593156338 590934157 587792099 585180879 583536744 581449568 577989399
473.2 577989399 574591160 572840452 572407961 571942091 570784628 569692791 569764674 570409119 569926441
491.5 569926441 567935467 565809071 564760208 564266562 562860310 560043931 556891561 554399967 552080989
509.9 552080989 548861563 544682920 540563464 537362635 534782350 532080531 529328465 527400434
526.2 527400434 527173579 528192282 529273033 530600309 533432066 538132071 543497622 547708035 549943566
544.6E49943566J014650O45578j10328j635909k904713l076196k848148l333509m502356
562.9E33192635n529821n774141n235910m534006l616810j717329R15646L333033M874587
581.3E15907884N432188N449176N336344M783809L286303J303374L4571j04547K21014
599.6E41650116J06514n89967q40366j8894J001894J328170J284659J550317K430081
618E47902524L525138L870845L428698L104150L143907L074109K604842J732827J150727
636.3E73537767J414001J881778J646757R04441O07729J041949J589775J419246O34134
654.7E84677577K79486O51777R63032P22885L94762O69837J469135J581133J496791
673.1E92906415J441777J482725J945198K286375J899361J059532O77467Q20577O75261
$$ plain form
544.6 549943566 550958216 551603794 551493466 549857557 546952844 543876648 541028500 537694991 533192635
562.9 533192635 527662814 521888673 516652763 512118757 508501947 506784618 507700264 511033297 515907884
581.3 515907884 521340072 526789248 532125592 536909401 540195704 541499078 541533649 541429102 541650116
599.6 541650116 541756630 541166663 540326297 540307403 541309297 542637467 543922126 545472443 547902524
618 547902524 551427662 555298507 558727205 561831355 564975262 568049371 570654213 572387040 573537767
636.3 573537767 574951768 576833546 578480303 579384744 579992473 581034422 582624197 584043443 584677577
654.7 584677577 584957063 585608840 586571872 587294757 587689519 588359356 589828491 591409624 592906415
673.1 592906415 594348192 595830917 597776115 600062490 601961851 603021383 603698850 604519427 605194688
691.4F05194688j21355j184821j915634k058089k044737k301514k342046j392185K41399
709.8E92075706J653075K527356L171861L986001M977763N554735N398572M992843
726.1F24337912M750132M625082M221261L324330K326846J742303J417041P00056m96804
744.4F46948159j807928k840937l340244l568828l969729m336715m091262l102303
760.8F19890213j863182p63773N40494K393842M467070O038666O780922O910265O784975
779.1F51179492O642640O226242N355417M483223M002095L874004L854632L643572
795.4F89261317L499210L799677M063487L756821L030658K278030J918912K014816
811.7G13622928J913190J262903N06043J07885k4856l79920j317381k536893l323376
$$ plain form
691.4 605194688 605073333 603888512 601972878 599914789 597870052 595568538 593226492 591834307 592075706
709.8 592075706 593728781 596256137 599427998 603413999 608391762 613946497 619345069 624337912
726.1 624337912 629088044 633713126 637934387 641258717 643585563 645327866 646744907 647444963 646948159
744.4 646948159 645140231 642299294 638959050 635390222 631420493 627083778 622992516 619890213
760.8 619890213 618027031 617263258 617803752 620197594 624664664 630703330 637484252 644394517 651179492
779.1 651179492 657822132 664048374 669403791 673887014 677889109 681763113 685617745 689261317
795.4 689261317 692760527 696560204 700623691 704380512 707411170 709689200 711608112 713622928
811.7 713622928 715536118 716799021 717305064 717412949 717388093 717008173 715690792 713153899 709830523
830.1G09830523l509224l620684m014194m313707m063547l436148k988279k936125
846.4F80948615l046095l028095k904594l012717l439963l427326j738370J730621
862.7F62082076N388975P621050Q409262Q542001Q048415O503284M017711J308918
879.1G11921692r53615k682388m118323n296469n961775n806447m964292m092156l672720
897.4F74373507l621459l667771l785551m286706n390883o685376p673800q268118
913.7F30993843q478761q248925p371783n684376l570020j805425p67231j17659O49035
932.1E95598698J626730K552867L197550L562630L497600K357006k89857l940821p546961
950.4F00615442j0278702j1972129j3038338j4000117j5057206j6015471j6719579
$$ plain form
830.1 709830523 706321299 702700615 698686421 694372714 690309167 686873019 683884740 680948615
846.4 680948615 677902520 674874425 671969831 668957114 665517151 662089825 660351455 662082076
862.7 662082076 667471051 675092101 683501363 692043364 700091779 706595063 710612774 711921692
879.1 711921692 710968077 708285689 704167366 698870897 692909122 687102675 682138383 678046227 674373507
897.4 674373507 670752048 667084277 663298726 659012020 653621137 646935761 639261961 630993843
913.7 630993843 622515082 614266157 606894374 601209998 597639978 595834553 595067322 594949663 595598698
932.1 595598698 597225428 599778295 602975845 606538475 610036075 612393081 612103224 608162403 600615442
950.4 600615442 590336740 578364611 565326273 551326156 536268950 520253479 503533900
964.7E03533900j7343313j8069207j8776864j9190252j9146591j8561960j7343044
979C75102669j5458047j3008565j0199934p319123m749983k731711j261711k47717
995.3C20125878M11898P61449P47979M06861p3552n37098r02771j071007r22024m32729
1015.7C18514884L14444J118958J786113K284586K701908L032238L140121K973259
1032C35866511K553940J989990J460165J062989Q17746P34449Q22395J213252K032817
1050.4C48554254L198981M519552N757183O851285P986188R102166R457111P810623
1066.7D03237343L269642l139853q261621r528160p333249l899395q63910J311302
1083C74792099K788067L834814M629522N231262N507379N277127M458279L157466J825542
$$ plain form
964.7 503533900 486190587 468121380 449344516 430154264 411007673 392445713 375102669
979 375102669 359644622 346636057 336436123 329117000 324367017 321635306 320373595 320125878
995.3 320125878 320537776 321299225 322047204 322454065 322380513 321843415 320940644 319869637 318947613 318514884
1015.7 318514884 318829328 319948286 321734399 324018985 326720893 329753131 332893252 335866511
1032 335866511 338420451 340410441 341870606 342933595 343751341 344485790 345308185 346521437 348554254
1050.4 348554254 351753235 356272787 362029970 368881255 376867443 385969609 395426720 403237343
1066.7 403237343 406506985 403367132 395105511 385577351 378244102 374344707 373480797 374792099
1083 374792099 377580166 381414980 386044502 391275764 396783143 402060270 406518549 409676015 411501557
1101.4D11501557J030951J012952J691997K738565L696739M264474M370511M054725
1117.7D34362471L448427K839327K552032K800793L546297M414022M705638L839493
1134D62508500J805693r67890l821940o088257p351249p587135p094443o197303n051553
1152.4D20154423l729642k312422r01818N28485K174973M146010O333649Q464694J0301351
1170.7D45159703J1718840J2701839J3290942J3509244J3373673J2862563J1983394
1185E34600198J0816098R369254P559716N527675L699363K424121J707613J348972
1201.3E77053010J241923J477182K114534K905309L474295L688455L628492L333927
1217.6E98917127K754509J816213O21736m54604j111329j400948j575887j738012j729548
$$ plain form
1101.4 411501557 412532508 413545460 415237457 417976022 421672761 425937235 430307746 434362471
1117.7 434362471 437810898 440650225 443202257 446003050 449549347 453963369 458669007 462508500
1134 462508500 464314193 463346303 459524363 453436106 446084857 438497722 431403279 425205976 420154423
1152.4 420154423 416424781 414112359 413210541 413739026 415913999 420060009 426393658 434858352 445159703
1170.7 445159703 456878543 469580382 482871324 496380568 509754241 522616804 534600198
1185 534600198 545416296 554785550 562345266 567872941 571572304 573996425 575704038 577053010
1201.3 577053010 578294933 579772115 581886649 584791958 588266253 591954708 595583200 598917127
1217.6 598917127 601671636 603487849 604109585 603654981 602543652 601142704 599566817 597828805 596099257
1236E96099257j410305r15885m71532o6162M56751J099050J665890J936495J863778
1254.3F00257337J653314J544535J560449J580418J610160J814901K193869K454876
1270.6F14669859K281011J634776Q68321L63528J35362p450j93656l96251m96388n38289
1291F18320823p77066j286924j786470j962841j852631j783312j957059k213239k220333
1309.4F02480948j983166j803875j748502j650393j430631j326978j741350k697408
1325.7E88098645l692984m150331l929019l343583k678155j907349r87113j13129M31180
1344.1E67728162N06222J88828k00749m16636o16074r62317j266777j347840j285792
1362.4E62327027j166641j067758r27389m18543M23252J102924J276851J246989J378715
$$ plain form
1236 596099257 594688952 593773067 593301535 593235373 593692124 594791174 596457064 598393559 600257337
1254.3 600257337 601910651 603455186 605015635 606596053 608206213 610021114 612214983 614669859
1270.6 614669859 616950870 618585646 619453967 619817495 619952857 619945407 619751751 619355500 618859112 618320823
1291 618320823 617543757 616256833 614470363 612507522 610654891 608871579 606914520 604701281 602480948
1309.4 602480948 600497782 598693907 596945405 595295012 593864381 592537403 590796053 588098645
1325.7 588098645 584405661 580255330 576326311 572982728 570304573 568397224 567410111 567296982 567728162
1344.1 567728162 568234384 568423212 568222463 567805827 567189753 566227436 564960659 563612819 562327027
1362.4 562327027 561160386 560092628 559165239 558746696 559169948 560272872 561549723 562796712 564175427
1380.8E64175427J888514K892315M001856M175842L380060K601623J734376N88179
1397.1E85438192l93868q70823r57907j171529j572728j884222j960457j720368j354576
1415.5E73551714j274049j447260j089871l27587K11894M65691N79715P94113J232564
1433.8E72696924J693130J655280J290322J363933J542806J370430O79553j78695n86331
1452.2E81527352n55515o71267r93371m73798O24120K034128L364504M251539N617321
1470.5E94725013P833898Q617341P807315P065892O547511O289661O048977N950153
1486.8F50885761N747080M952907L942728L842175M153729L510236K612412K356887
1503.2F82003915K985835L600121K460062J647532J831949K345681K724231K550065
$$ plain form
1380.8 564175427 566063941 568956256 572958112 577133954 580514014 583115637 584850013 585438192
1397.1 585438192 585044324 584173501 583215594 582044065 580471337 578587115 576626658 574906290 573551714
1415.5 573551714 572277665 570830405 569740534 569412947 569624841 570090532 570670247 571464360 572696924
1433.8 572696924 574390054 576045334 577335656 578699589 580242395 581612825 582292378 582113683 581527352
1452.2 581527352 580971837 580300570 579307199 578833401 579457521 581491649 584856153 589107692 594725013
1470.5 594725013 602558911 611176252 618983567 626049459 632596970 638886631 644935608 650885761
1486.8 650885761 656632841 661585748 665528476 669370651 673524380 677034616 679647028 682003915
1503.2 682003915 684989750 688589871 691049933 692697465 694529414 696875095 699599326 702149391
1519.5G02149391K222300J806915J692235J834512J631140J437247J340986J300811
1535.8G15415537J645148J970709J105248M60089O96599J014233J072585Q41797P48396
1554.1G24970341J010954J349330N09799m38571m03643r9063N3823l45886q69691j110256
1574.5G24627137j478553j664936j746595k226889k657593k773761k784968l009438
1590.9G06284404l393829l695965l676057l458142l505111l855288m079878l943205
1607.2F76676929l775001l771722l797114m149198m641772l717720k937496l373265
1623.5F46513641l536165l127575k629459j926899j556635j914322j710951p21336
1639.8F29390299N3048N61774R78470J288712J540661K445996L186524K340555K336323
$$ plain form
1519.5 702149391 704371691 706178606 707870841 709705353 711336493 712773740 714114726 715415537
1535.8 715415537 717060685 719031394 720136642 720596731 721293330 722307563 723380148 724221945 724970341
1554.1 724970341 725981295 727330625 727840424 727401853 726998210 726899147 726952970 726607084 725737393 724627137
1574.5 724627137 723148584 721483648 719737053 717510164 714852571 712078810 709293842 706284404
1590.9 706284404 702890575 699194610 695518553 692060411 688555300 684700012 680620134 676676929
1607.2 676676929 672901928 669130206 665333092 661183894 656542122 652824402 649886906 646513641
1623.5 646513641 642977476 639849901 637220442 635293543 633736908 631822586 630111635 629390299
1639.8 629390299 629443347 630005121 630983591 632272303 633812964 636258960 639445484 641786039 644122362
1658.2F44122362L178477L928006L961861L600598M096090M781723M439772M411816
1674.5F76520705M465223M017591M055083M702151N258202M081369L284275L563047
1690.8G09947646L524005L649116L469169K920389K822876K112687J570701J303256
1707.1G31319845R00030Q33690R14931Q23737L89039j57416j23024J42813J85192O0915
1727.5G35289752M2558K15411M73917L94881L02076O00696J017213J421749J773059
1745.9G41531312K030015K257705K376020K381802K615928K794862K786577K987564
1762.2G61761785K894043K701343K681732K565145K436579K005636J535475J425565
1778.5G80007303J364350J192391J102746J055359R74119R81927R90987P96079O88732
$$ plain form
1658.2 644122362 647300839 651228845 655190706 658791304 662887394 667669117 672108889 676520705
1674.5 676520705 680985928 685003519 689058602 693760753 699018955 703100324 706384599 709947646
1690.8 709947646 713471651 717120767 720589936 723510325 726333201 728445888 730016589 731319845
1707.1 731319845 732219875 733053565 733968496 734792233 735181272 735023856 734900832 735043645 735228837 735289752
1727.5 735289752 735332310 735547721 736021638 736416519 736718595 737319291 738336504 739758253 741531312
1745.9 741531312 743561327 745819032 748195052 750576854 753192782 755987644 758774221 761761785
1762.2 761761785 764655828 767357171 770038903 772604048 775040627 777046263 778581738 780007303
1778.5 780007303 781371653 782564044 783666790 784722149 785696268 786678195 787669182 788465261 789153993
1796.9G89153993P35998P24554O41168O15239O69837O99639O36518N17726M97520N30600
1817.2G95422792N37754N38528N44428N14806M80413N06461M19080L06785L05772L17573
1837.6G99894392L20375L62635L73304K04802O4551J31369K19822K05219J54137J33038
1858H02063644J72675K34425K60472K31862J66714R7752J17838K00570K08139J67311
1878.4H03921402J66594K47241L10540K35498J31249J44482K36749K64943J55687L1949
1898.8H05846334M9233J31845J46449Q4043n186k5928Q6069J86265J34646j132l4094
1921.3H06598544Q6963J67489J04308k563j5556P4625J31368R0838J3947J5676R6977
1943.7H07362616J53065J02162r417j0431J25944K17081J55925M0233j311Q1182J68740
$$ plain form
1796.9 789153993 789889991 790614545 791255713 791870952 792540789 793240428 793876946 794394672 794892192 795422792
1817.2 795422792 795960546 796499074 797043502 797558308 798038721 798545182 798964262 799271047 799576819 799894392
1837.6 799894392 800214767 800577402 800950706 801155508 801220059 801351428 801571250 801776469 801930606 802063644
1858 802063644 802236319 802470744 802731216 802963078 803129792 803227544 803345382 803545952 803754091 803921402
1878.4 803921402 804087996 804335237 804645777 804881275 805012524 805157006 805393755 805658698 805814385 805846334
1898.8 805846334 805895567 806027412 806173861 806257904 806252718 806226790 806312859 806499124 806633770 806632638 806598544
1921.3 806598544 806685507 806852996 806957304 806954741 806939185 807013810 807145178 807236016 807249963 807265639 807362616
1943.7 807362616 807515681 807617843 807608426 807597995 807723939 807941020 808096945 808137178 808135867 808217049 808385789
1966.1H08385789J20461K0564J0431P1883J06096O5387j7763m5538K9028R6381L4332
1988.6H08877051p8082j04964m4167J6034p153r9599j57655j24931q6963j38462k54154
2011H07796955l13222k50638j86801k43544l50774l92794l46482k81811l10838l91781
2031.4H04728270m05848l40939k69175k58922k99275l15845k55227j65880j21117j34289
2051.8H02161753j35481o4373J1265P272l4094m0054J073O0796M8101k8550l7909K0623
2076.3H01970422M6313L1352J4424J9610O3062Q6665N9247J3471J2040Q6427J31368
2098.7H02534401Q5712L7551N2213J09613J36078P8320O438O973N3883L9637k6941
2121.1H03113878m2260p510L8147M7028j6511q4817n7340K7061N8174J7524m4525l9220
$$ plain form
1966.1 808385789 808506250 808526814 808537245 808609128 808715224 808780611 808762848 808717310 808746338 808842719 808877051
1988.6 808877051 808798969 808694005 808649838 808665872 808658719 808559120 808401465 808276534 808189571 808051109 807796955
2011 807796955 807483733 807233095 807046294 806802750 806451976 806059182 805712700 805430889 805120051 804728270
2031.4 804728270 804322422 803981483 803712308 803453386 803154111 802838266 802583039 802417159 802296042 802161753
2051.8 802161753 802026272 801961899 801973164 801980436 801946342 801906288 801907361 801968157 802016258 801987708 801949799 801970422
2076.3 801970422 802016735 802048087 802062511 802082121 802145183 802231848 802291095 802304566 802316606 802403033 802534401
2098.7 802534401 802620113 802657664 802709877 802819490 802955568 803033888 803040326 803047299 803101182 803140819 803113878
2121.1 803113878 803071618 803064108 803102255 803149283 803132772 803047955 802990615 803017676 803075850 803093374 803048849 803009629
2145.6H03009629O4910J40011R3877J2637J8239J39832K46823K02417J13249J65641
2166H04207265L31819M23789L56019K46644K61784L94106M66942L54886K17379K71439
2186.4H07532072M21107M45783L31581K28703K36153L29137L78609K93612J85788K11716
2206.8H10594261L25322L86059L24488J98185J76013K81691L59476K94685J49489J11401
2227.2H13201070K20001L07381K38836J02698Q6308J90496K63274K13265R9242P7546
2247.6H15000117J86682K58028J65343L2008K9624J70111L03030K27392O2585P5042
2268H16509962J68741J92046J64151Q9944P7068K06173L13401K51889O9976k6285P4207
2290.4H18091273K04861J73867K3484l9637L2187J29104J54435Q5652L7909Q9764J36852
$$ plain form
2145.6 803009629 803074539 803214550 803308427 803321064 803339303 803479135 803725958 803928375 804041624 804207265
2166 804207265 804539084 804962873 805318892 805565536 805827320 806221426 806688368 807043254 807260633 807532072
2186.4 807532072 807953179 808398962 808730543 808959246 809195399 809524536 809903145 810196757 810382545 810594261
2206.8 810594261 810919583 811305642 811630130 811828315 812004328 812286019 812645495 812940180 813089669 813201070
2227.2 813201070 813421071 813728452 813967288 814069986 814156294 814346790 814610064 814823329 814922571 815000117
2247.6 815000117 815186799 815444827 815610170 815642178 815671802 815841913 816144943 816372335 816434920 816509962
2268 816509962 816678703 816870749 817034900 817124844 817201912 817408085 817721486 817973375 818043351 818017066 818091273
2290.4 818091273 818296134 818470001 818493485 818453848 818486035 818615139 818769574 818855226 818893135 818982899 819119751
2312.9H19119751P2301m0889n4538Q5234K41161J83821l9697j40429p6770M351K0563
2335.3H19374859j12772k32279j38700K5034p0870m23133m96745j81258J90258K96771
2355.7H18231165J60039o1035j48833j06096j36495l03209l92020k53379p7367j16229
2376.1H16796541l01182l66092k28941n8294m5359j83284k73526j84834o5803p1526
2396.5H15017700j96039l15309k66016j21414r6798k52187l98994l62515k40624k08140
2416.9H12559664l23951m64320m32015k80141k53022m00245n32389m94719l56316k98798
2437.3H08723748m02630n17606m71115l55363l42846m62532n60761m81725l06785k41160
2457.7H04581225l60668n13553m94361l36886k58982l42369m42624m12464k92838k24531
$$ plain form
2312.9 819119751 819192052 819151163 819096625 819181859 819423020 819606841 819567144 819426715 819349945 819354296 819374859
2335.3 819374859 819262087 819029808 818891108 818916142 818845272 818422139 817925394 817744136 817934394 818231165
2355.7 818231165 818391204 818330169 818181336 818075240 817938745 817635536 817243516 816990137 816912770 816796541
2376.1 816796541 816495359 816129267 815900326 815842032 815796673 815613389 815339863 815155029 815089226 815017700
2396.5 815017700 814821661 814506352 814240336 814118922 814022124 813769937 813370943 813008428 812767804 812559664
2416.9 812559664 812235713 811771393 811339378 811059237 810806215 810405970 809873581 809378862 809022546 808723748
2437.3 808723748 808321118 807803512 807332397 806977034 806634188 806171656 805610895 805129170 804822385 804581225
2457.7 804581225 804220557 803707004 803212643 802875757 802616775 802274406 801831782 801419318 801126480 800901949
2478.1H00901949l27646m96328m55916k54154j70529k66493l94702l94463k14696p2062
2498.5G97854960j81437l66389l48211j58786n8949j59383l22223l67224k48254j39176
2518.9G95504928k34425m10378m21703k99931k57015l65079m94539n08905m00424l10659
2539.2G91801870l78549n22137n52654m32015l31759l87788n19574n43177m08590k96652
2559.6G87428975l61204n02765n15223l86119l20613l98219n05149n26786m19676l05951
2580G83187270l11076l73424l94225l43740k80261k91228l60906l76582k93851k11835
2600.4G79950142k43843l78370m88043m73618m03226m19557n39481o42419o17385n50807
2620.8G75193393o10709p68661q61764q31068p62045p63834q58366r27508q88884q26598
$$ plain form
2478.1 800901949 800574303 800077975 799622059 799367905 799197376 798930883 798536181 798141718 797927022 797854960
2498.5 797854960 797673523 797307134 796958923 796800137 796741188 796581805 796259582 795892358 795644104 795504928
2518.9 795504928 795270503 794860125 794438422 794138491 793881476 793516397 793021858 792512953 792112529 791801870
2539.2 791801870 791423321 790901184 790348530 789916515 789584756 789196968 788677394 788134217 787725627 787428975
2559.6 787428975 787067771 786565006 786049783 785663664 785343051 784944832 784439683 783912897 783493221 783187270
2580 783187270 782876194 782502770 782108545 781764805 781484544 781193316 780832410 780455828 780161977 779950142
2600.4 779950142 779706299 779327929 778839886 778366268 777963042 777543485 777004004 776361585 775744200 775193393
2620.8 775193393 774582684 773814023 772952259 772121191 771359146 770595312 769736946 768809438 767920554 767093956
2641.2G67093956q17298q60513r00745q56280p91967q12888q82924r10282q39412p32959
2661.6G58688688o91414p48396q37206q22604p17282o70612p23541p50005o79016o13153
2682G51435459o55830p45535p67768p35104p07268p17581p61270p88629p85411p96079
2702.4G43974984q39114q73864q73089q53002q33273q38339q65937q62777q04841p53463
2722.8G35577285p38799p18653o97256o63399o18160o17921o46055o52731o10828n50091
2743.2G29063392n48899n98729n92590n35011n25355n47111n50807n15580m60803m70639
2763.6G23717868n27799n42760n19812n04851n48899o61671p54893p68781p43687p77662
2784G17367053q78990r33587r20892r41038j037896j147210j210809j265049j325190
$$ plain form
2641.2 767093956 766276658 765416145 764515400 763659120 762867153 762054265 761171341 760261059 759421647 758688688
2661.6 758688688 757997274 757248878 756411672 755589068 754871786 754201174 753477633 752727628 752048612 751435459
2682 751435459 750779629 750034094 749266326 748531222 747823954 747106373 746345103 745556474 744771063 743974984
2702.4 743974984 743135870 742262006 741388917 740535915 739702642 738864303 737998366 737135589 736330748 735577285
2722.8 735577285 734838486 734119833 733422577 732759178 732141018 731523097 730877042 730224311 729613483 729063392
2743.2 729063392 728514493 727915764 727323174 726788163 726262808 725715697 725164890 724649310 724188507 723717868
2763.6 723717868 723190069 722647309 722127497 721622646 721073747 720412076 719657183 718888402 718144715 717367053
2784 717367053 716488063 715554476 714633584 713692546 712654650 711507440 710296631 709031582 707706392
2802.3G07706392j350284j412213j536488j587331j570642j607955j710415j811862
2818.7F95119202j879036j920402j968027k056837k162039k224266k244056k310037
2835F78354502k445460k607703k780497k922237l094733l306865l345430l132403k839029
2853.3F51880145k645254k603114k697110k928972l237486l573060l974974m338086
2869.7F25882089m515588m602492m698157m655421m348159l850579l249109k611041
2886E93351543k033889j545847j124561q19444o78420o69480p25865q19206r87411
2904.3E83947420j231134j479387j762748k166986k602399k934813l094197l042042
2920.6E65633714k779305k334833j760781j110852l96430M81427J508236K447307L189087
$$ plain form
2802.3 707706392 706356108 704943895 703407407 701820076 700249434 698641479 696931064 695119202
2818.7 695119202 693240166 691319764 689351737 687294900 685132861 682908595 680664539 678354502
2835 678354502 675909042 673301339 670520842 667598605 664503872 661197007 657851577 654719174 651880145
2853.3 651880145 649234891 646631777 643934667 641005695 637768209 634195149 630220175 625882089
2869.7 625882089 621366501 616764009 612065852 607410431 603062272 599211693 595962584 593351543
2886 593351543 591317654 589771807 588647246 587827802 587149382 586479902 585754037 584934831 583947420
2904.3 583947420 582716286 581236899 579474151 577307165 574704766 571769953 568675756 565633714
2920.6 565633714 562854409 560519576 558758795 557647943 557251513 557732940 559241176 561688483 564877570
2939E64877570L812849M327476M676461M857004M940927M988969M971921M931033M902839
2957.4F07287049M776359M515171M203260L921628L679991L449738L285646L208757
2973.7F38327599L169059L192902L170252K926230K609670K413571K245963K030134
2990F60085380J761794J384735J049042Q45134O14822L44753O4671k09152l69728m67300
3010.4F65104151o94275j042664j307011j420677j517534j652360j796067j904666
3026.7F53768897j881003j832843j911462k068817k211511k224326k172649k242744
3043F37223542k409756k503992k441167k389431k465964k520263k557397k607822k565384
3061.4F14762366k488077k442360k490818k623022k657950k567410k429903k363443
$$ plain form
2939 564877570 568690419 573017895 577694356 582551360 587492287 592481256 597453177 602384210 607287049
2957.4 607287049 612063408 616578579 620781839 624703467 628383458 631833196 635118842 638327599
2973.7 638327599 641496658 644689560 647859812 650786042 653395712 655809283 658055246 660085380
2990 660085380 661847174 663231909 664280951 665126085 665740907 666085660 666150331 665941179 665571451 665104151
3010.4 665104151 664409876 663367212 662060201 660639524 659121990 657469630 655673563 653768897
3026.7 653768897 651887894 650055051 648143589 646074772 643863261 641638935 639466286 637223542
3043 637223542 634813786 632309794 629868627 627479196 625013232 622492969 619935572 617327750 614762366
3061.4 614762366 612274289 609831929 607341111 604718089 602060139 599492729 597062826 594699383
3077.7E94699383k497852k661944k683997k694785k699554k641976k653182k706647
3094E73459446k661466k555907k513826k593100k669275k588570k501726k575040k561509
3112.4E50239027k356709k284526k413214k623975k807557k757848k567291k459943
3128.7E29967964k459288k493501k442419k301216k263666k409279k519071k469182
3145E10610342k358913k208889k084613k173900k377570k405584k294123k201229k133877
3163.4D90371644k124577k158284k130151k079994k047658j995086j972348j973271
3179.7D73890275j969874j975536j940460j858711j827895j851917j847773j814187
3196D58803922j757383j700104j672744j654447j646310j649946j627862j590520j573473
$$ plain form
3077.7 594699383 592201531 589539587 586855590 584160805 581461251 578819275 576166093 573459446
3094 573459446 570797980 568242073 565728247 563135147 560465872 557877302 555375576 552800536 550239027
3112.4 550239027 547882318 545597792 543184578 540560603 537753046 534995198 532427907 529967964
3128.7 529967964 527508676 525015175 522572756 520271540 518007874 515598595 513079524 510610342
3145 510610342 508251429 506042540 503957927 501784027 499406457 497000873 494706750 492505521 490371644
3163.4 490371644 488247067 486088783 483958632 481878638 479830980 477835894 475863546 473890275
3179.7 473890275 471920401 469944865 468004405 466145694 464317799 462465882 460618109 458803922
3196 458803922 457046539 455346435 453673691 452019244 450372934 448722988 447095126 445504606 443931133
3214.3D43931133j551182j528382j514554j483351j455456j427948j364678j263381
3230.7D32342201j228213j402408j538604j408905j254439j187116j129151j119226
3247D22074139j217663j274735j134634j011908j077920j142174j099080j040578r93043
3265.3D12082404q99136p85947q42750j031727j097560j052320r84192r02980q56638
3283.7D03629154q31544p95663p14898o76811q10891r67294j017928r47774p53492
3302C96112859o14434p18117r78529j200647j269728j166045j059443j043111j042634
3320.4C87020171j001120r65387j071512j208604j183003j073807r70364q90642r68606
3338.8C77687126j117676j120091j106232j053572q77887r10222j154721j223415j105964
$$ plain form
3214.3 443931133 442379951 440851569 439337015 437853664 436398208 434970260 433605582 432342201
3230.7 432342201 431113988 429711580 428172976 426764071 425509632 424322516 423193365 422074139
3247 422074139 420856476 419581741 418447107 417435199 416357279 415215105 414116025 413075447 412082404
3265.3 412082404 411183268 410397321 409554571 408522844 407425284 406372964 405388772 404485792 403629154
3283.7 403629154 402797610 402001947 401287049 400610238 399799347 398832053 397814125 396866351 396112859
3302 396112859 395498425 394780308 393801779 392601132 391331404 390165359 389105916 388062805 387020171
3320.4 387020171 386019051 385053664 383982152 382773548 381590545 380516738 379546374 378655732 377687126
3338.8 377687126 376569450 375449359 374343127 373289555 372411668 371501446 370346725 369123310 368017346
3357.1C68017346r94146r40711r03040p91758p37637r37373j217097j201957r37253
3375.5C59356374q22962q69721q84801q35210p31498n37664k96712l69042p59721q47488
3395.9C52401555m53562j70559m55498q37356p22528m43041l59952l68715m29779m45902
3416.3C47714663l42012k88069k80321j51217M1425J47820R8497J17838K78354K02983
3436.6C47539961p8797j25527J09315L52203M21167L66807L83317M60238N28216O23733
3457C50580633P01129O43969O22093Q30621R84937P68721L93838L63856O60181R60470
3477.4C57510448R79632O68734N98043Q59559Q83430P47502Q19832R95725J081229
3495.8C65144134J020968R73284R94235Q66950P55012R01699J081675J173943J131714
$$ plain form
3357.1 368017346 367023200 366082489 365179449 364387691 363650054 362712681 361495584 360293627 359356374
3375.5 359356374 358533412 357663691 356778890 355943680 355212182 354674518 354377806 354008764 353249043 352401555
3395.9 352401555 351947993 351777434 351321936 350484580 349762052 349319011 348959059 348590344 348160565 347714663
3416.3 347714663 347372651 347084582 346804261 346653044 346694469 346842289 346940786 347058624 347336978 347539961
3436.6 347539961 347461164 347335637 347444952 347797155 348218322 348585129 348968446 349428684 349956900 350580633
3457 350580633 351281762 351925731 352547824 353378445 354363382 355132103 355525941 355889797 356549978 357510448
3477.4 357510448 358490080 359158814 359756857 360616416 361499846 362247348 363067180 364062905 365144134
3495.8 365144134 366165102 367138386 368132621 368999571 369754583 370656282 371737957 372911900 374043614
3514.2C74043614R74327R78112J179487J360327J254052J006126J017064J200199J291066
3532.5C84304374J342327J365721J302272J380503J579315J563102J302063J252652
3548.8C95392329J480460J574844J546204J657665J906037K027810J886248J836777
3565.1D09308374K139896K293915K171456K194584K347737K485663K643138K774924
3581.5D28359687K795101K764850K789617K848089K851277K923221L055066L188639
3597.8D51575547L282458L257781L143728L085554L282875L489494L500730L442675
3614.1D78060842L325492L500789L816337L535300L064275L076046L752798M038573
3630.4E06170452L451943L273845L368914L371417L369034L296077L166020L353953
$$ plain form
3514.2 374043614 375017941 375996053 377175540 378535867 379789919 380796045 381813109 383013308 384304374
3532.5 384304374 385646701 387012422 388314694 389695197 391274512 392837614 394139677 395392329
3548.8 395392329 396872789 398447633 399993837 401651502 403557539 405585349 407471597 409308374
3565.1 409308374 411448270 413742185 415913641 418108225 420455962 422941625 425584763 428359687
3581.5 428359687 431154788 433919638 436709255 439557344 442408621 445331842 448386908 451575547
3597.8 451575547 454858005 458115786 461259514 464345068 467627943 471117437 474618167 478060842
3614.1 478060842 481386334 484887123 488703460 492238760 495303035 498379081 502131879 506170452
3630.4 506170452 509622395 512896240 516265154 519636571 523005605 526301682 529467702 532821655
3646.7E32821655M059077M063725L111541K978325L546000L444135L003716K861858
3663E59890032K760470K690017L015041L102124K679646K969384L018797K337277K151072
3681.4E84613860K169966K235294K692282K849638K137244J670420J728118J795769
3697.7F01892591J827955J934647J804233J465082J401961J726329J919627J492620
3714F15465045J108170J149058J288473J327873J286745J204789J018166R43601J255155
3732.4F26047075J630902J575708R53258L83079P29501J549899J220942Q17299J318157
3750.7F36225820J272738P27057P22468J075029J052976P19607P37309R29296J033008
3769.1F44495308R37522O51419N77211Q00968R90450P95126N65708O23464O78480O77943
$$ plain form
3646.7 532821655 536880732 540944457 544055998 547034323 550580323 554024458 557028174 559890032
3663 559890032 562650502 565340519 568355560 571457684 574137330 577106714 580125511 582462788 584613860
3681.4 584613860 586783826 589019120 591711402 594561040 596698284 598368704 600096822 601892591
3697.7 601892591 603720546 605655193 607459426 608924508 610326469 612052798 613972425 615465045
3714 615465045 616573215 617722273 619010746 620338619 621625364 622830153 623848319 624791920 626047075
3732.4 626047075 627677977 629253685 630206943 630590022 631319523 632869422 634090364 634907663 636225820
3750.7 636225820 637498558 638225615 638948083 640023112 641076088 641795695 642533004 643462300 644495308
3769.1 644495308 645432830 646084249 646661460 647462428 648452878 649248004 649813712 650437176 651115656 651793599
3789.5F51793599O24538N72860O71923O12736O34610R34899O68049N02229P18653M26352
3809.9F58160448J47820M04059Q42333P80523P50482Q49903M12106K38479L23355L92616
3830.3F63302124N44428N47409O16789P44939N21124L44753L54230J74225j07468N7936
3850.7F67100489J084447J392603J97351k33173Q6009M24564M54903K57670M63069
3869F71227932O70612L62336J82152J34647L05474M95911M26113N43356L32773N1319
3889.4F74732625L48986L19242l7730J03236M48167M87208M02749K99156Q9049L4034
3909.8F77226722R5010J21415K62201L65972K10226P3135J62839K11537J35601K02894
3930.2F79067552L38137K19524n245j3292J59145K99870K42711J68383K22444J96636
$$ plain form
3789.5 651793599 652418137 652990997 653662920 654275656 654910266 655845165 656513214 657015443 657734096 658160448
3809.9 658160448 658308268 658712327 659554660 660335183 661085665 661935568 662347674 662586153 662909508 663302124
3830.3 663302124 663846552 664393961 665010750 665755689 666276813 666621566 666975796 667150021 667042553 667100489
3850.7 667100489 668184936 669577539 669774890 669541717 669627726 670052290 670507193 670764863 671227932
3869 671227932 671898544 672260880 672443032 672577679 672883153 673379064 673805177 674348533 674681306 674732625
3889.4 674732625 675081611 675400853 675363123 675466359 675914526 676401734 676804483 677103639 677192688 677226722
3909.8 677226722 677321732 677443147 677705348 678071320 678281546 678354681 678517520 678729057 678864658 679067552
3930.2 679067552 679405689 679625213 679619968 679606676 679765821 680065691 680308402 680476785 680699229 680895865
3950.6F80895865R6619Q5354J35481K06888K12431R4831n603R835J39356K49505K01284
3973.1F82321846J29581J32561J18732J58191K08855J13368N1140J27614J75297J46687
3993.4F83683872J11878P9870
3997.5F83875620
$$ plain form
3950.6 680895865 680992484 681077838 681213319 681420207 681632638 681727469 681721866 681731701 681871057 682120562 682321846
3973.1 682321846 682451427 682583988 682702720 682860911 683069766 683183134 683234274 683361888 683537185 683683872
3993.4 683683872 683795750 683875620
3997.5 683875620
##END=$$ End of the data block
