##TITLE=Fibra Torta - Bianca $$ Begin of the data block
##JCAMP-DX=5.00 $$ ACD/SpecManager v 10.08
##SPECTROMETER/DATA SYSTEM=Alpha
##DATE=24 Oct 2013 13:19:44
##DATA TYPE=INFRARED SPECTRUM
##DATA CLASS=XYDATA
##ORIGIN=
##OWNER=
##NPOINTS=1765
##FIRSTX=399.75695801
##LASTX=3997.56933594
##MAXX=3997.56933594
##MINX=399.75695801
##MAXY=0.82035089
##MINY=0.31823406
##XFACTOR=1.0000000000
##YFACTOR=1.000000000000000e-9
##FIRSTY=0.60220498
##DELTAX=2.03957629
##XUNITS=1/CM
##YUNITS=ARBITRARY UNITS
##XYDATA=(X++(Y..Y))
399.8 602204978 599274397 595437884 592542648 592403829 594421625 596060276 595829666 595304608 595785141
418.1 595785141 595560730 593425333 590123534 586966038 585388482 584381044 581892669 578482389 576477408
436.5 576477408 577008188 579347849 582089067 584542692 587354660 590773821 593446195 594113231 593466878
454.8 593466878 593079984 593211293 592575788 590211332 586939335 584378600 582685232 580490410 577064812
473.2 577064812 573803365 572211087 571814656 571186185 569886923 568833649 568805933 569189370 568778634
491.5 568778634 567221165 565488338 564417660 563439846 561585724 558799684 555857956 553423107 551243901
509.9 551243901 548285782 544240057 540116310 536848962 534124613 531328022 528777659 527171373
526.2 527171373 526856363 527439058 528216660 529429674 532299280 537217021 542665720 546813726 549186289
544.6 549186289 550411582 551046133 550761402 549044013 546145916 542941868 539974988 536767542 532467425
562.9 532467425 527030587 521229565 515767753 511047661 507566690 505960226 506745219 509989619 514963984
581.3 514963984 520575106 526101828 531284690 535845578 539113820 540597975 540842652 540814519 540932238
599.6 540932238 540897548 540348291 539746940 539884686 540829659 542029262 543232501 544811308 547269821
618 547269821 550690949 554566264 558195651 561440349 564681232 567832112 570339918 571923554 573010266
636.3 573010266 574375272 576188087 577829301 578871012 579646409 580716550 582137048 583334029 583899677
654.7 583899677 584244668 584985375 586017370 586796463 587182701 587715924 589117348 590773463 592300892
673.1 592300892 593804359 595425963 597446024 599618018 601374686 602442145 603126049 603944659 604721963
691.4 604721963 604630828 603387952 601496041 599448502 597304225 594988465 592764676 591417432 591673017
709.8 591673017 593414247 595982969 599102974 603015125 607958198 613578081 619078159 624027789
726.1 624027789 628618836 633220673 637592077 641063273 643463850 645201981 646572173 647267938 646726012
744.4 646726012 644768715 641864955 638596892 635055542 631045043 626684129 622548580 619333625
760.8 619333625 617360294 616592467 617267728 619869709 624506712 630627334 637382805 644154370 650784314
779.1 650784314 657341003 663585007 669051588 673595190 677581131 681437135 685286164 689010441
795.4 689010441 692577899 696286559 700261354 704023898 707046807 709319949 711253107 713262975
811.7 713262975 715166152 716400027 716915727 717108309 717132151 716713190 715307117 712652147 709215343
830.1 709215343 705660999 702088714 698143721 693840206 689746678 686270654 683248103 680292010
846.4 680292010 677246094 674248993 671412110 668509543 665141165 661662877 659810483 661474466
862.7 661474466 666877806 674591243 683123648 691685319 699635208 706051290 710040390 711334229
879.1 711334229 710382164 707741380 703669548 698394775 692410767 686542749 681524992 677396894 673689425
897.4 673689425 670048654 666381896 662592292 658301234 652939975 646272302 638573050 630313218
913.7 630313218 621888578 613674462 606299102 600599527 597038090 595260084 594487190 594348729 595041275
932.1 595041275 596736610 599292099 602425992 605906963 609348893 611689270 611405790 607469797 599927306
950.4 599927306 589676440 577742577 564696968 550624669 535514235 519499123 502749383
964.7 502749383 485349149 467277765 448558450 429430068 410331249 391853750 374635249
979 374635249 359268695 346310079 336144179 328803778 323994011 321243435 320014685 319827229
995.3 319827229 320280999 321005106 321691036 322130293 322123200 321563721 320606887 319528192 318633646 318234056
1015.7 318234056 318542272 319595456 321311593 323601276 326359540 329411298 332540810 335523933
1032 335523933 338111877 340135932 341587543 342606276 343411267 344179153 345036477 346257478 348295569
1050.4 348295569 351509422 355993539 361696452 368571937 376577377 385603219 395000845 402866036
1066.7 402866036 406238168 403160483 394901395 385348946 378015041 374130070 373260647 374589741
1083 374589741 377434462 381266385 385805577 390949696 396437228 401716530 406139731 409294873 411198527
1101.4 411198527 412311465 413353622 415032476 417749196 421439081 425713867 430110753 434197992
1117.7 434197992 437644780 440444261 442979693 445808589 449372917 453766257 458460510 462325990
1134 462325990 464142382 463130563 459263116 453185350 445880622 438343883 431297451 425121903 420067579
1152.4 420067579 416331351 414000899 413108736 413689762 415892065 420014501 426321417 434796244 445114613
1170.7 445114613 456808656 469457656 482723534 496262014 509674549 522540092 534531415
1185 534531415 545394540 554797530 562341094 567845047 571544886 573960543 575638175 576975107
1201.3 576975107 578238070 579739094 581863523 584790885 588296473 591977179 595572174 598906159
1217.6 598906159 601666033 603443265 604013503 603532016 602424622 601030588 599432409 597694755 596023858
1236 596023858 594654202 593737960 593277752 593214631 593645036 594735920 596442521 598429799 600290477
1254.3 600290477 601895034 603398263 604963601 606601596 608259559 610054851 612205505 614648521
1270.6 614648521 616926312 618544996 619394183 619746685 619893253 619912863 619730890 619326353 618826687
1289 618826687 618297815 617533326 616247416 614464223 612519264 610678256 608889818 606922626 604705334
1307.4 604705334 602468491 600449085 598614931 596853733 595211625 593814075 592520535 590789139
1323.7 590789139 588092148 584411383 580284774 576359630 572983325 570284724 568395317 567431629
1340 567431629 567344904 567783117 568234503 568362296 568171263 567787170 567164123 566189826 564925909 563575566
1360.4 563575566 562287390 561145067 560112238 559195280 558775365 559201241 560305655 561570764 562792599
1378.7 562792599 564155340 566064596 569005907 573035061 577199936 580545545 583105028 584826410
1395.1 584826410 585422993 585030794 584171295 583223164 582048953 580491722 578638077 576683283 574958503
1413.4 574958503 573630095 572393477 570972800 569898963 569562793 569748163 570204139 570797443 571599603
1431.8 571599603 572807729 574451983 576101065 577439845 578843594 580386400 581736922 582419097
1448.1 582419097 582256615 581668854 581097305 580399215 579384565 578898013 579506338 581542075 584925592
1466.4 584925592 589175522 594753563 602545321 611174583 619025767 626127541 632704020 638998985
1482.8 638998985 645015538 650915205 656612217 661569357 665563583 669426560 673594654 677156568
1499.1 677156568 679793715 682095408 684968591 688520491 691046238 692767978 694622338 696913719
1515.4 696913719 699582219 702129364 704357564 706183672 707934439 709846914 711501300 712879777
1531.7 712879777 714162052 715433240 717013657 718944550 720118284 720639825 721358776 722372770 723426461
1550.1 723426461 724241555 724953711 725890815 727142870 727697611 727383018 727050781 726991177 727053046 726692498
1570.5 726692498 725825489 724702120 723196387 721552849 719833493 717600703 714912653 712095618
1586.8 712095618 709298074 706311643 702906311 699163556 695488095 692065060 688554406 684662938
1603.1 684662938 680548966 676579714 672789335 669015169 665228486 661068916 656390488 652664721
1619.4 652664721 649726868 646321893 642768860 639675677 637073934 635109127 633478403 631567657
1635.7 631567657 629968464 629339576 629412055 629930317 630876422 632227302 633830547 636275232 639501750
1654.1 639501750 641925454 644296885 647476554 651437223 655467153 659083724 663152397 667954624
1670.4 667954624 672448575 676883578 681369007 685414493 689445078 694066346 699321508 703491092
1686.7 703491092 706808925 710367322 713870883 717458844 720855057 723741114 726622939 728838265
1703 728838265 730460048 731772065 732658148 733455360 734313190 735073268 735460699 735391676 735349715 735520959
1723.4 735520959 735684335 735693693 735702395 735900044 736342967 736748099 737106085 737756789 738785505 740192950
1743.8 740192950 741951644 743934035 746147811 748570144 751006901 753619552 756407738 759206772
1760.1 759206772 762213290 765122533 767823517 770484447 772984505 775372207 777440369 779055536
1776.5 779055536 780488968 781817138 782989979 784118891 785213351 786194801 787164867 788147211 788932085
1794.8 788932085 789610863 790351152 791102767 791774333 792393804 793049335 793735206 794376493 794913232 795423448
1815.2 795423448 795952737 796472251 796989560 797530413 798067093 798563600 799055278 799466848 799780369 800078094
1835.6 800078094 800361276 800637066 800989032 801404595 801666319 801730692 801810980 802021861 802288234 802497208
1856 802497208 802633643 802781224 802986443 803218067 803409338 803536594 803638816 803802490 804040849 804232836
1876.4 804232836 804369628 804547191 804813266 805128992 805382073 805543303 805706918 805938363 806180775 806303144
1896.8 806303144 806294858 806321681 806470692 806647301 806729674 806713164 806703925 806797922 806973755 807106256 807103574
1919.2 807103574 807065070 807145178 807305038 807420313 807439864 807440758 807545722 807702005 807775617 807754576 807738841
1941.7 807738841 807820559 807991505 808120787 808122814 808110118 808221817 808438838 808631837 808707118 808703601 808762252
1964.1 808762252 808920741 809045136 809044302 809011281 809077919 809229016 809334636 809322834 809270799 809288144 809370458
1986.5 809370458 809404612 809331000 809218109 809160113 809194446 809249938 809191644 809014201 808847725 808743477 808616877
2009 808616877 808365464 808036625 807765901 807568848 807338238 806996822 806610107 806275904 805996656 805692434
2029.4 805692434 805309892 804896116 804536998 804262877 804012239 803717315 803399742 803147137 802980840 802840173
2049.8 802840173 802688301 802550018 802482903 802495718 802515268 802496672 802474856 802502513 802578688 802617729 802592874
2072.2 802592874 802585065 802607059 802617013 802623689 802639842 802678466 802753985 802836239 802874982 802870393 802903354 803016961
2096.7 803016961 803156853 803261876 803307056 803335488 803434551 803591251 803680301 803662479 803645968 803712308 803781927
2119.1 803781927 803768933 803718388 803702652 803758323 803842366 803840935 803735197 803644776 803653240 803712368 803728819 803683639
2143.6 803683639 803664923 803760529 803907692 803975761 803971112 804017067 804192483 804442883 804640293 804758310 804924905
2166 804924905 805238068 805630207 805971861 806232631 806514144 806916475 807388663 807763577 808007658 808280587
2186.4 808280587 808675110 809110641 809449911 809656084 809856892 810180545 810578167 810887516 811073840 811287701
2206.8 811287701 811625540 812029600 812374830 812592685 812785327 813071489 813386738 813608706 813757062 813935876
2227.2 813935876 814209700 814539790 814780414 814864993 814926922 815110981 815376937 815582752 815684974 815775096
2247.6 815775096 815951169 816188693 816352963 816392064 816426933 816598713 816893935 817113280 817171276 817242265
2268 817242265 817418754 817637086 817834973 817944944 818026364 818224370 818512142 818735421 818808734 818809986 818901479
2290.4 818901479 819119632 819291770 819296062 819251180 819311500 819489300 819646001 819670975 819658756 819742799 819901347
2312.9 819901347 820005894 819997013 819955289 819997907 820173860 820350885 820336998 820228457 820219159 820263743 820233107
2335.3 820233107 820072174 819864333 819760680 819792569 819717646 819292843 818788946 818598330 818768322 819004178
2355.7 819004178 819116831 819079041 818986177 818924963 818831027 818609238 818262041 817938626 817776382 817654550
2376.1 817654550 817368150 816977918 816725194 816668093 816625178 816442013 816172004 815985203 815920949 815856874
2396.5 815856874 815674543 815377057 815109313 814984083 814890742 814625978 814215243 813853979 813638151 813474953
2416.9 813474953 813169777 812700629 812257051 811942577 811659515 811249495 810706139 810207963 809863448 809585631
2437.3 809585631 809210241 808682859 808170140 807817936 807508111 807068288 806535244 806070328 805743456 805451930
2457.7 805451930 805049300 804541290 804094315 803802609 803565145 803230345 802760780 802289009 801955163 801715553
2478.1 801715553 801403165 800948799 800501049 800240695 800102293 799853683 799439311 799046159 798842549 798750937
2498.5 798750937 798545897 798188567 797871232 797733724 797688246 797519863 797161043 796778798 796542108 796420038
2518.9 796420038 796196520 795767844 795303404 794983387 794754744 794408083 793886244 793368161 793005288 792740524
2539.2 792740524 792378485 791840851 791277349 790837109 790491343 790111601 789613605 789072573 788665771 788390458
2559.6 788390458 788030684 787502468 786974132 786588788 786280215 785911679 785425901 784898162 784466267 784143507
2580 784143507 783817053 783408642 782971621 782630682 782413900 782195508 781864405 781475186 781152725 780916512
2600.4 780916512 780641198 780227840 779735804 779303312 778954506 778541386 777966857 777301967 776677728 776137173
2620.8 776137173 775566161 774850667 774018168 773170710 772367597 771574318 770713985 769798040 768929541 768128932
2641.2 768128932 767306924 766409993 765497088 764662027 763873756 763042450 762156725 761250257 760403395 759664237
2661.6 759664237 758955956 758183300 757350147 756543338 755821586 755151808 754455745 753722191 753012657 752349079
2682 752349079 751697242 751028299 750329137 749601603 748879790 748163998 747399092 746576905 745763123 744975090
2702.4 744975090 744154871 743281066 742396057 741539598 740697443 739836395 738972783 738139451 737357259 736611545
2722.8 736611545 735852182 735082448 734353542 733702183 733086824 732446551 731795788 731182337 730623543 730069160
2743.2 730069160 729481757 728894174 728339911 727809548 727270722 726704180 726125121 725593626 725135744 724682868
2763.6 724682868 724153578 723565340 723007977 722507834 721976697 721321762 720588684 719879925 719185710 718419671
2784 718419671 717549443 716613233 715644479 714648962 713607848 712469637 711231172 709954679 708665729
2802.3 708665729 707327366 705884516 704352498 702794433 701215088 699580610 697856545 696044087
2818.7 696044087 694184124 692287922 690324128 688261449 686106682 683902860 681650877 679294944
2835 679294944 676810622 674185038 671405256 668488681 665401697 662131608 658821166 655678749 652806580
2853.3 652806580 650116742 647459865 644723177 641792417 638561428 634958267 630964994 626629829
2869.7 626629829 622095108 617487490 612807572 608158886 603803039 599932432 596657515 594030440
2886 594030440 591992438 590437710 589285612 588445544 587770998 587094009 586348534 585546494 584627450
2904.3 584627450 583490670 582063496 580264270 578023136 575357556 572396636 569321513 566303670
2920.6 566303670 563539326 561221004 559467316 558355570 557951570 558386266 559832335 562281489 565535069
2939 565535069 569407284 573772371 578481257 583348334 588262141 593229353 598217010 603149951 608026147
2957.4 608026147 612812638 617370486 621602654 625544250 629217982 632646084 635960758 639232993
2973.7 639232993 642437994 645626962 648789227 651722252 654342532 656768024 659013093 661023676
2990 661023676 662784517 664212883 665303767 666162193 666782260 667101800 667118251 666898429 666547716 666095912
3010.4 666095912 665415168 664383173 663090229 661684692 660185099 658559322 656786323 654894948
3026.7 654894948 653010070 651152194 649205327 647099853 644869983 642677665 640572846 638373137
3043 638373137 635953367 633415580 630943477 628530622 626056075 623540461 620994568 618373573 615794837
3061.4 615794837 613348603 610936463 608419061 605756819 603056133 600431621 597971320 595632255
3077.7 595632255 593171895 590522885 587814629 585094810 582411706 579781890 577093244 574348211
3094 574348211 571700096 569183886 566669106 564043462 561369538 558804035 556318700 553724706 551113844
3112.4 551113844 548716843 546401739 543956101 541319489 538518906 535771132 533225179 530780673
3128.7 530780673 528291702 525724232 523211956 520909071 518699884 516305089 513750315 511272192
3145 511272192 508916914 506691217 504605889 502417207 499980003 497542888 495269746 493073553 490887523
3163.4 490887523 488731772 486618608 484494805 482356966 480275542 478253424 476258725 474304467
3179.7 474304467 472366214 470421880 468504578 466617376 464725107 462831616 460988909 459188819
3196 459188819 457396090 455621064 453877926 452183545 450534910 448892266 447235912 445600241 444012135
3214.3 444012135 442461699 440944016 439455301 437985510 436524898 435089171 433725029 432467133
3230.7 432467133 431237578 429849386 428330153 426887691 425556898 424321622 423202872 422069460
3247 422069460 420786023 419488847 418365121 417333663 416214854 415051788 413980156 412994623 412050217
3265.3 412050217 411182046 410415560 409591317 408593863 407537848 406506449 405533493 404646546 403779000
3283.7 403779000 402880400 402002454 401248068 400582612 399824619 398918211 397921920 396949649 396148622 395501107
3304.1 395501107 394769609 393750131 392523080 391298324 390148699 389033318 387950689 386931121
3320.4 386931121 385954708 384949505 383851916 382673621 381505162 380440563 379482180 378553271 377521515
3338.8 377521515 376357585 375204206 374079496 373001963 372114360 371230721 370070219 368809462 367718071
3357.1 367718071 366773248 365817338 364848316 364034295 363331228 362453550 361273915 360034645 359004855
3375.5 359004855 358121395 357248724 356353313 355492562 354765803 354235381 353923440 353552818 352814913 352003425
3395.9 352003425 351540357 351255268 350685269 349819392 349093676 348648012 348297209 347939193 347522169 347094864
3416.3 347094864 346772313 346481830 346180588 346039176 346113116 346270949 346377164 346511155 346779644 346946687
3436.6 346946687 346840709 346707195 346803933 347137332 347557157 347939163 348362625 348899275 349480093 350093842
3457 350093842 350761563 351362675 351924449 352745146 353794098 354595125 354974568 355355054 356049120 356970817
3477.4 356970817 357861459 358522296 359173238 360070109 360980004 361745566 362608612 363654554 364740878
3495.8 364740878 365764976 366766483 367763966 368612587 369367480 370272249 371371418 372582525 373713672
3514.2 373713672 374647528 375593185 376754075 378113389 379410774 380483806 381515861 382676691 383983701
3532.5 383983701 385402530 386790961 388076961 389481008 391074449 392611265 393927455 395228148
3548.8 395228148 396729052 398327678 399953842 401683986 403550476 405496210 407407045 409375638
3565.1 409375638 411641300 414013296 416228920 418421715 420722485 423135966 425750822 428559214
3581.5 428559214 431408167 434230298 437031806 439856023 442733616 445726752 448831260 452049583
3597.8 452049583 455389887 458731204 461944342 465085149 468407810 471888989 475360692 478829771
3614.1 478829771 482248276 485831201 489688903 493286490 496414483 499504179 503272653 507355869
3630.4 507355869 510847449 514185190 517591417 520931959 524316847 527687848 530901432 534295797
3646.7 534295797 538384020 542433262 545530438 548506320 552055538 555523157 558549166 561398983
3663 561398983 564161003 566902339 569949031 573006928 575658500 578652978 581682086 584043562 586267531
3681.4 586267531 588496864 590702713 593323529 596164525 598327041 600009501 601738334 603525460
3697.7 603525460 605368555 607340276 609149933 610602200 611987352 613665342 615587294 617184460
3714 617184460 618374050 619521677 620780110 622090399 623364925 624554873 625579059 626533151 627716362
3732.4 627716362 629257798 630853176 631881177 632320464 633019269 634527087 635813415 636668980 638006687
3750.7 638006687 639353037 640098572 640758336 641755998 642796338 643565893 644306839 645177484 646189451
3769.1 646189451 647180915 647886693 648435891 649161279 650116324 650916159 651487350 652116179 652795970 653471053
3789.5 653471053 654104352 654665947 655296385 655894399 656547487 657514811 658240438 658807933 659563422 659984291
3809.9 659984291 660118163 660511792 661330760 662061751 662764311 663639724 664106131 664356291 664676905 665041924
3830.3 665041924 665531695 666110098 666823685 667586863 668078244 668391764 668703139 668831289 668692708 668754101
3850.7 668754101 669891000 671402633 671686053 671444833 671489298 671887279 672315300 672577858 673090756
3869 673090756 673782885 674124599 674258351 674341202 674645185 675179303 675625086 676141322 676421463 676454127
3889.4 676454127 676828325 677196085 677214503 677331805 677731335 678179324 678594232 678925157 679030538 679061174
3909.8 679061174 679158330 679268241 679504454 679913282 680211067 680285513 680385470 680558383 680642426 680803835
3930.2 680803835 681180716 681452096 681452811 681433320 681585193 681836009 682014406 682164550 682397068 682622015
3950.6 682622015 682765663 682877421 683020294 683205128 683387816 683530688 683614433 683681011 683818817 684009552
3971 684009552 684176505 684297204 684389114 684489965 684644520 684855044 685008109 685071290 685176671 685337007
3991.4 685337007 685493946 685651958 685745239
3997.5 685745239
##END=$$ End of the data block
