##TITLE=Fibra Torta - Bianca $$ Begin of the data block
##JCAMP-DX=5.00 $$ ACD/SpecManager v 10.08
##SPECTROMETER/DATA SYSTEM=Alpha
##DATE=24 Oct 2013 13:19:44
##DATA TYPE=INFRARED SPECTRUM
##DATA CLASS=XYDATA
##ORIGIN=
##OWNER=
##NPOINTS=1765
##FIRSTX=399.75695801
##LASTX=3997.56933594
##MAXX=3997.56933594
##MINX=399.75695801
##MAXY=0.82152265
##MINY=0.31839335
##XFACTOR=1.0000000000
##YFACTOR=1.000000000000000e-9
##FIRSTY=0.60112727
##DELTAX=2.03957629
##XUNITS=1/CM
##YUNITS=ARBITRARY UNITS
##XYDATA=(X++(Y..Y))
399.8F01127267l233850l740549k903819j16408K141118J771867M2439m27604K84970
418.1E94945431j57118j880527l230452l155410j744390j362622k686560l316998j876057
436.5E75535297M68374K147078K465427K337575L144622L806353K706348N68688p75456
454.8E92404306n99384n0784p18235k227724k921462k266765j575947k089798l270686
473.2E76683521l235459j783550n90205o41882j330853j193225J9669O34968l57270
491.5E68205714j800775j893223q46266n69165j692951k950191l127993k475917k240181
509.9E50609052l096163m089415m025400l160536k751351l086626k941489j612842
526.2E25845230L9696Q99017J040995J465917K912044M726112N361021M165888K211153
$$ y = [601127267, 597893417, 594152868, 591249049, 591132641, 593273759, 595045626, 595088065, 594660461, 594945431, 594788313, 592907786, 589677334, 586521924, 584777534, 583414912, 580728352, 577411354, 575535297, 576003671, 578150749, 580616176, 582953751, 586098373, 589904726, 592611074, 593179762, 592404306, 591804922, 591754138, 591035903, 588808179, 585886717, 583619952, 582044005, 579954207, 576683521, 573448062, 571664512, 571074307, 570432425, 569101572, 567908347, 567928016, 568562984, 568205714, 566404939, 564511716, 563665450, 563096285, 561403334, 558453143, 555325150, 552849233, 550609052, 547512889, 543423474, 539398074, 536237538, 533486187, 530399561, 527458072, 525845230, 525884926, 526783943, 527824938, 529290855, 532202899, 536929011, 542290032, 546455920, 548667073]
544.6E48667073J093269O83784k94506j776815k871632l139139k932727l218591m328728
562.9E31881988n431771n775273n404115m612446l410935j608074P87139L284633M922152
581.3E14633298N356967N280733N152047M616976L345489J589179K51353m9293J67668
599.6E40344417m709n64932o51420J27316J116872J430392J260579J510143K433717
618E47002375L432274L831327L562510L214180L236771L190994K590716J645386J144469
636.3E72851002J414061J838267J666367R74297O61850J095712J538933J268327N68092
654.7E83876908L31044P90894J096308P75278L78549N21839J327276J643896J558542
673.1E92300534J486361J630605K146482K313912J768649J001179O55234P37488O64651
$$ y = [548667073, 549760342, 550444126, 550149620, 548372805, 545501173, 542362034, 539429307, 536210716, 531881988, 526450217, 520674944, 515270829, 510658383, 507247448, 505639374, 506426513, 509711146, 514633298, 519990265, 525270998, 530423045, 535040021, 538385510, 539974689, 540226042, 540176749, 540344417, 540339708, 539774776, 539123356, 539250672, 540367544, 541797936, 543058515, 544568658, 547002375, 550434649, 554265976, 557828486, 561042666, 564279437, 567470431, 570061147, 571706533, 572851002, 574265063, 576103330, 577769697, 578743994, 579405844, 580501556, 582040489, 583308816, 583876908, 584207952, 584998846, 586095154, 586870432, 587248981, 587770820, 589098096, 590741992, 592300534, 593786895, 595417500, 597563982, 599877894, 601646543, 602647722, 603302956, 604040444, 604705095]
691.4F04705095l7729j060665j780152k045036k120137k261996k220214j387715J50859
709.8E91942310J623452K544701L148437L957748M999220N628884N510688N043149
726.1F24398589M678965M535913M229427L427684K473175J844347J404285O34015o16789
744.4F47009611j957059k834797l227412l594220m110456m413545m121601l147245
760.8F19603276j886666p51912O33061K568424M606485O130218O799996O823361O714940
779.1F51241183O618619O255806N462587M530608L951848L850519L893376L698766
795.4F89503312L499389L717661M030883L820658L081500K313376J903116J871825
811.7G13741720J767337J267314N96464J47640l5464m50075j455903k655447l433466
$$ y = [604705095, 604667366, 603606701, 601826549, 599781513, 597661376, 595399380, 593179166, 591791451, 591942310, 593565762, 596110463, 599258900, 603216648, 608215868, 613844752, 619355440, 624398589, 629077554, 633613467, 637842894, 641270578, 643743753, 645588100, 646992385, 647626400, 647009611, 645052552, 642217755, 638990343, 635396123, 631285667, 626872122, 622750521, 619603276, 617716610, 616964698, 617597759, 620166183, 624772668, 630902886, 637702882, 644526243, 651241183, 657859802, 664115608, 669578195, 674108803, 678060651, 681911170, 685804546, 689503312, 693002701, 696720362, 700751245, 704571903, 707653403, 709966779, 711869895, 713741720, 715509057, 716776371, 717372835, 717520475, 717485011, 717034936, 715579033, 712923586, 709490120]
830.1G09490120l642022l668964l936231m214704m072964l540397l033400k931595
846.4F80449843l070712l021419k833307k927839l371835l358126j721263J660884
862.7F61806226N327523P666409Q510708Q540750P921457O336332L879487J201749
879.1G11190641j061916k774060m156649n245328n889237n838454n094886m202723
895.4F76927388l693879l601074l667474l846884m348874n361557o652772p665992
911.7F38088882q210897q423269q238733p354558n650460l570199j828611p63178o8903
930E93980074P31528J688361K522528L087580L453017L419935K326250k93791l985941
948.4F06929541p592857j0258377j1955082j3116062j4138699j5142023j6028226j6727030
$$ y = [709490120, 705848098, 702179134, 698242903, 694028199, 689955235, 686414838, 683381438, 680449843, 677379131, 674357712, 671524405, 668596566, 665224731, 661866605, 660145342, 661806226, 667133749, 674800158, 683310866, 691851616, 699773073, 706109405, 709988892, 711190641, 710128725, 707354665, 703198016, 697952688, 692063451, 686224997, 681130111, 676927388, 673233509, 669632435, 665964961, 662118077, 657769203, 652407646, 645754874, 638088882, 629877985, 621454716, 613215983, 605861425, 600210965, 596640766, 594812155, 594048977, 593980074, 594711602, 596399963, 598922491, 602010071, 605463088, 608883023, 611209273, 610915482, 606929541, 599336684, 589078307, 577123225, 564007163, 549868464, 534726441, 518698215, 501971185]
964.7E01971185j7350048j8040061j8701970j9079268j9005835j8403888j7195702
979C74194413j5311718j2844801j0047644p210284m703194k736748j256614j89156
995.3C19894254M74155P51078P12097M24594n6178n58555r05901j039147q86292m16755
1015.7C18393350K87532J045287J723886K307862K774119L057152L129482K973587
1032C35692257K561301J987874J420111J019627Q15063P50512Q63433J264274K061606
1050.4C48436058L230720M544169N735636O803661P921487R017498R406894P843316
1066.7D02939439L379941l012866q182824r500205p332742l910214q79467J308650
1083C74809712K801985L807544M553646N173505N494207N281269M464120L210813J896620
$$ y = [501971185, 484621137, 466581076, 447879106, 428799838, 409794003, 391390115, 374194413, 358882695, 346037894, 335990250, 328779966, 324076772, 321340024, 320083410, 319894254, 320368409, 321119487, 321831584, 322256178, 322200000, 321641445, 320735544, 319696397, 318810105, 318393350, 318680882, 319726169, 321450055, 323757917, 326532036, 329589188, 332718670, 335692257, 338253558, 340241432, 341661543, 342681170, 343496233, 344246745, 345110178, 346374452, 348436058, 351666778, 356210947, 361946583, 368750244, 376671731, 385689229, 395096123, 402939439, 406319380, 403306514, 395123690, 385623485, 378290743, 374380529, 373501062, 374809712, 377611697, 381419241, 385972887, 391146392, 396640599, 401921868, 406385988, 409596801, 411493421]
1101.4D11493421J026123R81450J706124K762526L688991M240155M362047M059106
1117.7D34319943L438831K810567K543539K818167L536433M393101M724741L863513
1134D62448835J793743j009912l867745o076217p278561p517040p029474o158352n047202
1152.4D20258075l697544k286733q96304N68866K214879M140735O305784Q448213J0284186
1170.7D45340157J1681348J2661069J3266266J3516754J3401299J2868345J1988938
1185E34724176J0864258R411931P558644N519569L701508K423942J703918J342237
1201.3E77250183J241684J492381K133071K931655L492832L658652L582001L305018
1217.6E99087477K709746J756370N85616m61221j100481j388490j579344j717031j646936
$$ y = [411493421, 412519544, 413500994, 415207118, 417969644, 421658635, 425898790, 430260837, 434319943, 437758774, 440569341, 443112880, 445931047, 449467480, 453860581, 458585322, 462448835, 464242578, 463232666, 459364921, 453288704, 446010143, 438493103, 431463629, 425305277, 420258075, 416560531, 414273798, 413377494, 413946360, 416161239, 420301974, 426607758, 435055971, 445340157, 457021505, 469682574, 482948840, 496465594, 509866893, 522735238, 534724176, 545588434, 555000365, 562559009, 568078578, 571780086, 574204028, 575907946, 577250183, 578491867, 579984248, 582117319, 585048974, 588541806, 592200458, 595782459, 599087477, 601797223, 603553593, 604139209, 603677988, 602577507, 601189017, 599609673, 597892642, 596245706]
1236E96245706j338184q98421m57823n4002M33803J071751J686037J991391J879036
1254.3F00559294J606286J497745J569450J631737J636684J789749K170145K462626
1270.6F14923716K273976J595855Q46267L84867J70827P212j98901l87847m48823m98712
1291F18668437p77960j280963j759649j947283j846135j773953j965523k242625k242386
1309.4F02831960j989305j827181j800120j668632j386761j276016j719356k701163
1325.7E88463426l697753m126191l913820l366471k678692j874804r60529p5937M48406
1344.1E68217635M50790J24455j95325l86357o16849r76503j285552j369119j283884
1362.4E62679291j134038j046062r35614m28617M14193J093566J275897J248241J383662
$$ y = [596245706, 594907522, 594009101, 593551278, 593497276, 593931079, 595002830, 596688867, 598680258, 600559294, 602165580, 603663325, 605232775, 606864512, 608501196, 610290945, 612461090, 614923716, 617197692, 618793547, 619639814, 620024681, 620195508, 620202720, 620003819, 619615972, 619167149, 618668437, 617890477, 616609514, 614849865, 612902582, 611056447, 609282494, 607316971, 605074346, 602831960, 600842655, 599015474, 597215354, 595546722, 594159961, 592883945, 591164589, 588463426, 584765673, 580639482, 576725662, 573359191, 570680499, 568805695, 567845166, 567769229, 568217635, 568668425, 568792880, 568597555, 568211198, 567594349, 566617846, 565332294, 563963175, 562679291, 561545253, 560499191, 559563577, 559134960, 559549153, 560642719, 561918616, 563166857, 564550519]
1380.8E64550519J889944K884865L988981M149258L327370K545893J732230O15239
1397.1E85684299l99231q80838r47833j127660j513124j868546j967251j706958j345575
1415.5E73927283j284122j425207j011848k56300K25425M36961N69642Q12769J211226
1433.8E73205829J621723J632571J330078J389980J540244J360476O92784j42753n76675
1452.2E82054257o02245p56323j026333m46319O46949K065062L405631M250407N552471
1470.5E95143557P758915Q615434P862449P128119O597638O309271O028295N888104
1486.8F51331782N676747M971146M017651L874660M173756L560006K629578K296210
1503.2F82531536K881288L587663K559245J727819J858116K301395K643346K483070
$$ y = [564550519, 566440463, 569325328, 573314309, 577463567, 580790937, 583336830, 585069060, 585684299, 585285068, 584404230, 583456397, 582328737, 580815613, 578947067, 576979816, 575272858, 573927283, 572643161, 571217954, 570206106, 569949806, 570175231, 570612192, 571181834, 571994603, 573205829, 574827552, 576460123, 577790201, 579180181, 580720425, 582080901, 582773685, 582630932, 582054257, 581452012, 580695689, 579669356, 579223037, 579869986, 581935048, 585340679, 589591086, 595143557, 602902472, 611517906, 619380355, 626508474, 633106112, 639415383, 645443678, 651331782, 657008529, 661979675, 665997326, 669871986, 674045742, 677605748, 680235326, 682531536, 685412824, 689000487, 691559732, 693287551, 695145667, 697447062, 700090408, 702573478]
1519.5G02573478K207875J871467J794458J921832J635492J371026J302361J269579
1535.8G15947568J522184J839161J158774O22809Q17954J036525J041531Q05557P03573
1554.1G25495636Q96037J154304N22196k59042k86937n7399J4246m06504q82387j128912
1574.5G25061238j479626j613796j746118k295971k722144k799630k795160l023386
1590.9G06585407l430962l767193l731489l487408l567636l942728m137456l981412
1607.2F76539123l826559l823041l871978m267216m672527l643691k918363l408313
1623.5F46107435l521144l057003k588451j980066j662732j895427j501143n28693
1639.8F29372776J32560N47588R95338J465023J699269K484619L296614K513826K440691
$$ y = [702573478, 704781353, 706652820, 708447278, 710369110, 712004602, 713375628, 714677989, 715947568, 717469752, 719308913, 720467687, 721090496, 721908450, 722944975, 723986506, 724792063, 725495636, 726391673, 727545977, 728068173, 727809131, 727522194, 727464795, 727479041, 727072537, 726190150, 725061238, 723581612, 721967816, 720221698, 717925727, 715203583, 712403953, 709608793, 706585407, 703154445, 699387252, 695655763, 692168355, 688600719, 684657991, 680520535, 676539123, 672712564, 668889523, 665017545, 660750329, 656077802, 652434111, 649515748, 646107435, 642586291, 639529288, 636940837, 634960771, 633298039, 631402612, 629901469, 629372776, 629505336, 630052924, 631048262, 632513285, 634212554, 636697173, 639993787, 642507613, 644948304]
1658.2F44948304L260791M043877M084647L650904M108250M852354M510761M451572
1674.5F77911460M545212M083514M031539M624486N290568M211068L338933L555298
1690.8G11592078L450275L507018L356814K898276K905846K211928J608312J325309
1707.1G32855856R15289Q20220Q51810P01189L24070n3048r119J67310J58667J1087
1727.5G36743331r894J58190M09067L86238L42548O69658J080632J428068J733959
1745.9G42941797J956343K216936K436161K441525K608061K756536K763152L024459
1762.2G63144970K950132K698421K634406K519370K452194K076388J573324J429021
1778.5G81478226J359046J190304J124979J092195R79364R51290R77933Q06749O81758
$$ y = [644948304, 648209095, 652252972, 656337619, 659988523, 664096773, 668949127, 673459888, 677911460, 682456672, 686540186, 690571725, 695196211, 700486779, 704697847, 708036780, 711592078, 715042353, 718549371, 721906185, 724804461, 727710307, 729922235, 731530547, 732855856, 733771145, 734591365, 735443175, 736144364, 736468434, 736415386, 736406267, 736573577, 736732244, 736743331, 736733437, 736891627, 737300694, 737686932, 738029480, 738699138, 739779770, 741207838, 742941797, 744898140, 747115076, 749551237, 751992762, 754600823, 757357359, 760120511, 763144970, 766095102, 768793523, 771427929, 773947299, 776399493, 778475881, 780049205, 781478226, 782837272, 784027576, 785152555, 786244750, 787224114, 788175404, 789153337, 789960086, 790641844]
1796.9G90641844P12514P24137O73592O44446O76453O88016O31392N35905N22912N40435
1817.2G96991646N34058N34594N49376N24759M59552M62353M05610L18646L15488L07858
1837.6H01403940K75612L18944L84808K66969J11103J35004K09034J96636J58965J53780
1858H03614795J75476K12193K31802J91868J38044J42217J91629K11715J58727J17302
1878.4H05385768J69456K85149L25918K26796J27137J48654K26914K47539J46746J3590
1898.8H07303667K8491J42276J68920O1691l9101M828J36376J93178J21474q404l2604
1921.3H08080792R9183J75416Q2791m6134k9683J12772J67608Q6546J0610L7133J12236
1943.7H08889270J47879Q7500q882J5915J47998K15054J46866K8550p570R0242J71304
$$ y = [790641844, 791354358, 792078495, 792752087, 793396533, 794072986, 794761002, 795392394, 795928299, 796451211, 796991646, 797525704, 798060298, 798609674, 799134433, 799593985, 800056338, 800461948, 800780594, 801096082, 801403940, 801679552, 801998496, 802383304, 802650273, 802761376, 802896380, 803105414, 803302050, 803461015, 803614795, 803790271, 804002464, 804234266, 804426134, 804564178, 804706395, 804898024, 805109739, 805268466, 805385768, 805555224, 805840373, 806166291, 806393087, 806520224, 806668878, 806895792, 807143331, 807290077, 807303667, 807332158, 807474434, 807643354, 807705045, 807665944, 807670772, 807807148, 808000326, 808121800, 808113396, 808080792, 808179975, 808355391, 808438182, 808392048, 808362365, 808475137, 808642745, 808729291, 808739901, 808777034, 808889270, 809037149, 809124649, 809115767, 809131682, 809279680, 809494734, 809641600, 809670150, 809662580, 809752822, 809924126]
1966.1H09924126J07407m470j7524P4148J51992J09732k1279q2075n245Q4340L0637
1988.6H10351789q7321r8049k9982L8267M4524o4552j68442j39177p9930j35243k77460
2011H09354424l33726k48194j80483k47418l59238l88801l32176k70486k99275l86059
2031.4H06308568m17889l56078k67803k50996l01122l17753k37226j32561j08301j52290
2051.8H03766549j61589q4161J1563K5749q583o258L7849P3671L4392l7253m8816j4603
2076.3H03588510J9490M3869N3346O2883P2301O6459M9055J8954K9921R3341J24216
2098.7H04222345R3937P0334Q7440J15931J13666M2379k7120k444P5877R0956K0862
2121.1H04904163m0054k7895K7656M9591J908p6831p4684L2901Q8752J8894m8637j8716
$$ y = [809924126, 810031533, 810027063, 810009539, 810083687, 810235679, 810345411, 810324132, 810242057, 810236812, 810321152, 810351789, 810264468, 810166419, 810136437, 810174704, 810219228, 810154676, 809986234, 809847057, 809767127, 809631884, 809354424, 809020698, 808772504, 808592021, 808344603, 807985365, 807596564, 807264388, 806993902, 806694627, 806308568, 805890679, 805534601, 805266798, 805015802, 804714680, 804396927, 804159701, 804027140, 803918839, 803766549, 803604960, 803520799, 803532362, 803558111, 803549528, 803543270, 803581119, 803654790, 803689182, 803651929, 803603113, 803588510, 803608000, 803651869, 803705215, 803768098, 803840399, 803906858, 803955913, 803974867, 804004788, 804098129, 804222345, 804316282, 804386616, 804474056, 804589987, 804703653, 804746032, 804718912, 804716468, 804792345, 804883301, 804904163, 804864109, 804836214, 804863870, 804913461, 804915369, 804838538, 804763854, 804796755, 804885507, 804904401, 804855764, 804837048]
2145.6H04837048P3552J19507O3837P331M9890J53899K20060K01106J55389K16306
2166H06097925L59595L94821L11434K61009L11017M13120M53054L52920K37226K73705
2186.4H09465826L94105M15564L17931K27630K49923L51250L84152K90870J91927K40088
2206.8H12529266L69668L99887L11971K03669J91212K83062L33071K36452J16527J55985
2227.2H15130770K98500L38137K17319Q2076Q1837J91688K58148K03371J04129R6560
2247.6H17002535J94251K44975J57595N3823P6413K11358L07680J99258J5259K7954
2268H18491101J64569K35974K21789J35601R2328J88946K72393J94788L7551n126J21832
2290.4H20151746K52426J92523o914r0122K7477J74463J65343M6373J6987J04487J49548
$$ y = [804837048, 804910600, 805030107, 805093944, 805101275, 805151165, 805305064, 805525124, 805726230, 805881619, 806097925, 806457520, 806852341, 807163775, 807424784, 807735801, 808148921, 808601975, 808954895, 809192121, 809465826, 809859931, 810275495, 810593426, 810821056, 811070979, 811422229, 811806381, 812097251, 812289178, 812529266, 812898934, 813298821, 813610792, 813814461, 814005673, 814288735, 814621806, 814858258, 814974785, 815130770, 815429270, 815767407, 815984726, 816066802, 816148639, 816340327, 816598475, 816801846, 816905975, 817002535, 817196786, 817441761, 817599356, 817653179, 817729592, 817940950, 818248630, 818447888, 818463147, 818491101, 818655670, 818891644, 819113433, 819249034, 819341362, 819530308, 819802701, 819997489, 820035040, 820029914, 820151746, 820404172, 820596695, 820589781, 820499659, 820527136, 820701599, 820866942, 820913315, 820930302, 821034789, 821184337]
2312.9H21184337O5565n7161o7353P6115K06471J14679j04606j33216J0490O0499k5928
2335.3H21329892j94490k71976j31548L4452o5565l71874m31001j34885K09093K40266
2355.7H20212364L0756j62542j36137m2677q6188k11835k89559k46942j23859q2969
2376.1H18860412k13921l15786k13206o2704q8751k27153k64883j59860n0843n9664
2396.5H17203641j96099l15190k56777j17063j14083k78056m04119l52622k21550j84953
2416.9H14763129l19600m69327m41075l01957k68042m08113n41091m70638l01302k75612
2437.3H10966372m09543n18262m66109l51667l56317m76360n52654m57406k80440k59221
2457.7H06838393m12643n18024m42862k85685k47717l66986m77493m50074l16203k31922
$$ y = [821184337, 821249902, 821192741, 821125388, 821201503, 821407974, 821522653, 821418047, 821284831, 821295321, 821355820, 821329892, 821135402, 820863426, 820731878, 820766330, 820700765, 820328891, 819897890, 819763005, 819972098, 820212364, 820243120, 820080578, 819944441, 819901764, 819815576, 819603741, 819314182, 819067240, 818943381, 818860412, 818646491, 818330705, 818117499, 818054795, 817966044, 817738891, 817474008, 817314148, 817263305, 817203641, 817007542, 816692352, 816435575, 816318512, 816204429, 815926373, 815522254, 815169632, 814948082, 814763129, 814443529, 813974202, 813533127, 813231170, 812963128, 812555015, 812013924, 811543286, 811241984, 810966372, 810556829, 810038567, 809572458, 809220791, 808864474, 808388114, 807835460, 807378054, 807097614, 806838393, 806425750, 805907726, 805464864, 805179179, 804931462, 804564476, 804086983, 803636909, 803320706, 803088784]
2478.1H03088784l23653m66764m16517k20299j38104k63154m24266l88086j84834q9050
2498.5H00174057k17437l69668l30866j65164q1360j69039l33309l68059k32101j42872
2518.9G97764182k42829l94702l96490k82467k52664l75628n11766n06580l64303k74599
2539.2G94162154l93748n63681n49972l95298l25144m26292n48363n10812l40998k73585
2559.6G89834261l87490n08606m98593l98219l41534l81887m75049n14984m27068l16500
2580G85584331l22342m00365m20332l18646k16961k72811l96966m08233k82347j92821
2600.4G82352507k67744m06980m71056m18663l67165m45008n71787o31511o10769n61476
2620.8G77600348n86510p15434q36075q40127p84755p88212q75413r42469q96036q21054
$$ y = [803088784, 802765131, 802298367, 801881850, 801661551, 801523447, 801260293, 800836027, 800447941, 800263107, 800174057, 799956620, 799586952, 799256086, 799090922, 799009562, 798840523, 798507214, 798139155, 797907054, 797764182, 797521353, 797126651, 796730161, 796447694, 796195030, 795819402, 795307636, 794801056, 794436753, 794162154, 793768406, 793204725, 792654753, 792259455, 791934311, 791508019, 790959656, 790448844, 790107846, 789834261, 789446771, 788938165, 788439572, 788041353, 787699819, 787317932, 786842883, 786327899, 785900831, 785584331, 785261989, 784861624, 784441292, 784122646, 783905685, 783632874, 783235908, 782827675, 782545328, 782352507, 782084763, 781677783, 781206727, 780788064, 780420899, 779975891, 779404104, 778772593, 778161824, 777600348, 777013838, 776298404, 775462329, 774622202, 773837447, 773049235, 772173822, 771231353, 770335317, 769514263]
2641.2G69514263q22425q78990r01401q44717p86900p96259q55267q96513q35181p33793
2661.6G61162817p16030p78020q38339p96199o83903o56426p26760p68721p25090o49989
2682G53823340o21557o70672p39336p32243o69598o73831p63953q44478q40664q01087
2702.4G46465921q15034q63194q81612q54910q09431q11815q68380q62837p96318p81000
2722.8G38121390p81357p21693o64651o47962o39737o38962o33120o14763n84543n57065
2743.2G31637537n58257n74588n73755n62906n68092n66959n41091m87983m38869m52042
2763.6G26312995n18739n80132n73635n20111n49376o61671p09057p09950p49708p97212
2784G19943404q42750q90195r21309r71318j061141j157880j242816j289428j294374
$$ y = [769514263, 768691838, 767812848, 766911447, 766066730, 765279830, 764483571, 763628304, 762731791, 761896610, 761162817, 760446787, 759668767, 758830428, 758034229, 757350326, 756693900, 755967140, 755198419, 754473329, 753823340, 753201783, 752531111, 751791775, 751059532, 750389934, 749716103, 748952150, 748107672, 747267008, 746465921, 745650887, 744787693, 743906081, 743051171, 742241740, 741429925, 740561545, 739698708, 738902390, 738121390, 737340033, 736618340, 735953689, 735305727, 734665990, 734027028, 733393908, 732779145, 732194602, 731637537, 731079280, 730504692, 729930937, 729368031, 728799939, 728232980, 727691889, 727203906, 726765037, 726312995, 725794256, 725214124, 724640489, 724120378, 723571002, 722909331, 722200274, 721490324, 720740616, 719943404, 719100654, 718210459, 717289150, 716317832, 715256691, 714098811, 712855995, 711566567, 710272193]
2802.3G10272193j333475j445115j533985j549184j579166j651346j739622j827478
2818.7F97612822j866519j878739j953840k078652k169371k202630k237201k338827
2835F80887043k465009k595306k763331k946078l153086l332317l340542l155113k892851
2853.3F54243410k709866k683341k781630k960801l224969l586531l999769m370928
2869.7F27925575m592002m677236m737735m682660m373610l847718l219366k613604
2886E95181644k077520j599014j151561p90060o54042p03811p44462p78378r25779
2904.3E85757017j172006j473248j807272k191067k627552k979815l117084l034413
2920.6E67354560k758682k318680j744569j090407l82483M74990J485049K462745L234267
$$ y = [710272193, 708938718, 707493603, 705959618, 704410434, 702831268, 701179922, 699440300, 697612822, 695746303, 693867564, 691913724, 689835072, 687665701, 685463071, 683225870, 680887043, 678422034, 675826728, 673063397, 670117319, 666964233, 663631916, 660291374, 657136261, 654243410, 651533544, 648850203, 646068573, 643107772, 639882803, 636296272, 632296503, 627925575, 623333573, 618656337, 613918602, 609235942, 604862332, 601014614, 597795248, 595181644, 593104124, 591505110, 590353549, 589563489, 588909447, 588205636, 587461174, 586682796, 585757017, 584585011, 583111763, 581304491, 579113424, 576485872, 573506057, 570388973, 567354560, 564595878, 562277198, 560532629, 559442222, 559059739, 559534729, 561019778, 563482523, 566716790]
2939E66716790L814221M329145M718661M882157M939675M996896N008817M977285M923821
2957.4F09307468M794180M556537M257500L976345L727138L497243L343880L276170
2973.7F40736461L215074L196895L184557K982438K689361K498210K322555K089977
2990F62915528J784682J388669J086474R12308O52373L46243P0990j87517l37541m44531
3010.4F68187678o97792j042902j279473j380206j472950j609563j755596j883030
3026.7F57066166j916647j887917j921415k060771k223850k214849k121865k218545
3043F40500307k439260k516210k414465k388955k498328k558410k595544k638698k562225
3061.4F17888212k442717k423764k523064k663136k705395k635777k496719k411962
$$ y = [566716790, 570531011, 574860156, 579578817, 584460974, 589400649, 594397545, 599406362, 604383647, 609307468, 614101648, 618658185, 622915685, 626892030, 630619168, 634116411, 637460291, 640736461, 643951535, 647148430, 650332987, 653315425, 656004786, 658502996, 660825551, 662915528, 664700210, 666088879, 667175353, 668087661, 668740034, 669086277, 669157267, 668969750, 668632209, 668187678, 667489886, 666446984, 665167511, 663787305, 662314355, 660704792, 658949196, 657066166, 655149519, 653261602, 651340187, 649279416, 647055566, 644840717, 642718852, 640500307, 638061047, 635544837, 633130372, 630741417, 628243089, 625684679, 623089135, 620450437, 617888212, 615445495, 613021731, 610498667, 607835531, 605130136, 602494359, 599997640, 597585678]
3077.7E97585678k521574k649129k666890k696097k688647k630770k692282k779603
3094E76260686k707541k579272k563298k657950k721071k628743k527237k590597k562285
3112.4E52722692k343356k310038k508878k715052k833724k776503k611578k503931
3128.7E32119632k491951k508879k454877k324402k287567k434611k534092k471745
3145E12611508k399802k294242k150119k223670k455354k472728k307624k206236k184480
3163.4D91917253k175004k168506k163410k124399k077014k077907k073914k002388
3179.7D75054711j950383j971960j961529j899600j903862j931727j901448j861751
3196D59672451j808643j756668j740665j707405j661211j680404j713305j670689j602769
$$ y = [597585678, 595064104, 592414975, 589748085, 587051988, 584363341, 581732571, 579040289, 576260686, 573553145, 570973873, 568410575, 565752625, 563031554, 560402811, 557875574, 555284977, 552722692, 550379336, 548069298, 545560420, 542845368, 540011644, 537235141, 534623563, 532119632, 529627681, 527118802, 524663925, 522339523, 520051956, 517617345, 515083253, 512611508, 510211706, 507917464, 505767345, 503543675, 501088321, 498615593, 496307969, 494101733, 491917253, 489742249, 487573743, 485410333, 483285934, 481208920, 479131013, 477057099, 475054711, 473104328, 471132368, 469170839, 467271239, 465367377, 463435650, 461534202, 459672451, 457863808, 456107140, 454366475, 452659070, 450997859, 449317455, 447604150, 445933461, 444330692]
3214.3D44330692j563459j552463j551390j529276j500010j467288j386791j274229
3230.7D32505786j254588j424104j554429j448691j308412j243502j172423j167029
3247D21932608j276523j298279j161903j065910j102984j126617j069337j028865r94146
3265.3D11808044q82387p65771q59469j038224j051605j018226r71377q97318r05901
3283.7D03417766r28044q59469p21574o93947q66652j002341j019180j000703q50051
3302C95475805o37502o94453r97842j220196j265317j188577j104742j070708j046300
3320.4C86250168j022667j039475j173019j295775j243920j128792j038939r69827
3336.7C77337754j029700j142949j155555j176387j125128r29445r40978j193315j303017
$$ y = [444330692, 442767233, 441214770, 439663380, 438134104, 436634094, 435166806, 433780015, 432505786, 431251198, 429827094, 428272665, 426823974, 425515562, 424272060, 423099637, 421932608, 420656085, 419357806, 418195903, 417129993, 416027009, 414900392, 413831055, 412802190, 411808044, 410925657, 410159886, 409300417, 408262193, 407210588, 406192362, 405220985, 404323667, 403417766, 402489722, 401630253, 400908679, 400214732, 399348080, 398345739, 397326559, 396325856, 395475805, 394838303, 394143850, 393146008, 391925812, 390660495, 389471918, 388367176, 387296468, 386250168, 385227501, 384188026, 383015007, 381719232, 380475312, 379346520, 378307581, 377337754, 376308054, 375165105, 374009550, 372833163, 371708035, 370778590, 369837612, 368644297, 367341280]
3355.1C67341280j183957j005739r37581r54598q61615p51555r03755j240403j322120
3373.4C58179957j079351q93086q68082q82685q33542p21931n75245l84300m41373
3391.8C51500362p82072q43525m84974k56091n33670q66234p14034m17918l63499m13329
3412.2C45825016m52727m57555l70204k97695k75344j36048N7489J47521J06454J08272
3432.6C44255179K25574J74701p0631j26064J04397L42995M07398L61830L91036M77434
3453C46543849N45263O35594P04884O43373O41227Q84264J016140P24078L50743M12345
3473.4C53101760P22587R30399R40591P19816O53117Q66324R10044Q14080Q85218J029343
3493.8C61573279J113653J064152R76860R84728R37552Q45462Q93593J064598J222044
$$ y = [367341280, 366157323, 365151584, 364214003, 363259405, 362397790, 361646235, 360742480, 359502077, 358179957, 357100606, 356207520, 355339438, 354456753, 353623211, 352901280, 352326035, 351941735, 351500362, 350718290, 349874765, 349389791, 349133700, 348600030, 347733796, 347019762, 346601844, 346238345, 345825016, 345372289, 344914734, 344544530, 344246835, 343971491, 343835443, 343892932, 344040453, 344146907, 344255179, 344480753, 344655454, 344584823, 344458759, 344563156, 344906151, 345313549, 345675379, 346066415, 346543849, 347089112, 347724706, 348429590, 349072963, 349714190, 350598454, 351614594, 352338672, 352689415, 353101760, 353824347, 354754746, 355695337, 356415153, 357068270, 357934594, 358844638, 359658718, 360543936, 361573279, 362686932, 363751084, 364727944, 365712672, 366650224, 367495686, 368389279, 369453877, 370675921]
3512.1C70675921J186014J050383J091510J263499J381308J254648J011967J006246
3528.4C79921496J190305J340866J437723J430095J369327J506060J678348J611680
3544.7C91485900J382589J330733J508803J631319J682490J811057J974196J981079
3561.1D04788166J862020J953423K303749K427310K266019K244115K443284K633899
3577.4D22921985K765358K851546K844065K831787K877504K953380L004253L102928
3593.7D46152806L213227L322095L407866L366380L246546L222615L425389L595382
3610D72952306L620237L549993L382832L606618L991812L666550L104597L098220L888726
3628.4E04861891M249275L591716L369928L444731L438413L489673L409982L196537
$$ y = [370675921, 371861935, 372912318, 374003828, 375267327, 376648635, 377903283, 378915250, 379921496, 381111801, 382452667, 383890390, 385320485, 386689812, 388195872, 389874220, 391485900, 392868489, 394199222, 395708025, 397339344, 399021834, 400832891, 402807087, 404788166, 406650186, 408603609, 410907358, 413334668, 415600687, 417844802, 420288086, 422921985, 425687343, 428538889, 431382954, 434214741, 437092245, 440045625, 443049878, 446152806, 449366033, 452688128, 456095994, 459462374, 462708920, 465931535, 469356924, 472952306, 476572543, 480122536, 483505368, 487111986, 491103798, 494770348, 497874945, 500973165, 504861891, 509111166, 512702882, 516072810, 519517541, 522955954, 526445627, 529855609, 533052146]
3644.7E33052146L414453M184663M137695L148019L029048L594876L472090L035783
3661E61068773K880156K753318K710461L100694L173053K685904K996564L060997K372026
3679.4E86801946K197743K181708K161921K602756K871334K226412J736164J754523
3695.7F04534507J753926J746953J917779J840234J461148J358926J734853K094746
3712F18443072J706898J154006J050114J185239J288175J300156J219929R81211R04143
3730.3F29232943J239538J654864J677036J013398L03030N71549J503468J307427Q68619
3748.7F39371872J388609J370728P41899O98150J039564R90153O91890P36237Q87275
3767.1F47916377J012742R81391O50286N04494P64072J039207Q59082O03854O59764
$$ y = [533052146, 536466599, 540651262, 544788957, 547936976, 550966024, 554560900, 558032990, 561068773, 563948929, 566702247, 569412708, 572513402, 575686455, 578372359, 581368923, 584429920, 586801946, 588999689, 591181397, 593343318, 595946074, 598817408, 601043820, 602779984, 604534507, 606288433, 608035386, 609953165, 611793399, 613254547, 614613473, 616348326, 618443072, 620149970, 621303976, 622354090, 623539329, 624827504, 626127660, 627347589, 628328800, 629232943, 630472481, 632127345, 633804381, 634817779, 635120809, 635692358, 637195826, 638503253, 639371872, 640760481, 642131209, 642873108, 643571258, 644610822, 645600975, 646292865, 647029102, 647916377, 648929119, 649910510, 650560796, 651065290, 651829362, 652868569, 653727651, 654331505, 654991269]
3785.4F54991269O89089O23346N63264N60045O76274O02961O26504R91583P30574N01275
3805.8F61556184P58767N12779J75238L73006P98165O98686P03752R19521M27842J73748
3826.2F67097688L07977L86596M94659N31435O45220P85291N44548L55661M06384J71245
3846.6F71726704k12014k5332J158774J609385K82466l44634m7922M37856N50151K88725
3867F75424159M42087O64413L94404J91391R7215L02493N30541M13776N18024L29792
3887.4F79308295L7492L38137L23176n7340L9578M08053N36144N02825L62515P3493
3907.8F81872368O854J16349J29640K15053L37422K20537Q9765K06769K41398R7990
3928.2F83534145J66417L78251L02553L6120l8504R4592K26259K05398J95146K59161
$$ y = [654991269, 655680358, 656303704, 656866968, 657427013, 658103287, 658706248, 659332752, 660324335, 661054909, 661556184, 662314951, 662827730, 663002968, 663375974, 664174139, 664872825, 665576577, 666496098, 666923940, 667097688, 667405665, 667792261, 668286920, 668818355, 669463575, 670248866, 670793414, 671149075, 671555459, 671726704, 671514690, 671489358, 672648132, 674257517, 674539983, 674195349, 674147427, 674585283, 675135434, 675424159, 675866246, 676530659, 676925063, 677116454, 677213669, 677516162, 678046703, 678460479, 678978503, 679308295, 679345787, 679683924, 680007100, 679949760, 679989338, 680397391, 680933535, 681436360, 681798875, 681872368, 681879222, 681995571, 682125211, 682340264, 682677686, 682898223, 682987988, 683194757, 683436155, 683534145, 683700562, 684078813, 684381366, 684417486, 684378982, 684473574, 684699833, 684905231, 685100377, 685359538]
3948.6F85359538J79767N8174Q3924J70767K19166K34306K12968J03950J0908R0658
3969F86724126J94788J87695J68324J16169L5763J18017K38121J50621O5148J24097
3989.4F88122869J33097J01447J41322J29402
3997.5F88628137
$$ y = [685359538, 685539305, 685597479, 685681403, 685852170, 686071336, 686305642, 686518610, 686622560, 686633468, 686724126, 686918914, 687106609, 687274933, 687391102, 687426865, 687544882, 687783003, 687933624, 687998772, 688122869, 688255966, 688357413, 688498735, 688628137]
##END=$$ End of the data block
