##TITLE=Fibra Residuo - Bianca $$ Begin of the data block
##JCAMP-DX=5.00 $$ ACD/SpecManager v 10.08
##SPECTROMETER/DATA SYSTEM=Alpha
##DATE=24 Oct 2013 13:19:44
##DATA TYPE=INFRARED SPECTRUM
##DATA CLASS=XYDATA
##ORIGIN=
##OWNER=
##NPOINTS=1765
##FIRSTX=399.75695801
##LASTX=3997.56933594
##MAXX=3997.56933594
##MINX=399.75695801
##MAXY=0.77851945
##MINY=0.38506106
##XFACTOR=1.0000000000
##YFACTOR=1.000000000000000e-9
##FIRSTY=0.67221826
##DELTAX=2.03957629
##XUNITS=1/CM
##YUNITS=ARBITRARY UNITS
##XYDATA=(X++(Y..Y))
399.8 672218263 670452297 666613936 664641738 666075706 667652130 666612089 664317608 663567781 664794147
418.1 664794147 665040672 662239552 659060061 658500552 659369349 658179104 654588103 651968658 652719617
436.5 652719617 654653370 654544771 653318942 654242456 657544672 660089970 659713805 658025146 657999277
454.8 657999277 659697235 660096884 657596231 654704690 654303849 655331194 654276550 650724292 648002863
473.2 648002863 648177624 649096310 647940636 645227671 643991113 645323217 646649718 645522237 643095672
491.5 643095672 642369509 643608093 643938422 641692102 638792098 637860537 638214827 637158692 634037435
509.9 634037435 630822718 629191279 628343225 626137197 622602820 620090663 619749725 620190203 619274437
528.3 619274437 617471397 617446005 620002091 623134673 625086665 626310050 628292263 631052256 632670462
546.6 632670462 631884515 629985392 629059255 628925741 627443969 624084294 620872200 619369447 618617535
565 618617535 616516352 612771869 609507024 608436227 608857393 609203339 609564602 611357749 615000546
583.3 615000546 618949533 621341586 622125685 622729421 623885870 624712110 624267161 623178244 622751415
601.7 622751415 623159707 623358190 622624993 621704638 621855676 623045385 623968184 624389827 625563920
620 625563920 628084719 631346047 634038985 635435760 636357903 637823939 639607251 640716553 640770733
638.4 640770733 640652180 641346514 642449558 642815173 642381132 642301679 643176079 644284129 644559205 643992960
658.8 643992960 643772721 644511878 644231737 640309632 637588084 641459465 645675004 648317039 649898827
677.1 649898827 651037216 652669907 655144334 657589912 658952892 659515977 660428286 661935270 663047373
695.5 663047373 662843943 661775649 661080420 661087573 661083579 660675764 660509408 661586046 663960695 666463375
715.9 666463375 668219447 670248151 673908055 678398371 682197750 684857309 687031686 689667881
732.2 689667881 692623019 694750130 695565701 695977449 696866512 697779417 697631598 696185589 694345653
750.6 694345653 693036437 691972733 690197647 687781990 685971856 685631096 686364591 687314510 688423216
768.9 688423216 690582335 694234252 698576748 702450335 705608368 708850920 712716758 716532826
785.2 716532826 719244719 721019268 723009884 725682974 728339434 730263650 731691539 733424902
801.6 733424902 735730290 737879634 739014983 739390135 740181327 741744578 743093073 743388832 743156433
819.9 743156433 743423998 744110107 744090617 742737114 740885794 739790320 739540994 739113152 737860620
838.3 737860620 736370921 735501468 735022604 733920276 731962919 729988873 728657663 727579892 725807250
856.6 725807250 723301589 721578598 722127736 724569857 727344215 729767084 732299805 735109627 737376213
875 737376213 738121867 737377822 736067235 734645486 732532680 729103148 724846423 721145213 718729317
893.3 718729317 716993451 715163827 713457346 712587059 712369442 711574316 709259212 705812454 702335298
911.7 702335298 699025750 695092678 690308869 685720861 682616234 681044042 679875255 678384125
928 678384125 677136064 676990926 677693009 678122640 677822888 677545249 677983046 678344727 676898897 672984600
948.4 672984600 667599976 661856592 655619919 648195148 639744103 631169915 622890651 614269376
964.7 614269376 604494393 593687117 582593918 571487904 559844017 547177970 533993363 521510959
981 521510959 510546863 501109242 493056178 486639857 482191980 479455113 477535397 475633532 473666728
999.4 473666728 471988082 470600128 468902498 466415256 463508338 460940719 458938211 457206756
1015.7 457206756 455650896 454663575 454740882 455772221 457006365 457951963 458826125 460056096 461563051
1034.1 461563051 462774247 463399321 463774502 464274377 464748949 464780688 464513630 464837909 466502517
1052.4 466502517 469425857 472972333 476854324 481593609 487657785 494232893 499328315 501118481
1068.7 501118481 499260902 495127618 490740716 487585902 486363351 487274438 489924461 493274540
1085 493274540 496423751 499387622 502725899 506462932 509765625 511815310 512656927 512972116 513275683
1103.4 513275683 513650417 514203370 515437782 517920196 521539688 525399089 528676510 531404257 534158945
1121.8 534158945 537142932 540084720 543039382 546614110 550994694 555196226 557710886 557799459 555950224
1140.1 555950224 553046107 549392939 544924617 540071070 535744488 532505155 530139387 528207123
1156.4 528207123 526873887 526911020 528920114 532849908 538310289 545179904 553645670 563509822 573831856
1174.8 573831856 583638370 592851043 601993978 611118019 619496286 626388013 631821215 636283278
1191.1 636283278 639835238 641962886 642459214 642055392 641793966 642024636 642322779 642404437 642695189
1209.5 642695189 643668473 644991815 645801187 645703733 645121634 644532204 643712997 642122686 639823198
1227.8 639823198 637552917 635865211 634559572 633135319 631570876 630358756 629856110 629837811 629863024
1246.2 629863024 629950285 630515575 631653309 632865787 633672059 634216368 635071039 636475742 638060093
1264.5 638060093 639522791 641130984 643249571 645707011 647893846 649427474 650528967 651695371
1280.8 651695371 653102577 654435158 655418456 656208575 656992793 657577693 657567382 656837404 655724227
1299.2 655724227 654610693 653452039 651898861 649874032 647793472 645981729 644308388 642584562
1315.5 642584562 640977621 639914930 639409065 638828576 637581170 635671794 633596778 631799996 630306065
1333.9 630306065 629007161 628186166 628368199 629440308 630629718 631404459 631737709 631812394 631597161
1352.2 631597161 630873024 629568934 627830088 625941217 624211848 622667074 620993376 619319737
1368.5 619319737 618170261 617727220 617978394 618737757 619850278 621356666 623244286 625710726 629152358
1386.9 629152358 633000612 635957837 637741745 638645530 638892233 638840735 638615072 637894630 636675775
1405.3 636675775 635209084 633550644 631718099 629649878 627182543 624505341 622464776 621354580
1421.6 621354580 620592415 620068014 619854391 620183051 621061027 621854007 622750580 624380112 626077771
1439.9 626077771 627451777 628404617 628804862 629034162 629331470 629289150 628584027 627891779 628684461 630201936
1460.3 630201936 631370723 633023739 635896742 639297962 643319845 649375618 656669199 663240075
1476.6 663240075 668931723 674046576 678703070 682496130 685484052 688515902 691941738 694487572
1493 694487572 695682645 696502566 697544575 698261380 697964370 696936488 697220981 699281812 701334119
1511.3 701334119 703025639 704566360 706449866 708744824 711777151 715004206 717459261 719561100
1527.6 719561100 721192002 722270846 723467410 724309206 724051476 724133968 725879371 727811575 729173064
1546 729173064 729941249 730456054 730830848 730661690 729599237 728860915 730485559 731861413 731642723
1564.3 731642723 730536222 729077160 727853179 726451099 724039972 721100450 718566716 715953410
1580.7 715953410 712721825 708958030 704881907 700809181 696932495 693281054 689807773 686532378
1597 686532378 683468461 680544674 677653015 674692214 671754777 669049203 666535974 663747609 660525143
1615.3 660525143 657591224 655324519 652962506 650502920 648344159 646388412 644715428 643033862
1631.6 643033862 641011298 639561772 639558256 639960647 640148640 639963090 639982462 640979826 641750991 642654359
1652 642654359 645910800 649187028 651228726 653208196 655968487 659262061 661849499 664431453 668250084
1670.4 668250084 672110617 675837040 679957151 683441103 685966074 688543975 692947149 697489560
1686.7 697489560 700688243 703575253 705736876 707282960 708683670 710054159 712314487 714008033
1703 714008033 714255214 714064181 713551521 712371051 710321605 707505167 704911768 703410208 702133417
1721.4 702133417 700322509 698063850 695564032 693042576 690671802 688888848 688094318 687473238 687196493
1739.7 687196493 687859952 689001083 690181851 691667676 694415390 698463857 702256799 705760300
1756.1 705760300 709684491 714012444 719188929 724302292 728468776 732277215 736108005 740585685
1772.4 740585685 745019078 748126984 750459433 752816141 755098403 756937861 758244932 759018719
1788.7 759018719 759743214 761155009 762579143 763270378 763828218 764923990 766258776 767115116 767477274
1807 767477274 767880917 768724203 769647300 770144463 770404339 770858049 771382093 771640301 771724999 771787703
1827.4 771787703 772226453 773231685 773978889 774115741 774148166 774283230 774267614 774315953 774754226 775241137
1847.8 775241137 775690496 776130438 776345968 776303947 776265979 776492357 776795566 776717186 776194990 775974214
1868.2 775974214 776600182 777336895 777540386 777396977 777370632 777639151 777949274 777989209 777751386 777635515
1888.6 777635515 777955830 778287649 778258085 778107524 778122783 778343260 778519452 778373122 778033257 777936339
1909 777936339 778184772 778323770 778012276 777619362 777636647 777842224 777975023 777985454 777869523 777849078
1929.4 777849078 777982354 778022230 777837455 777573228 777379036 777315617 777352571 777330160 777271509 777337074 777453184
1951.9 777453184 777393341 777154684 777000308 777061999 777145028 777013183 776733339 776606262 776699662 776789546
1972.3 776789546 776687980 776432574 776267946 776321650 776403010 776267409 775949776 775675058 775572240 775574565
1992.6 775574565 775472462 775229096 775061905 775044441 774977028 774719477 774373472 774108529 773943067 773718476
2013 773718476 773316741 772885323 772616565 772461474 772248387 771854103 771366239 771018147 770839036 770607471
2033.4 770607471 770197630 769731998 769391477 769225240 769059181 768738806 768388450 768198967 768145561 768047810
2053.8 768047810 767823398 767596006 767510176 767512441 767455041 767287016 767092168 766995668 766999483 766971052 766821623
2076.3 766821623 766643405 766583920 766599298 766514540 766296446 766103566 766081989 766141415 766065359 765827775 765628457
2098.7 765628457 765593827 765611708 765525103 765344620 765203774 765161335 765129685 764991879 764772356 764605284
2119.1 764605284 764566481 764567077 764456689 764257491 764106572 764031053 763943315 763782620 763580561 763455212 763459384
2141.5 763459384 763468683 763359249 763176620 763079643 763109565 763121128 763033330 762955129 763008296 763144195 763227761
2164 763227761 763225913 763210416 763286233 763480723 763673246 763777792 763862789 764026284 764249563 764423728 764491677
2186.4 764491677 764519274 764619112 764787495 764920354 764979005 765013754 765095830 765247583 765395701 765455604 765462399
2208.8 765462399 765524447 765644014 765719950 765709519 765701234 765774786 765870571 765890419 765817404 765735924 765731931 765789866
2233.3 765789866 765803933 765716970 765631139 765629768 765642405 765579164 765444398 765320420 765249908 765172482 765031219
2255.8 765031219 764840722 764655054 764538467 764460325 764316976 764148772 764102042 764172733 764262736 764340699
2276.1 764340699 764439702 764607787 764726341 764549911 764003873 763225198 762404680 761618137 760790348 759797513
2296.5 759797513 758624077 757416964 756180644 754620075 752565801 750267386 748161376 746496201
2312.9 746496201 744846940 742301166 738689721 735004723 732195377 730023146 727729797 725370586
2329.2 725370586 723732710 722824037 721712828 720189810 718759239 718157768 720005453 725252211 729676545
2347.5 729676545 728808165 722890079 714884877 707721949 702741086 700706124 701456785 704301894 708719969
2365.9 708719969 714294612 720568120 727066040 733299851 738920867 743894517 748355925 752172530
2382.2 752172530 754958630 756522477 757126033 757245779 757207811 757084012 756822169 756446719 756107986
2400.6 756107986 755899191 755711734 755402744 755013585 754697621 754476607 754199624 753769159 753296554 752938569
2421 752938569 752665639 752337992 751901984 751445234 751074791 750759184 750377536 749891341 749400318 749031603
2441.3 749031603 748747528 748388052 747912884 747422040 747023344 746717572 746354938 745847166 745349169 745019019
2461.7 745019019 744770169 744430661 743975759 743524253 743179917 742873430 742453635 741953313 741525352 741223693
2482.1 741223693 740966320 740610063 740148365 739751697 739492893 739230037 738832653 738386512 738056898 737835526
2502.5 737835526 737565160 737165928 736747622 736447513 736232221 735959709 735582411 735171676 734821796 734564543
2522.9 734564543 734284759 733887255 733450472 733078122 732755721 732380331 731910706 731460690 731151521 730901480
2543.3 730901480 730534017 730039239 729575396 729244411 728952587 728552163 728064120 727654517 727392077 727146149
2563.7 727146149 726774096 726339042 725976408 725660682 725305498 724875212 724413276 724021852 723707616 723390996
2584.1 723390996 723007143 722576022 722225964 721985340 721703053 721309006 720906794 720578969 720307112 719995141
2604.5 719995141 719558001 719063759 718629837 718238831 717780828 717225313 716662467 716157973 715654194 715072155
2624.9 715072155 714438677 713817418 713222802 712625742 711972117 711282611 710652232 710069656 709438443 708754599
2645.3 708754599 708078265 707446277 706855476 706241012 705559909 704883039 704296052 703771949 703209877 702578843
2665.7 702578843 701952040 701367438 700795531 700209081 699600995 699004650 698445380 697904825 697359741 696773767
2686.1 696773767 696154177 695569396 695003510 694384277 693725944 693089366 692495704 691897035 691228569 690516949
2706.5 690516949 689830005 689168215 688493073 687804699 687166870 686608076 686065316 685476184 684861422 684277534
2726.9 684277534 683730185 683195531 682642758 682093561 681619227 681198657 680755734 680282116 679809809 679373562
2747.3 679373562 678970098 678506076 677955508 677442253 677017212 676598787 676134944 675639749 675130248 674644947
2767.7 674644947 674194694 673709810 673153818 672564089 671999454 671444595 670802355 670071363 669357479 668705463
2788.1 668705463 668012023 667163849 666236699 665374160 664545119 663601816 662508488 661383867 660325170
2806.4 660325170 659297585 658193827 656935811 655577123 654239655 652931750 651563227 650084674
2822.7 650084674 648555517 647039711 645477176 643771648 641928077 640033007 638147652 636168838
2839.1 636168838 633917928 631384909 628652275 625822783 623127699 620832086 619026065 617566228
2855.4 617566228 616220534 614780247 613092244 611136138 609006584 606779099 604451299 602003038
2871.7 602003038 599425137 596773148 594190300 591756463 589472950 587415934 585717618 584372163
2888 584372163 583221972 582191527 581311345 580537498 579789400 579024017 578233480 577441335 576617658 575690985
2908.4 575690985 574552357 573045790 571179986 569244742 567525446 566070735 564861417 563910663
2924.7 563910663 563270509 562952220 562857926 563035965 563710213 565010369 566835344 569004893 571422994
2943.1 571422994 574023604 576721311 579425931 582088530 584682763 587216914 589738190 592199266
2959.4 592199266 594483316 596559584 598502874 600373030 602133632 603801847 605494857 607274473
2975.7 607274473 609142125 610991299 612639368 614083767 615439117 616705298 617840409 618770182
2992 618770182 619397342 619848847 620219231 620345592 620219111 620011270 619794548 619576752 619306624 618852437
3012.4 618852437 618179321 617371440 616476536 615487039 614443064 613401413 612321079 611182272 610023677
3030.8 610023677 608840644 607571661 606215119 604920387 603708148 602375865 600848079 599264145
3047.1 599264145 597739697 596191764 594544172 592954278 591469884 589915216 588274479 586711884
3063.4 586711884 585309148 583899677 582292318 580581486 578951657 577482879 576129913 574671388
3079.7 574671388 573005199 571278632 569576144 567921758 566279054 564524055 562714159 561012328
3096 561012328 559440970 557873011 556163430 554412246 552841604 551366091 549718559 548000634 546516001
3114.4 546516001 545157909 543611765 541769087 539757669 537847400 536139548 534498811 532809079
3130.7 532809079 531088054 529426098 527885377 526357174 524639606 522797346 521042109 519420803
3147 519420803 517937779 516530335 514953792 513128042 511290133 509592831 507979393 506383896 504786313
3165.4 504786313 503197253 501633167 500057757 498439223 496835470 495293409 493786573 492264658
3181.7 492264658 490715533 489207983 487783402 486353815 484835923 483264357 481733054 480274945
3198 480274945 478828579 477379560 476000160 474666208 473276794 471869022 470502079 469141304 467780620
3216.4 467780620 466447562 465135008 463807583 462475479 461182445 459966660 458881915 457844973
3232.7 457844973 456625998 455255002 453948528 452724546 451545954 450443655 449356049 448162913
3249 448162913 446913421 445759863 444695234 443587542 442440003 441338271 440271109 439230263 438312292
3267.4 438312292 437581003 436778456 435689241 434517235 433444679 432451695 431507021 430604786 429756343
3285.7 429756343 429004818 428347915 427645683 426781654 425829411 424904257 424060404 423366696 422807693 422145605
3306.1 422145605 421182096 420017779 418858230 417818457 416852832 415882349 414937884 414032280 413108408
3324.5 413108408 412079483 410972118 409916848 408928901 408035040 407308102 406589031 405703306 404754519
3342.8 404754519 403846711 403055578 402475804 401887387 401020616 400063396 399307221 398736238 398172587 397578120
3363.2 397578120 397134155 396815062 396294624 395435035 394497067 393769085 393219501 392695159 392104179 391499400
3383.6 391499400 391025305 390729368 390573770 390315056 389713079 389083296 388879478 388872951 388484508 387731612
3404 387731612 387115508 386776388 386544108 386303008 385953039 385537058 385272622 385198087 385132700 385061055
3424.4 385061055 385096937 385220915 385324419 385435611 385629803 385717630 385558933 385394484 385399759 385562152
3444.8 385562152 385909915 386302561 386583537 386828661 387134224 387533873 388015300 388497531 388973296 389588863
3465.2 389588863 390331835 390872836 391092271 391313225 391750365 392366558 393030286 393590152 394112945 394738078
3485.6 394738078 395409226 396045297 396660686 397320509 398051381 398728192 399353027 400129795 400953829 401568204
3506 401568204 402162701 402973384 403879970 404680133 405339360 405965388 406693041 407636255 408598065 409378022
3526.4 409378022 410187185 411071986 411888868 412774265 413774103 414694577 415571064 416574210 417770714
3544.7 417770714 418959469 419879228 420787245 421956360 423132956 424169838 425256819 426336050 427130073
3563.1 427130073 428096056 430069804 432320297 433794081 434948087 436347902 437952399 439625353
3579.4 439625353 441188991 442433327 443730026 445780456 447952211 449373305 450770169 452735037
3595.7 452735037 454869509 456968963 459023923 460710198 462218344 464350045 466930300 469261140
3612.1 469261140 471239448 472815335 474888593 477879286 480135173 480970472 481660426 484608173 489019781
3630.4 489019781 491823733 493982404 496390343 498719424 500943840 502711236 503698051 504950404
3646.7 504950404 508412600 512861609 515188158 516761243 519631445 522463620 524310589 525809348
3663 525809348 526859581 527553856 529264927 531444728 532539129 534897149 538325369 540109098 541110337
3681.4 541110337 541763544 541885436 542785347 545198619 547265410 548190653 548709810 549060762 549579501
3699.8 549579501 550893188 552199423 552413523 552239954 553147316 555694044 557707071 557876825 557318389
3718.1 557318389 556973219 557064652 557582080 558336616 558470905 557937086 557964623 559455335 561910212 563107967
3738.5 563107967 562057853 561267495 563050389 564177632 563745260 565245569 567616820 568036318 567648888
3756.9 567648888 568144500 568971395 569059849 569043458 569312751 570005953 571034670 571353793 570945263 570798039
3777.3 570798039 571439445 572071254 572214425 572525084 572953105 573131382 572980046 572565615 572379053 572088718
3797.7 572088718 571881950 572981834 573682249 573754609 574772179 575101018 573957324 573033750 573451638
3816 573451638 573604047 573741019 575216174 575866401 575555384 575224519 574800432 574512005 574166358 574188173
3836.4 574188173 575154781 576009691 576463759 576873720 576431632 574531436 572321415 573296487 577153563
3854.8 577153563 578057528 576690674 575542152 575409234 575805247 575511098 575451851 576366305 576954901
3873.1 576954901 576989114 576359272 575887024 576138973 576169729 576628447 576922119 576315165 576508701 577015102
3893.5 577015102 576276124 575171113 574848413 575343251 576424479 577388823 577423215 576913595 576372921
3911.9 576372921 575820684 575622916 575975418 576229751 576051354 575971544 576014519 575677454 575409710 575746715
3932.3 575746715 576058924 575836957 575393796 575088620 575091600 575118005 574938595 574892581 574988484 574957132 574854136
3954.7 574854136 574779272 574695885 574628532 574592829 574484706 574308753 574132323 573964000 573865533 573866487 573841631
3977.1 573841631 573734641 573627949 573572397 573510349 573335290 573132515 573049068 573007941 572896719 572756529
3997.5 572756529
##END=$$ End of the data block
