##TITLE=Fibra Residuo - Bianca $$ Begin of the data block
##JCAMP-DX=5.00 $$ ACD/SpecManager v 10.08
##SPECTROMETER/DATA SYSTEM=Alpha
##DATE=24 Oct 2013 13:19:44
##DATA TYPE=INFRARED SPECTRUM
##DATA CLASS=XYDATA
##ORIGIN=
##OWNER=
##NPOINTS=1765
##FIRSTX=399.75695801
##LASTX=3997.56933594
##MAXX=3997.56933594
##MINX=399.75695801
##MAXY=0.77984822
##MINY=0.38437885
##XFACTOR=1.0000000000
##YFACTOR=1.000000000000000e-9
##FIRSTY=0.66900367
##DELTAX=2.03957629
##XUNITS=1/CM
##YUNITS=ARBITRARY UNITS
##XYDATA=(X++(Y..Y))
$$ plain form
399.8 669003665 667704761 664343178 662488699 663968265 666237831 665826738 663119137 661392033 661997736
418.1 661997736 662439883 660072029 657119095 656588316 657348573 656105459 652587593 650060117 650728166
436.5 650728166 652538836 652704954 651851833 652627289 655627072 658297896 658281326 656757593 656488776
454.8 656488776 657612979 657774091 655730665 653333962 652919292 653690398 652584851 649056554 646268070
473.2 646268070 646428287 647349358 646239221 643628061 642331004 643478334 644743621 643808484 641705871
491.5 641705871 641118050 642237008 642404079 640109897 637247026 636287391 636550546 635547698 632510364
509.9 632510364 629270077 627665341 626793802 624492228 620933652 618422985 618185461 618829727 617999077
528.3 617999077 616119623 615991414 618498385 621623337 623598695 624939382 627051592 629770160 631201863
$$ packed form
399.8F69003665j298904l361583j854479J479566K269566m11093k707601j727104O05703
418.1F61997736M42147k367854k952934n30779P60257j243114l517866k527476O68049
436.5F50728166J810670J66118q53121P75456K999783K670824j6570j523733k68817
454.8F56488776J124203J61112k043426k396703m14670P71106j105547l528297k788484
473.2F46268070J60217R21071j110137k611160j297057J147330J265287r35137k102613
491.5F41705871n87821J118958J67071k294182k862871r59635K63155j002848l037334
509.9F32510364l240287j604736q71539k301574l558576k510667k37524O44266q30650
528.3F17999077j879454j28209K506971L124952J975358J340687K112210K718568J431703
$$ plain form
546.6 631201863 630224705 628207147 627174139 627021492 625779510 622697890 619607627 618121684 617191792
565 617191792 614794195 610990167 607939124 607055724 607559085 607966840 608290315 609929860 613454640
583.3 613454640 617404044 619854152 620647430 621218622 622354209 623237491 622891665 621758938 621262193
601.7 621262193 621712387 621832728 620914459 620065272 620566726 621918142 622651637 622955680 624213040
620 624213040 626777053 630011439 632616282 633866429 634657502 636013329 637697875 638765514 638830483
638.4 638830483 638714254 639406741 640455544 640641809 640041947 639972746 640947104 642149985 642524719 641981304
658.8 641981304 641711771 642479241 642135799 637700737 634589851 638813436 643310726 646048546 647683144
677.1 647683144 648807824 650493979 653110385 655617535 656956434 657483220 658401787 659955919 661114514
$$ packed form
546.6F31201863r77158k017558j033008j52647j241982l081620l090263j485943r29892
565F17191792k397597l804028l051043q83400N03361M07755L23475J639545L524780
583.3F13454640L949404K450108P93278N71192J135587Q83282l45826j132727m96745
601.7F21262193M50194J20341r18269q49187N01454J351416P33495L04043J257360
620F24213040K564013L234386K604843J250147P91073J355827J684546J067639O4969
638.4F38830483j16229O92487J048803J86265n99862o9201R74358J202881L74734n43415
658.8F41981304k69533P67470l43442m435062l110886M223585M497290K737820J634598
677.1F47683144J124680J686155K616406K507150J338899N26786R18567J554132J158595
$$ plain form
695.5 661114514 661023915 660099864 659451425 659493625 659558833 659162581 658982396 660100043 662548661 665085256
715.9 665085256 666778505 668656647 672253132 676829875 680678606 683299780 685454309 688087583
732.2 688087583 691013157 693158329 694061160 694541574 695425510 696305692 696162045 694715559 692835987
750.6 692835987 691447973 690332234 688665926 686434984 684677362 684305668 685047626 686018527 687135816
768.9 687135816 689305663 692991972 697321773 701093495 704197407 707540631 711568058 715445101
785.2 715445101 718134522 719877064 721814334 724417269 727005661 728870273 730309010 732147336
801.6 732147336 734551013 736709058 737794161 738185525 739070475 740663826 741965473 742275059 742131174
819.9 742131174 742452741 743115127 743053436 741721034 739922941 738880098 738670826 738254607 737007380
$$ packed form
695.5F61114514r0599r24051o48439M2200O5208l96252j80185J117647K448618K536595
715.9F65085256J693249J878142L596485M576743L848731K621174K154529K633274
732.2F88087583K925574K145172R02831M80414Q83936Q80182j43647j446486j879572
750.6F92835987j388014j115739j666308k230942j757622l71694P41958R70901J117289
768.9F87135816K169847L686309M329801L771722L103912L343224M027427L877043
785.2G15445101K689421J742542J937270K602935K588392J864612J438737J838326
801.6G32147336K403677K158045J085103L91364Q84950J593351J301647L09586j43885
819.9G42131174L21567O62386o1691j332402j798093j042843k09272m16219j247227
$$ plain form
838.3 737007380 735527873 734689832 734244287 733147979 731159627 729144633 727797091 726724565 724992633
856.6 724992633 722563565 720913351 721511841 723981380 726719141 729039967 731498122 734321833 736635268
875 736635268 737383902 736592591 735228956 733798087 731716275 728321612 724091828 720447421 718091309
893.3 718091309 716335356 714449942 712723911 711840570 711645126 710937142 708699882 705327511 701909781
911.7 701909781 698593736 694627941 689829409 685272992 682214320 680657148 679496527 677999258
928 677999258 676690996 676494479 677229345 677704513 677393973 677124918 677624524 678005993 676524043 672573388
948.4 672573388 667164564 661417425 655213118 647834122 639375031 630725861 622384667 613792360
964.7 613792360 604093850 593324780 582271278 571239412 559636593 546969652 533794403 521359384
$$ packed form
838.3G37007380j479507q38041m45545j096308j988352k014994j347542j072526j731932
856.6G24992633k429068j650214N98490K469539K737761K320826K458155K823711K313435
875G36635268P48634p91311j363635j430869k081812l394663m229784l644407k356112
893.3G18091309j755953j885414j726031q83341j95444p07984k237260l372371l417730
911.7G01909781l316045l965795m798532m556417l058672j557172j160621j497269
928F77999258j308262j96517P34866M75168l10540k69055M99606L81469j481950l950655
948.4F72573388n408824n747139o204307p378996q459091q649170q341194q592307
964.7F13792360r698510j0769070j1053502j1031866j1602819j2666941j3175249j2435019
$$ plain form
981 521359384 510450780 501008034 492872596 486365527 481902063 479214042 477326900 475395620 473378301
999.4 473378301 471703053 470364571 468705326 466250479 463371366 460784495 458753288 457015932
1015.7 457015932 455435663 454432279 454501361 455488414 456695378 457673877 458629042 459949553 461504608
1034.1 461504608 462723225 463337570 463724017 464256227 464714140 464697868 464378983 464619488 466242611
1052.4 466242611 469215214 472820550 476746857 481520981 487586081 494168520 499313116 501163602
1068.7 501163602 499357820 495260090 490864158 487647384 486366481 487229198 489803284 493113726
1085 493113726 496283561 499279886 502646744 506401539 509722471 511785626 512625396 512950301 513285637
1103.4 513285637 513672292 514203131 515422344 517906189 521529496 525388598 528660834 531385064 534125507
$$ packed form
981E21359384j0908604r442746q135438o507069m463464k688021j887142j931280k017319
999.4D73378301j675248j338482j659245k454847k879113k586871k031207j737356
1015.7D57015932j580269j003384O9082R87053J206964R78499R55165J320511J555055
1034.1D61504608J218617O14345L86447N32210M57913j6272l18885K40505J623123
1052.4D66242611K972603L605336L926307M774124O065100O582439N144596J850486
1068.7E01163602j805782m097730m395932l216774j280903Q62717K574086L310442
1085D93113726L169835K996325L366858L754795L320932K063155Q39770L24905L35336
1103.4E13285637L86655N30839J219213K483845L623307L859102L272236K724230K740443
$$ plain form
1121.8 534125507 537090421 540040731 543016672 546618998 551034510 555225253 557699859 557813108
1138.1 557813108 556054115 553204417 549550235 545097649 540269196 535937846 532680571 530311227
1154.4 530311227 528392553 527040780 527033865 529049993 533019364 538497925 545346737 553752542 563569367
1172.7 563569367 573893070 583741367 592991948 602127671 611250520 619660199 626572847 632029951
1189.1 632029951 636527300 640097558 642236888 642734766 642322063 642066956 642310858 642617941 642702281
1207.4 642702281 642982185 643933773 645240009 646049142 645970047 645418823 644834399 643996298 642413378
1225.8 642413378 640130579 637857318 636155784 634846389 633440375 631882727 630657196 630148470
1242.1 630148470 630128205 630146265 630227864 630789399 631926060 633145571 633954883 634488225 635318458 636694491
$$ packed form
1121.8E34125507K964914K950310K975941L602326M415512M190743K474606J13249
1138.1E57813108j758993k849698l654182m452586m828453m331350l257275k369344
1154.4E30311227j918674j351773o915K016128L969371N478561O848812Q405805R816825
1172.7E63569367J0323703R848297R250581R135723R122849Q409679O912648N457104
1189.1F32029951M497349L570258K139330M97878m12703k55107K43902L07083Q4340
1207.4F42702281K79904R51588J306236Q09133p9095n51224n84424q38101j582920
1225.8F42413378k282799k273261j701534j309395j406014j557648j225531n08726
1242.1F30148470k0265J8060Q1599N61535J136661J219511Q09312N33342Q30233J376033
$$ plain form
1262.5 636694491 638292015 639811456 641456127 643584132 646054447 648241341 649747550 650822282
1278.8 650822282 651978731 653378546 654711723 655700505 656480074 657274783 657914340 657927454 657134473
1297.2 657134473 655943751 654828072 653719544 652199507 650177598 648069263 646206737 644515097
1313.5 644515097 642791748 641153514 640082419 639608085 639039159 637774885 635856271 633803427 632030129
1331.8 632030129 630528152 629193425 628322661 628475487 629561365 630777478 631560266 631883919 631947041
1350.2 631947041 631721556 630972922 629654169 627936721 626033843 624244332 622701347 621076107 619426787
1368.5 619426787 618275106 617812932 618086576 618919373 620063603 621558011 623437405 625877380 629297972
1386.9 629297972 633200049 636193335 637898803 638734758 639017642 639031887 638888478 638241768 637068450
$$ packed form
1262.5F36694491J597524J519441J644671K128005K470315K186894J506209J074732
1278.8F50822282J156449J399815J333177R88782P79569P94709O39557J3114p92981
1297.2F57134473j190722j115679j108528j520037k021909k108335j862526j691640
1313.5F44515097j723349j638234j071095m74334n68926j264274j918614k052844j773298
1331.8F32030129j501977j334727q70764J52826J085878J216113P82788L23653O3122
1350.2F31947041k25485p48634j318753j717448j902878j789511j542985j625240j649320
1368.5F19426787j151681m62174K73644Q32797J144230J494408J879394K439975L420592
1386.9F29297972L902077K993286J705468Q35955K82884J4245j43409o46710j173318
$$ plain form
1405.3 637068450 635639727 633981466 632122278 630016804 627424300 624559700 622498512 621534765
1421.6 621534765 620866597 620361507 620116353 620416164 621300459 622008741 622754514 624427915 626291573
1439.9 626291573 627718270 628634095 628992260 629201472 629508495 629444718 628584623 627634466 628422618 630171478
1460.3 630171478 631435096 633060515 635973930 639397979 643263936 649132371 656481445 663246632
1476.6 663246632 669084549 674285591 678976417 682693005 685500443 688422441 691966355 694649816
1493 694649816 695766270 696438253 697530925 698369145 697996616 696654141 696804821 699151993 701451600
1511.3 701451600 703173995 704574585 706278980 708405018 711353540 714739084 717423201 719692051
1527.6 719692051 721392155 722398520 723539114 724343956 723761499 723382711 725204647 727545023 729222119
$$ packed form
1405.3F37068450j428723j658261j859188k105474k592504k864600k061188r63747
1421.6F21534765o68168n05090k45154K99811Q84295P08282P45773J673401J863658
1439.9F26291573J426697R15825L58165K09212L07023o3777q60095r50157P88152J748860
1460.3F30171478J263618J625419K913415L424049L865957N868435P349074O765187
1476.6F63246632N837917N201042M690826L716588K807438K921998L543914K683461
1493F94649816J116454O71983J092672Q38220l72529j342475J50680K347172K299607
1511.3G01451600J722395J400590J704395K126038K948522L385544K684117K268850
1527.6G19692051J700104J006365J140594Q04842n82457l78788J821936K340376J677096
$$ plain form
1546 729222119 730141878 730686724 730998576 730644107 729219437 728060007 729903996 731821418 731839418
1564.3 731839418 730706811 729114771 727874696 726523817 723996460 720996797 718655527 716190338
1580.7 716190338 712982655 709193408 705061376 700939476 697035193 693356931 689877033 686627328
1597 686627328 683563948 680591583 677662611 674677312 671687186 668934226 666409671 663553596 660128951
1615.3 660128951 657077610 654902101 652572632 650049388 647852838 645898342 644258916 642542422
1631.6 642542422 640295982 638620019 638720095 639330149 639578283 639268637 639088511 640065551 640808642
1650 640808642 641451955 644795120 648550570 650844634 652842343 655574501 658911347 661462784 663886309
1668.4 663886309 667707682 671716154 675523460 679752171 683346570 685793042 688122213 692507148
$$ packed form
1546G29222119R19759N44846L11852l54469j424670j159430J843989J917422J8000
1564.3G31839418j132607j592040j240075j350879k527357k999663k341270k465189
1580.7G16190338l207683l789247m132032m121900l904283l678262l479898l249705
1597F86627328l063380k972365k928972k985299k990126k752960k524555k856075l424645
1615.3F60128951l051341k175509k329469k523244k196550j954496j639426j716494
1631.6F42542422k246440j675963J00076O10054K48134l09646j80126R77040P43091
1650F40808642O43313L343165L755450K294064J997709K732158L336846K551437K423525
1668.4F63886309L821373M008472L807306M228711L594399K446472K329171M384935
$$ plain form
1684.7 692507148 697384119 700853109 703860402 705950379 707236111 708408535 709656954 712004066
1701 712004066 713961720 714391112 714349389 713961184 712763250 710546970 707491219 704804957 703559816
1719.3 703559816 702592075 700914919 698697746 696186841 693563223 691005349 689070344 688369691 687881470
1737.7 687881470 687639534 688363075 689549625 690679073 692090273 694885135 699113548 703009069 706475675
1756.1 706475675 710360825 714693785 719923317 725113809 729254246 732930422 736602128 741047859
1772.4 741047859 745680571 748993158 751387537 753754616 756074965 757947981 759286284 760032177
1788.7 760032177 760623574 761984944 763506413 764251828 764800310 765923977 767313242 768186450 768541455
1807 768541455 768946648 769814014 770771742 771277606 771531582 771990061 772505105 772724926 772768855 772768974 773163855
$$ packed form
1684.7F92507148M876971L468990L007293K089977J285732J172424J248419K347112
1701G12004066J957654M29392m1723l88205j197934k216280l055751k686262j245141
1719.3G03559816r67741j677156k217173k510905k623618k557874j935005p00653m88221
1737.7F87881470k41936P23541J186550J129448J411200K794862M228413L895521L466606
1756.1G06475675L885150M332960N229532N190492M140437L676176L671706M445731
1772.4G41047859M632712L312587K394379K367079K320349J873016J338303P45893
1788.7G60032177N91397J361370J521469P45415N48482J123667J389265Q73208L55005
1807G68541455M05193Q67366R57728N05864K53976M58479N15044K19821M3929J19L94881
$$ plain form
1829.5 773163855 774270773 775149465 775313735 775331974 775451422 775376320 775350928 775808871 776373863 776900053
1849.9 776900053 777399302 777613461 777522385 777447820 777690768 778048754 777977049 777348042 777027071 777726054
1870.3 777726054 778604329 778868020 778733253 778707087 778964818 779266119 779305220 779041469 778866112 779160261
1890.7 779160261 779506087 779496312 779386699 779441118 779669046 779848218 779714525 779369593 779250383 779487789
1911.1 779487789 779628754 779283226 778832078 778863966 779138982 779313743 779333770 779221952 779216886 779365897
1931.5 779365897 779408932 779224932 778960824 778738976 778638363 778685212 778692603 778639972 778707325 778838634 778803647
1953.9 778803647 778591812 778440416 778478086 778545558 778414786 778138757 778008521 778096557 778190255 778102100
1974.3 778102100 777873933 777730763 777769387 777829409 777701974 777396739 777104259 776964545 776958704 776890099
$$ packed form
1829.5G73163855J106918Q78692J64270J8239J19448p5102k5392M57943N64992N26190
1849.9G76900053M99249K14159r1076p4565K42948L57986p1705o29007l20971O98983
1870.3G77726054Q78275K63691j34767k6166K57731L01301L9101k63751j75357K94149
1890.7G79160261L45826r775j09613N4419K27928J79172j33693l44932j19210K37406
1911.1G79487789J40965l45528m51148L1888K75016J74761K0027j11818n066J49011
1931.5G79365897M3035j84000k64108k21848j00613M6849P391n2631O7353J31309l4987
1953.9G78803647k11835j51396L7670O7472j30772k76029j30236Q8036R3698q8155
1974.3G78102100k28167j43170L8624O0022j27435l05235k92480j39714n841o8605
$$ plain form
1994.7 776890099 776666164 776464999 776409566 776360273 776128173 775770068 775509417 775378525 775167763 774742484
2015.1 774742484 774286807 774038017 773926198 773732066 773338497 772841811 772465944 772251189 772005141 771617651
2035.5 771617651 771195889 770889282 770734370 770579576 770270288 769909561 769696057 769621968 769515634 769293010
2055.9 769293010 769061863 768951893 768922806 768855929 768719316 768578947 768511355 768515468 768487096 768339992 768163681
2078.3 768163681 768091917 768069386 767963111 767758965 767573357 767539978 767581046 767499745 767292321 767129600
2098.7 767129600 767101645 767112255 767037690 766878307 766743541 766700804 766678870 766566396 766360879 766186059
2119.1 766186059 766139448 766130328 765999556 765767276 765598118 765551925 765506327 765360534 765169144 765041113
2139.5 765041113 765006661 764997959 764922798 764779091 764687061 764696240 764695227 764613807 764536500 764579594 764728606 764835417
$$ packed form
1994.7G76890099k23935k01165n5433m9293k32100l58105k60651j30892k10762m25279
2015.1G74742484m55677k48790j11819j94132l93569m96686l75867k14755k46048l87490
2035.5G71617651m21762l06607j54912j54794l09288l60727k13504p4089j06334k22624
2055.9G69293010k31147j09970k9087o6877j36613j40369o7592M113k8372j47104j76311
2078.3G68163681p1764k2531j06275k04146j85608l3379M1068q1301k07424j62721
2098.7G67129600k7955J0610p4565j59383j34766m2737k1934j12474k05517j74820
2119.1G66186059m6611r120j30772k32280j69158m6193m5598j45793j91390j28031
2139.5G65041113l4452q702p5161j43707r2030R179j013q1420p7307M3094J49012J06811
$$ plain form
2164 764835417 764818370 764787436 764886916 765112638 765333235 765440404 765492439 765643358 765886426 766066253 766116321
2186.4 766116321 766138017 766262352 766464770 766606033 766646087 766681492 766798437 766960680 767075837 767118692
2206.8 767118692 767149448 767244339 767369509 767426789 767411530 767416954 767507434 767625451 767669082 767602205 767506599
2229.2 767506599 767498910 767557800 767559111 767475903 767411351 767424643 767441630 767363191 767194510 767049015 766985357
2251.7 766985357 766921878 766761005 766518354 766311407 766215324 766154408 766015708 765836239 765746772 765791357
2272.1 765791357 765907288 766005576 766112626 766301692 766447127 766284049 765695512 764823973 763895571 762994587
2292.5 762994587 762059927 760993004 759750187 758433819 757068455 755353212 753076971 750520349
2308.8 750520349 748188674 746325314 744436860 741568387 737589538 733551204 730418563 727955461
$$ packed form
2164G64835417j7047l0934R9480K25722K20597J07169N2035J50919K43068J79827N0068
2186.4G66116321K1696J24335K02418J41263M0054L5405J16945J62243J15157M2855
2206.8G67118692L0756R4891J25170N7280j5259N424R0480J18017M3631o6877r5606
2229.2G67506599p689N8890J311q3208o4552J3292J6987p8439j68681j45495o3658
2251.7G66985357o3479j60873k42651k06947r6083o0916j38700j79469q9467M4585
2272.1G65791357J15931R8288J07050J89066J45435j63078n88537q71539r28402r00984
2292.5G62994587r34660j066923j242817j316368j365364j715243k276241k556622
2308.8G50520349k331675j863360j888454k868473l978849m038334l132641k463102
$$ plain form
2325.1 727955461 725373626 722699285 720745683 719603062 718360066 716771126 715329349 714767575
2341.4 714767575 716852665 722711444 727755785 726967096 720457077 711468399 703429401 697931647
2357.7 697931647 695651352 696340263 699452758 704446673 710720420 717782617 725108981 732111931
2374 732111931 738412619 743995249 749051630 753433526 756637573 758417428 759108663 759275079 759257376
2392.4 759257376 759129107 758872151 758513808 758177519 757954717 757749856 757426500 757028937 756709099 756481051
2412.8 756481051 756222069 755845904 755384028 754985392 754708529 754407763 753963530 753463149 753062844 752771318
2433.2 752771318 752443016 751974583 751466811 751099348 750834882 750464201 749958336 749474883 749111712 748809218
2453.6 748809218 748417974 747921646 747474074 747153878 746868968 746504068 746051610 745603263 745243967 744922698
$$ packed form
2325.1G27955461k581835k674341j953602j142621j242996j588940j441777n61774
2341.4G14767575K085090N858779N044341p88689o510019q988678q038998n497754
2357.7F97931647k280295O88911L112495M993915O273747P062197P326364P002950
2374G32111931O300688N582630N056381M381896L204047J779855O91235J66416j7703
2392.4G59257376j28269k56956l58343l36289k22802k04861l23356l97563l19838k28048
2412.8G56481051k58982l76165m61876l98636k76863l00766m44233n00381m00305k91526
2433.2G52771318l28302m68433n07772l67463k64466l70681n05865m83453l63171l02494
2453.6G48809218l91244m96328m47572l20196k84910l64900m52458m48347l59296l21269
$$ plain form
2474 744922698 744505644 744002998 743575454 743304074 743075967 742721677 742256701 741865158 741604388 741334856
2494.4 741334856 740934312 740467072 740113020 739911556 739688337 739292204 738816798 738480449 738290966 738039196
2514.8 738039196 737657189 737263083 736945868 736694872 736401916 735994220 735553443 735202372 734906197 734527469
2535.2 734527469 734059930 733626544 733288169 732974827 732588708 732116640 731652856 731316984 731065989 730709553
2555.6 730709553 730241060 729836822 729546010 729252756 728860438 728429615 728059828 727735341 727385938 726971090
2576 726971090 726520181 726138055 725863636 725579262 725189865 724759161 724395514 724124432 723848224 723462522
2596.4 723462522 723048329 722717464 722424805 722078919 721655905 721219659 720815122 720399022 719910860 719354391
2616.8 719354391 718790174 718269825 717766523 717207789 716590464 715955853 715339243 714736402 714088798 713411450
$$ packed form
2474G44922698m17054n02646m27544k71380k28107l54290m64976l91543k60770k69532
2494.4G41334856m00544m67240l54052k01464k23219l96133m75406l36349j89483k51770
2514.8G38039196l82007l94106l17215k50996k92956m07696m40777l51071k96175l78728
2535.2G34527469m67539m33386l38375l13342l86119m72068m63784l35872k50995l56436
2555.6G30709553m68493m04238k90812k93254l92318m30823l69787l24487l49403m14848
2576G26971090m50909l82126k74419k84374l89397m30704l63647k71082k76208l85702
2596.4G23462522m14193l30865k92659l45886m23014m36246m04537m16100m88162n56469
2616.8G19354391n64217n20349n03302n58734o17325o34611o16610o02841o47604o77348
$$ plain form
2637.1 713411450 712787211 712211490 711599290 710906863 710176766 709498465 708909512 708329260 707677722 706997514
2657.5 706997514 706378937 705825210 705260932 704657495 704065263 703495741 702899992 702277780 701649785 701033652
2677.9 701033652 700468659 699931562 699374557 698791444 698199332 697636783 697082698 696467042 695793808 695148051
2698.3 695148051 694553137 693936288 693264663 692564726 691874087 691214323 690550208 689867198 689205468 688589275
2718.7 688589275 688019216 687450171 686848640 686257720 685702264 685169935 684640765 684110880 683630407 683209062
2739.1 683209062 682765961 682248235 681715608 681256413 680848777 680406094 679912210 679414451 678962111 678545177
2759.5 678545177 678099334 677625358 677158177 676688313 676205158 675683558 675090313 674460053 673869431 673311234
2779.9 673311234 672693431 672000527 671311259 670651793 669924080 669041574 668088019 667199433 666362703 665449500
$$ packed form
2637.1G13411450o24239n75721o12200o92427p30097o78301n88953n80252o51538o80208
2657.5G06997514o18577n53727n64278o03437n92232n69522n95749o22212o27995o16133
2677.9G01033652n64993n37097n57005n83113n92112n62549n54085o15656o73234o45757
2698.3F95148051n94914o16849o71625o99937o90639o59764o64115o83010o61730o16193
2718.7F88589275n70059n69045o01531n90920n55456n32329n29170n29885m80473m21345
2739.1F83209062m43101n17726n32627m59195m07636m42683m93884m97759m52340m16934
2759.5F78545177m45843m73976m67181m69864m83155n21600n93245o30260n90622n58197
2779.9F73311234o17803o92904o89268o59466p27713q82506r53555q88586q36730r13203
$$ plain form
2800.3 665449500 664401829 663295805 662216485 661150932 660011351 658735037 657375753 656053364
2816.6 656053364 654786766 653439701 651926696 650346637 648799419 647242427 645545781 643666089
2832.9 643666089 641734540 639855564 637874186 635570705 632977724 630214632 627388239 624736071
2849.3 624736071 622477949 620642424 619124293 617773890 616361797 614654541 612646639 610500574
2865.6 610500574 608287752 605968297 603524745 600946903 598257720 595638931 593230426 590988159
2881.9 590988159 588952243 587269723 585923016 584758878 583718121 582833350 582056642 581286371 580516517
2900.2 580516517 579757452 578973055 578153789 577255666 576122701 574597478 572731018 570798457 569071591
2918.6 569071591 567624807 566416323 565447330 564801872 564498961 564428687 564645529 565376163 566709995
$$ packed form
2800.3F65449500j047671j106024j079320j065553j139581j276314j359284j322389
2816.6F56053364j266598j347065j513005j580059j547218j556992j696646j879692
2832.9F43666089j931549j878976j981378k303481k592981k763092k826393k652168
2849.3F24736071k258122j835525j518131j350403j412093j707256k007902k146065
2865.6F10500574k212822k319455k443552k577842k689183k618789k408505k242267
2881.9E90988159k035916j682520j346707j164138j040757q84771p76708p70271p69854
2900.2E80516517p59065p84397q19266q98123j132965j525223j866460j932561j726866
2918.6E69071591j446784j208484r68993o45458l02911p0274K16842P30634J333832
$$ plain form
2937 566709995 568530262 570677221 573087692 575713217 578426123 581132412 583835423 586476982 588994265
2955.3 588994265 591479242 593955755 596278369 598368108 600306332 602158964 603895068 605557144
2971.6 605557144 607251167 609017432 610870659 612726033 614380658 615811288 617186844 618527293
2987.9 618527293 619690001 620566607 621158898 621616423 621976614 622069120 621917665 621708512 621499062 621282756
3008.3 621282756 621012568 620568335 619898677 619088590 618186355 617149651 616032362 614935458 613833845
3026.7 613833845 612702131 611573517 610428035 609188616 607852638 606529772 605219066 603816986
3043 603816986 602296889 600726187 599200904 597655237 596020520 594419658 592855990 591235161 589585364
3061.4 589585364 587997556 586581647 585205555 583582520 581776202 580063224 578582644 577250898
$$ packed form
2937E66709995J820267K146959K410471K625525K712906K706289K703011K641559K517283
2955.3E88994265K484977K476513K322614K089739J938224J852632J736104J662076
2971.6F05557144J694023J766265J853227J855374J654625J430630J375556J340449
2987.9F18527293J162708Q76606N92291M57525L60191R2506j51455k09153k09450k16306
3008.3F21282756k70188m44233o69658q10087r02235j036704j117289j096904j101613
3026.7F13833845j131714j128614j145482j239419j335978j322866j310706j402080
3043F03816986j520097j570702j525283j545667j634717j600862j563668j620829j649797
3061.4E89585364j587808j415909j376092j623035j806318j712978j480580j331746
$$ plain form
3077.7 577250898 575793743 574112356 572375476 570657790 568973541 567290902 565489650 563653111
3094 563653111 561987996 560485363 558923960 557182968 555412173 553789079 552251935 550611913 548949301
3112.4 548949301 547470987 546065509 544483960 542624533 540592968 538659990 536950648 535333753
3128.7 535333753 533641934 531852543 530113697 528568506 527086139 525398493 523558199 521800041
3145 521800041 520163357 518630922 517178953 515595198 513789296 511991322 510315597 508681536 507045686
3163.4 507045686 505414009 503810048 502247810 500698030 499107301 497498840 495929420 494402677
3179.7 494402677 492878705 491318256 489774257 488305807 486851603 485341370 483794302 482257873
3196 482257873 480749458 479292870 477914870 476577282 475202143 473776102 472366780 470989406 469613969
$$ packed form
3077.7E77250898j457155j681387j736880j717686j684249j682639j801252j836539
3094E63653111j665115j502633j561403j740992j770795j623094j537144j640022j662612
3112.4E48949301j478314j405478j581549j859427k031565j932978j709342j616895
3128.7E35333753j691819j789391j738846j545191j482367j687646j840294j758158
3145E21800041j636684j532435j451969j583755j805902j797974j675725j634061j635850
3163.4E07045686j631677j603961j562238j549780j590729j608461j569420j526743
3179.7D94402677j523972j560449j543999j468450j454204j510233j547068j536429
3196D82257873j508415j456588j378000j337588j375139j426041j409322j377374j375437
$$ plain form
3214.3 469613969 468247652 466908604 465592623 464252532 462898672 461607307 460405648 459305018
3230.7 459305018 458223939 456951141 455520093 454188913 452982426 451832682 450773299 449710786
3247 449710786 448515236 447268248 446115434 445027024 443895251 442754120 441681772 440644950 439595580
3265.3 439595580 438638240 437846780 436976343 435869306 434714228 433640182 432661444 431784034 430923641
3283.7 430923641 430020690 429164499 428487092 427888244 427110046 426137656 425131470 424223602 423518538
3302 423518538 422964156 422292113 421340734 420215845 419067860 418011338 417034149 416027069 415001035
3320.4 415001035 414057881 413194805 412233114 411110371 409988523 408946365 408024967 407291681 406565130
3338.8 406565130 405658871 404703617 403805435 403007209 402400285 401774377 400866121 399846047 399011523
$$ packed form
3214.3D69613969j366317j339048j315981j340091j353860j291365j201659j100630
3230.7D59305018j081079j272798j431048j331180j206487j149744j059383j062513
3247D49710786j195550j246988j152814j088410j131773j141131j072348j036822j049370
3265.3D39595580r57340p91460q70437j107037j155078j074046r78738q77410q60393
3283.7D30923641r02951q56191o77407n98848p78198r72390j006186r07868p05064
3302D23518538n54382o72043r51379j124889j147985j056522r77189j007080j026034
3320.4D15001035r43154q63076r61691j122743j121848j042158r21398p33286p26551
3338.8D06565130r06259r55254q98182p98226o06924o25908r08256j020074q34524
$$ plain form
3357.1 399011523 398414433 397878259 397294492 396819919 396485597 396001846 395180494 394215614 393416405 392824024
3377.5 392824024 392279714 391689867 391128570 390668511 390305340 390081078 389831841 389257669 388602525 388361812
3397.9 388361812 388333768 387919456 387132257 386504501 386191666 385965228 385714710 385390013 385013074 384736449
3418.3 384736449 384569138 384433359 384378850 384453267 384606749 384740353 384855330 385026574 385121673 384999394
3438.7 384999394 384857237 384895712 385097563 385425061 385764480 386028081 386294633 386576056 386894852 387377411
3459.1 387377411 387896687 388342440 388945907 389739364 390353680 390599072 390771925 391171157 391789675 392457753
3479.5 392457753 393051118 393628150 394288749 394987464 395628303 396221310 396865278 397623867 398384601 399078548
3499.9 399078548 399834454 400598258 401201516 401826769 402705818 403722316 404557556 405142725 405725956
$$ packed form
3357.1C99011523n97090n36174n83767m74573l34322m83751q21352r64880p99209n92381
3377.5C92824024n44310n89847n61297m60059l63171k24262k49237n74172o55144k40713
3397.9C88361812k8044m14312p87199o27756l12835k26438k50518l24697l76939k76625
3418.3C84736449j67311j35779n4509P4417J53482J33604J14977J71244R5099j22279
3438.7C84999394j42157L8475K01851L27498L39419K63601K66552K81423L18796M82559
3459.1C87377411N19276M45753O03467P93457O14316K45392J72853L99232O18518O68078
3479.5C92457753N93365N77032O60599O98715O40839N93007O43968P58589P60734O93947
3499.9C99078548P55906P63804O03258O25253Q79049J016498Q35240N85169N83231
$$ plain form
3518.2 405725956 406457037 407390714 408365846 409191430 410067111 411049873 411967903 412926316 413989902
3536.6 413989902 414935827 415761709 416687280 417835116 419050872 420037866 420956016 422096431 423299462
3554.9 423299462 424439937 425633997 426762879 427563101 428527355 430550337 432906717 434441358 435601532
3573.3 435601532 437009007 438636303 440369457 441970319 443152785 444403946 446530789 448811948
3589.6 448811948 450313419 451797962 453834981 455986470 458099753 460208923 461947262 463484526
3605.9 463484526 465652883 468245417 470552444 472580582 474281341 476419926 479429573 481768161
3622.2 481768161 482689172 483344495 486198723 490711629 493766040 496114701 498648852 501062393 503292561
3640.6 503292561 505034268 505983233 507142663 510562897 515164614 517709196 519423008 522350252
$$ packed form
3518.2D05725956P31081R33677R75132Q25584Q75681R82762R18030R58413J063586
3536.6D13989902R45925Q25882R25571J147836J215756R86994R18150J140415J203031
3554.9D23299462J140475J194060J128882Q00222R64254K022982K356380J534641J160174
3573.3D35601532J407475J627296J733154J600862J182466J251161K126843K281159
3589.6D48811948J501471J484543K037019K151489K113283K109170J738339J537264
3605.9D63484526K168357K592534K307027K028138J700759K138585L009647K338588
3622.2D81768161R21011O55323K854228M512906L054411K348661K534151K413541K230168
3640.6E03292561J741707R48965J159430L420234M601717K544582J713812K927244
$$ plain form
3656.9 522350252 525235176 527202010 528793097 529789865 530337691 531948686 534163237 535242915 537478864
3675.3 537478864 541007519 543085039 544265687 544924617 545005322 545839429 548133850 550185204 551229179
3693.6 551229179 551860750 552251637 552754283 554055452 555409133 555632830 555331528 556134045 558788061
3712 558788061 560959101 561193764 560643017 560242295 560262263 560742795 561482906 561636269 561067700 560972333
3732.4 560972333 562412441 564991951 566397786 565424085 564476550 566143334 567391157 567033827 568553805
3750.7 568553805 571063638 571613967 571232796 571707368 572578967 572705030 572675586 572932005 573637187 574734747
3771.1 574734747 575187504 574850798 574617982 575146794 575829029 576126277 576529920 576960742 577116787 576950371
3791.5 576950371 576478481 576162398 575761199 575491428 576564133 577311575 577465892 578583360 578992367
$$ packed form
3656.9E22350252K884924J966834J591087R96768N47826J610995K214551J079678K235949
3675.3E37478864L528655K077520J180648O58930Q0705Q34107K294421K051354J043975
3693.6E51229179O31571L90887N02646J301169J353681K23697l01302Q02517K654016
3712E58788061K171040K34663n50747m00722J9968M80532P40111J53363n68569r5367
3732.4E60972333J440108K579510J405835r73701r47535J666784J247823l57330J519978
3750.7E68553805K509833N50329l81171M74572Q71599J26063k9444K56419P05182J097560
3771.1E74734747M52757l36706k32816N28812O82235K97248M03643M30822J56045j66416
3791.5E76950371m71890l16083m01199k69771J072705P47442J54317J117468M09007
$$ plain form
3809.9 578992367 577856362 576836169 577117085 577239752 577408314 578972757 579760969 579517722 579173326
3828.2 579173326 578681052 578313947 577889562 577850163 578856945 579786658 580298960 580781639 580376804 578424871
3848.6 578424871 576080143 576945007 580878019 581981659 580743492 579558671 579287529 579567730 579251111
3867 579251111 579237580 580238521 580938399 581053078 580444872 579919338 580105722 580132961 580612302 580990613
3887.4 580990613 580507755 580705345 581101537 580263674 579092085 578727603 579223394 580330491 581359625
3905.7 581359625 581540465 581204355 580750227 580141127 579826653 580123186 580377758 580209732 580142260 580215216
3926.1 580215216 579934716 579678893 579959273 580275774 580173552 579834700 579531193 579503119 579498529 579288900
3946.5 579288900 579265833 579427958 579449177 579323530 579149783 578996003 578936160 578946054 578907132 578776658 578584373
$$ packed form
3809.9E78992367j136005j020193K80916J22667J68562J564443P88212k43247l44396
3828.2E79173326m92274l67105m24385l9399J006782R29713N12302M82679m04835j951933
3848.6E78424871k344728Q64864L933012J103640j238167j184821k71142K80201l16619
3867E79251111j3531J000941O99878J14679o08206n25534J86384K7239M79341L78311
3887.4E80990613m82858J97590L96192q37863j171589l64482M95791J107097J029134
3905.7E81359625J80840l36110m54128o09100l14474K96533K54572j68026o7472P2956
3926.1E80215216k80500k55823K80380L16501j02222l38852l03507k8074m590k09629
3946.5E79288900k3067J62125K1219j25647j73747j53780n9843R894l8922j30474j92285
$$ plain form
3969 578584373 578416824 578347743 578335762 578270376 578129649 578027785 578030407 578011394 577859342 577677011 577568591
3991.4 577568591 577477515 577337980 577213287
3997.5 577213287
$$ packed form
3969E78584373j67549o9081j1981o5386j40727j01864K622j9013j52052j82331j08420
3991.4E77568591r1076j39535j24693
3997.5E77213287
##END=$$ End of the data block
