##TITLE=Fibra Residuo - Bianca $$ Begin of the data block
##JCAMP-DX=5.00 $$ ACD/SpecManager v 10.08
##SPECTROMETER/DATA SYSTEM=Alpha
##DATE=24 Oct 2013 13:19:44
##DATA TYPE=INFRARED SPECTRUM
##DATA CLASS=XYDATA
##ORIGIN=
##OWNER=
##NPOINTS=1765
##FIRSTX=399.75695801
##LASTX=3997.56933594
##MAXX=3997.56933594
##MINX=399.75695801
##MAXY=0.78150189
##MINY=0.38304010
##XFACTOR=1.0000000000
##YFACTOR=1.000000000000000e-9
##FIRSTY=0.66861159
##DELTAX=2.03957629
##XUNITS=1/CM
##YUNITS=ARBITRARY UNITS
##XYDATA=(X++(Y..Y))
399.8 668611586 667762280 664536834 662131667 663263500 665348351 664728105 662254572 661200643 662232995
418.1 662232995 662443638 659807146 656687498 655901551 656554818 655412674 651976943 649270296 649553001
436.5 649553001 651242673 651520789 650681078 651637971 654971838 657694459 657494307 655732155 655265093
454.8 655265093 656426668 656811893 654824018 652300477 651781380 652460814 651322365 648002803 645527840
473.2 645527840 645822465 646771789 645584047 642799973 641504109 642769337 644064009 643064499 640852749
491.5 640852749 640134931 641101360 641152382 638829589 635995209 635071158 635393143 634446144 631437540
509.9 631437540 628256738 626705110 625877321 623634398 620039046 617396533 617006123 617584944 616915941
528.3 616915941 615242839 615132689 617549896 620659351 622638762 623889029 625977933 628737509 630057395
546.6 630057395 628945827 626990616 626074731 625875235 624457657 621250689 618124843 616610527 615747273
565 615747273 613657951 610096216 606824100 605601609 606111348 606721640 607204139 608953238 612479210
583.3 612479210 616284966 618560433 619229257 619713247 620821595 621807694 621634007 620637417 620146811
601.7 620146811 620471060 620551765 619698763 618829072 619252086 620593369 621378601 621678233 622858524 625440598
622.1 625440598 628812551 631532431 632775545 633477211 634878159 636707127 637744129 637733638 637649298
640.4 637649298 638313949 639311075 639528096 638977289 638903797 639786184 640837193 641102493 640591979 640398264
660.8 640398264 641151607 640752316 636267960 633159876 637471795 641987324 644562960 646036565 647224069
679.2 647224069 649060488 651720226 654179037 655452251 655956566 656936944 658610106 659863234 659806669
697.5 659806669 658877134 658219576 658289850 658393383 658026516 657849312 658892930 661288679 663867295
715.9 663867295 665587902 667467058 671092570 675697327 679588914 682266355 684421957 687014222
732.2 687014222 689924002 692104399 693063438 693520248 694320917 695202529 695118546 693672001 691738844
750.6 691738844 690333784 689264715 687649488 685465574 683804870 683518589 684256554 685189009 686248899
768.9 686248899 688366115 692067564 696451843 700253606 703309536 706558406 710547924 714444518
785.2 714444518 717185795 718996465 720945239 723572254 726261556 728198051 729650199 731484175
801.6 731484175 733865857 735958874 736992598 737433255 738424957 740080237 741382360 741692722 741544127
819.9 741544127 741819799 742427409 742339849 741032422 739285469 738244057 737994075 737543941 736286879
838.3 736286879 734859049 734090209 733684182 732628226 730653763 728647470 727369845 726352751 724581420
856.6 724581420 722099662 720451772 721041977 723474443 726208210 728528976 730971098 733828843 736216545
875 736216545 737032294 736311316 734997511 733545125 731383383 727919221 723666847 720004261 717625499
893.3 717625499 715888560 714065075 712417483 711592019 711379230 710613132 708338499 704909205 701455832
911.7 701455832 698201001 694314599 689549148 684989035 681919813 680377126 679223120 677720129
928 677720129 676445007 676302493 677041948 677481771 677160144 676886737 677362144 677729607 676233172 672246575
948.4 672246575 666818082 661087275 654901803 647513330 639010072 630324662 621996701 613430738
964.7 613430738 603740215 592986941 581970930 571001053 559480309 546878934 533741176 521321237
981 521321237 510404825 500968397 492887676 486441195 481977373 479238361 477319866 475399703 473416328
999.4 473416328 471808583 470547765 468930930 466475546 463570386 460969746 458944142 457227558
1015.7 457227558 455704421 454733908 454752594 455689251 456896096 457881600 458814502 460092723 461632699
1034.1 461632699 462859750 463477761 463858128 464393467 464879364 464876503 464543045 464795858 466456503 469420463
1054.5 469420463 472971410 476869076 481650323 487711340 494285136 499471873 501434207 499765903
1070.8 499765903 495750040 491332591 488017708 486612946 487400144 489981741 493297070 496437907
1087.1 496437907 499423683 502797008 506572425 509929180 512025893 512891889 513220429 513552189 513961315
1105.4 513961315 514510632 515717208 518193543 521823525 525673747 528932154 531648219 534384549
1121.8 534384549 537353158 540277123 543199956 546782851 551209986 555430353 557975888 558147550
1138.1 558147550 556387901 553546965 549951792 545542419 540691853 536327183 533080399 530717552
1154.4 530717552 528756976 527372181 527365744 529380918 533328712 538768113 545616925 554063678 563893676
1172.7 563893676 574200213 584016323 593238294 602396488 611555040 619986594 626949787 632463098
1189.1 632463098 636999130 640601218 642749548 643240869 642831624 642572641 642786205 643072844 643157482
1207.4 643157482 643424869 644364297 645687163 646511316 646419346 645848870 645283461 644480765 642887235
1225.8 642887235 640591860 638333023 636629820 635307908 633890867 632322788 631100297 630606949
1242.1 630606949 630582392 630572021 630639672 631209254 632363975 633612871 634451449 634982646 635796189 637191296
1262.5 637191296 638799727 640279174 641890883 644024014 646500945 648681462 650199533 651306152
1278.8 651306152 652480066 653870225 655175865 656153619 656956077 657758057 658368409 658379495 657644033
1297.2 657644033 656511724 655399919 654243886 652672470 650644958 648553550 646680892 644957781
1313.5 644957781 643213212 641579032 640518486 640046656 639482856 638233900 636338055 634290636 632493615
1331.8 632493615 630947590 629567742 628688991 628864229 629966855 631191790 631982923 632304370 632334232
1350.2 632334232 632064939 631311834 630022109 628300726 626354456 624564588 623082161 621509373 619883060
1368.5 619883060 618717670 618182003 618389904 619251490 620462120 621997237 623903692 626344025 629742444
1386.9 629742444 633668721 636694133 638370693 639174819 639472127 639528692 639414012 638748407 637565494
1405.3 637565494 636167288 634534657 632682741 630587935 628006339 625086546 622942626 621991396
1421.6 621991396 621382594 620920897 620675206 620921373 621770322 622477889 623198688 624863684 626753449
1439.9 626753449 628187120 629071653 629356742 629523158 629847288 629760742 628782094 627671242 628482878
1458.3 628482878 630416155 631770372 633395672 636351585 639796495 643560886 649303377 656658351
1474.6 656658351 663538456 669484794 674725771 679439545 683171034 685922444 688767612 692320883
1490.9 692320883 695035398 696114182 696768641 697967350 698916614 698476970 696822584 696773350 699320555
1509.3 699320555 701810181 703569949 704933822 706597269 708694756 711642444 715061128 717768669
1525.6 717768669 720098853 721881211 722862720 723926306 724701643 723999083 723421872 725282371 727849424
1543.9 727849424 729727924 730717778 731228352 731491983 731045842 729389131 727937937 729892313 732114255
1562.3 732114255 732272029 731177509 729563951 728320241 726999640 724383891 721281111 719029605
1578.6 719029605 716674626 713486671 709681571 705537558 701384842 697414815 693662167 690114915
1594.9 690114915 686819017 683739603 680745840 677771449 674762249 671757281 668952048 666353047
1611.3 666353047 663382232 659805477 656707168 654590189 652234375 649632037 647417009 645465732
1627.6 645465732 643854082 642132163 639716446 637848318 638025165 638817072 639151514 638788462 638483942
1645.9 638483942 639464378 640251577 640780807 644140244 648189485 650695026 652742028 655466795 658884168
1664.3 658884168 661535203 663956702 667749226 671774387 675623596 679959893 683677197 686135590
1680.6 686135590 688330233 692656994 697713137 701359034 704473734 706584275 707770169 708822250
1696.9 708822250 710019827 712449014 714549720 715050578 715077996 714778423 713618875 711355150 708170831
1715.3 708170831 705404282 704266608 703464746 701885819 699687004 697144449 694466770 691805303
1731.6 691805303 689789653 689195871 688834667 688625932 689358592 690555215 691689432 693071783 695819318
1749.9 695819318 700098753 704099059 707589090 711450338 715757012 720959663 726168573 730323434
1766.3 730323434 733945549 737531781 741994143 746785104 750226259 752650023 755014002 757361114
1782.6 757361114 759281635 760643184 761346340 761838138 763168275 764787912 765620947 766157091 767246008
1800.9 767246008 768686295 769657016 770058393 770426750 771237552 772202551 772764206 773063540 773534775
1819.3 773534775 774032414 774209619 774209857 774170041 774529099 775657237 776601195 776827693 776906490 777040541
1839.7 777040541 776879847 776751518 777232707 777892530 778472662 778987348 779211938 779145300 779111862 779367626
1860.1 779367626 779690862 779572845 778877974 778483868 779187977 780134380 780463457 780379951 780386686 780652344
1880.5 780652344 780938387 780942619 780630946 780427158 780742466 781131566 781158090 781075895 781137943 781346381
1900.9 781346381 781501889 781361043 781003058 780860305 781105220 781271040 780924082 780456722 780469477 780714750
1921.3 780714750 780894935 780979514 780912399 780893207 781023324 781067550 780882061 780615151 780388236 780278325
1941.7 780278325 780342638 780390680 780367315 780433297 780542016 780496359 780287027 780137300 780179501 780252874 780108631
1964.1 780108631 779804051 779679179 779805958 779924154 779846370 779626131 779466212 779465973 779498816 779374719
1984.5 779374719 779091418 778814435 778683543 778689504 778622568 778407514 778243244 778199911 778105557 777826309
2004.9 777826309 777456403 777205288 777083755 776875436 776444554 775983691 775734961 775624812 775446117 775067389
2025.3 775067389 774563849 774182379 773980439 773760915 773403585 772999585 772684693 772498846 772307634 771991372
2045.7 771991372 771669626 771491110 771420002 771311104 771090150 770863891 770765305 770755589 770699024 770549655
2066.1 770549655 770399511 770337462 770334780 770283461 770120621 769937217 769862711 769849539 769766212 769597709 769446015
2088.5 769446015 769409001 769427598 769362211 769186795 769026577 768990576 769005120 768917382 768716335 768555641 768522441
2110.9 768522441 768512607 768387496 768194079 768079281 768048227 767983854 767823756 767634451 767508805 767452180
2131.3 767452180 767382383 767234683 767054617 766943932 766929924 766929209 766837656 766681314 766598940 766617119 766628206
2153.8 766628206 766564667 766487181 766504467 766630888 766768217 766816676 766814709 766904831 767112076 767303407 767408550
2176.2 767408550 767497838 767662704 767890632 768065691 768126070 768160522 768282950 768468678 768613517 768695772
2196.6 768695772 768764138 768859208 768988431 769104481 769156992 769187868 769284964 769431889 769522071 769528449 769528031
2219 769528031 769580603 769660532 769704759 769686222 769646525 769649684 769683719 769672513 769596159 769522488 769513607 769532025
2243.5 769532025 769478083 769338429 769203305 769121945 769060493 768950164 768745720 768498957 768320382 768229842
2263.9 768229842 768128037 767986953 767916918 767978311 768110394 768225431 768337250 768518567 768658996 768497765
2284.3 768497765 767924011 767058611 766107082 765183389 764243662 763177216 761940479 760631323 759261131
2302.7 759261131 757520020 755191684 752570271 750187635 748298168 746411800 743546367 739515960
2319 739515960 735370159 732143998 729625583 726946831 724145114 722146153 721026540 719794989 718152821
2337.3 718152821 716618299 716020167 718159258 724167228 729377568 728599608 721894264 712660849 704495251
2355.7 704495251 698916018 696532965 697217286 700485051 705661535 712091148 719355941 726913214
2372 726913214 734097719 740536809 746239543 751368940 755786419 759046435 760877311 761547387 761661828
2390.4 761661828 761644125 761533320 761259675 760898829 760599196 760412812 760213017 759867728 759457648 759155571
2410.8 759155571 758954346 758692145 758287966 757830977 757459939 757176101 756850898 756404698 755917192 755536735
2431.2 755536735 755271018 754953623 754481673 753973186 753600240 753321290 752947688 752451658 751969934 751608908
2451.5 751608908 751325548 750947475 750441849 749988914 749689996 749446988 749097168 748615503 748152316 747799635
2471.9 747799635 747470498 747032344 746517062 746093273 745822370 745578229 745212197 744746625 744357705 744115114
2492.3 744115114 743865430 743482471 743054509 742721021 742484689 742233336 741866112 741445899 741130173 740903080
2512.7 740903080 740622878 740260303 739883959 739552081 739283085 738986969 738573611 738124609 737761497 737454295
2533.1 737454295 737080455 736623883 736198425 735862434 735553384 735183656 734729230 734290361 733969331 733684719
2553.5 733684719 733293712 732827067 732431233 732136488 731846392 731468379 731030285 730645657 730321646 729984701
2573.9 729984701 729590118 729153931 728790700 728542030 728254139 727822959 727358639 726996064 726707160 726389110
2594.3 726389110 726013124 725646913 725363135 725115180 724773586 724298835 723806441 723393083 723011136 722564995
2614.7 722564995 722039640 721494257 720984697 720501900 719944656 719277978 718611300 718015015 717433572 716770709
2635.1 716770709 716056705 715419233 714848936 714251220 713594377 712888718 712203860 711582303 710949063 710257351
2655.5 710257351 709588528 709018707 708499372 707936108 707298458 706653416 706084430 705546260 704947710 704316020
2675.9 704316020 703721344 703158736 702582955 701990008 701404989 700836480 700284958 699709594 699065030 698392451
2696.3 698392451 697764039 697183609 696572304 695871234 695138216 694439292 693757534 693061233 692379236 691763580
2716.7 691763580 691197395 690627813 690018594 689378917 688789129 688283086 687788010 687233806 686667085 686192930
2737.1 686192930 685791016 685341418 684815109 684309065 683905005 683540702 683088660 682540238 682000458 681553364
2757.5 681553364 681172252 680735946 680213630 679708183 679271579 678810239 678239763 677630126 677060902 676514089
2777.9 676514089 675919592 675224125 674491704 673824668 673208892 672504604 671622097 670670688 669788420 668933988
2798.3 668933988 667986989 666925907 665821016 664742768 663698554 662607789 661370158 659995735
2814.6 659995735 658618450 657302201 655933797 654424131 652843356 651275456 649697185 647992074
2830.9 647992074 646107435 644173682 642283022 640267968 637948096 635354400 632574916 629722893
2847.2 629722893 627030432 624734938 622911990 621421874 620033860 618547738 616805553 614806592
2863.5 614806592 612677693 610468388 608156264 605707586 603103518 600417674 597812831 595370054
2879.9 595370054 593081176 591035724 589350581 588003576 586864173 585849583 584973872 584223092 583522558
2898.2 583522558 582790077 581990719 581163406 580334663 579430282 578285456 576768219 574940443 573056877
2916.6 573056877 571342409 569849610 568586886 567607880 566982687 566696882 566657782 566910088 567646921
2934.9 567646921 568977475 570815682 573007762 575453758 578093350 580816925 583517432 586208761
2951.2 586208761 588854849 591394007 593911529 596405745 598720670 600816071 602790773 604687333
2967.6 604687333 606453955 608125925 609815061 611567914 613424420 615296066 616947532 618378758
2983.9 618378758 619779468 621137738 622290373 623154521 623768210 624263823 624629140 624719083 624593794
3002.2 624593794 624399304 624167502 623916686 623628557 623179615 622476935 621588111 620629132 619609535
3020.6 619609535 618543863 617482245 616369843 615181983 613996148 612814248 611535668 610170722
3036.9 610170722 608876050 607620597 606202543 604619145 603031814 601512671 599964440 598317802
3053.2 598317802 596689701 595112383 593481362 591815591 590231359 588783503 587312698 585621715
3069.5 585621715 583827019 582156956 580689847 579356074 577905893 576215565 574439406 572677732
3085.8 572677732 570975840 569294930 567485332 565630496 563931942 562368691 560763538 559024215
3102.2 559024215 557279944 555675149 554111302 552414119 550694287 549179435 547772586 546219766
3118.5 546219766 544397891 542345881 540337741 538600147 536993504 535282075 533485651 531782210
3134.8 531782210 530232668 528678477 526934981 525098622 523345888 521682560 520145714 518734515
3151.1 518734515 517191112 515370905 513492882 511734784 510090113 508482158 506838560 505207121
3167.4 505207121 503618538 502027452 500398695 498744071 497158080 495665610 494153678 492594659
3183.7 492594659 491071224 489586860 488055259 486454397 484861881 483342797 481876969 480411172
3200.1 480411172 478940696 477491230 476074755 474680871 473295897 471917361 470543832 469173133
3216.4 469173133 467804611 466450155 465115130 463777661 462456524 461222738 460117340 459030181
3232.7 459030181 457713753 456225753 454879731 453682810 452515155 451414675 450329244 449137390
3249 449137390 447920322 446799666 445706308 444552153 443387121 442277223 441212326 440171987 439227164
3267.4 439227164 438428909 437563211 436469138 435298085 434179932 433155984 432241887 431361079 430470109
3285.7 430470109 429641694 428967088 428331822 427514106 426549554 425574154 424659491 423911452 423313618 422614366
3306.1 422614366 421635330 420475125 419303089 418218285 417187214 416155994 415150672 414173573 413195908
3324.5 413195908 412137717 410994619 409878373 408817559 407861650 407075256 406293988 405384660 404439539
3342.8 404439539 403498292 402651280 402018607 401353180 400403321 399386138 398586452 397973895 397361755
3361.2 397361755 396723151 396234006 395875901 395320743 394408613 393417567 392629266 392019242 391486675 390920222
3381.6 390920222 390297174 389730006 389328212 389125794 388857514 388234764 387539983 387239844 387187749 386812836
3402 386812836 386047155 385378480 385012597 384778708 384523779 384159625 383726507 383403420 383237660 383114636
3422.4 383114636 383040100 383138269 383370429 383511424 383570492 383710504 383770525 383593142 383411765 383445203
3442.8 383445203 383673936 384010196 384323925 384582847 384856462 385176659 385587454 386074126 386516780 386977375
3463.2 386977375 387662977 388503045 389129311 389380008 389557570 389966935 390626997 391366124 392001241 392562717
3483.6 392562717 393216878 393931866 394596159 395274401 396010011 396797657 397563308 398262382 399036407 399831057
3504 399831057 400476009 401146322 402046978 403066456 403945297 404648066 405356497 406154126 407083213 408019185
3524.4 408019185 408855438 409784228 410794050 411749542 412788481 413897663 414848268 415710300 416723728
3542.7 416723728 417973429 419228345 420238286 421236038 422457486 423706174 424874932 426128536
3559 426128536 427332968 428125173 429014623 431040406 433526903 435229570 436525524 438035846 439747989
3577.4 439747989 441525757 443167746 444426775 445719749 447847873 450203061 451843530 453403383
3593.7 453403383 455440760 457621723 459841758 462105334 463969231 465559483 467744142 470403731
3610 470403731 472834557 474941343 476653993 478851616 482030869 484539270 485559851 486249536 489086896
3628.4 489086896 493620545 496755540 499202728 501843452 504357398 506697774 508545101 509521306
3644.7 509521306 510616958 513991117 518698275 521424353 523256898 526252747 529224694 531286418
3661 531286418 532964706 534018815 534542918 536079168 538255453 539343238 541627884 545253754 547445118
3679.4 547445118 548737526 549465477 549521863 550281763 552572668 554722011 555860043 556520462 556916833
3697.7 556916833 557406306 558649242 559970140 560228884 559975266 560786843 563441694 565693438 566040039
3716.1 566040039 565535247 565124631 565109432 565553427 566310287 566490471 565899670 565781832 567220807 569820940
3736.5 569820940 571318626 570459604 569539785 571069837 572123230 571650505 573143184 575758517 576501667
3754.8 576501667 576287270 576850832 577763259 577936232 577909768 578086257 578755319 579934657 580476940 580197692
3775.2 580197692 580022871 580560029 581157327 581349790 581739843 582270503 582543850 582410038 581891477 581528485
3795.6 581528485 581087053 580738604 581774056 582580149 582760453 583894908 584386468 583301663 582236826
3814 582236826 582409024 582431257 582548976 584152102 585017681 584817290 584537745 584139585 583790481 583262980
3834.4 583262980 583096445 584070802 585098326 585749984 586320758 585943520 583955407 581489682 582235157
3852.7 582235157 586251497 587493896 586299121 585133791 584895909 585211337 584849715 584737718 585736454
3871.1 585736454 586491883 586675406 586137652 585617125 585792124 585830271 586319029 586687267 586172938 586419642
3891.5 586419642 586944461 586164117 584945142 584489346 584932804 586087227 587213397 587431371 587074935
3909.8 587074935 586624563 586055338 585770905 586067498 586318314 586161137 586088479 586147428 585855961 585608661
3930.2 585608661 585945964 586300313 586182475 585789323 585436821 585440159 585495293 585293055 585261524 585435271
3950.6 585435271 585447192 585293353 585147321 585061729 585026920 585041821 584987700 584807098 584605634 584439814
3971 584439814 584340513 584318697 584300876 584259152 584221244 584194481 584119260 583967566 583828092 583712459 583558738
3993.4 583558738 583424866 583378971
3997.5 583378971
##END=$$ End of the data block
