##TITLE=Fenol-sililado $$ Begin of the data block
##JCAMP-DX=5.00 $$ ACD/SpecManager v 10.08
##SPECTROMETER/DATA SYSTEM=Alpha
##DATE=23 May 2014 08:10:48
##DATA TYPE=INFRARED SPECTRUM
##DATA CLASS=XYDATA
##ORIGIN=
##OWNER=
##NPOINTS=1765
##FIRSTX=399.75695801
##LASTX=3997.56933594
##MAXX=3997.56933594
##MINX=399.75695801
##MAXY=0.88248098
##MINY=0.46565261
##XFACTOR=1.0000000000
##YFACTOR=1.000000000000000e-9
##FIRSTY=0.82095402
##DELTAX=2.03957629
##XUNITS=1/CM
##YUNITS=ARBITRARY UNITS
##XYDATA=(X++(Y..Y))
399.8H20954025l237784j433671J689315J798451n38289m72188J417636J180232p86960
418.1H20570767q93295L83020n49078j909674r20176M2975j083434q60751K015353
436.5H16795707L144800J256705J38044Q33809J66893k160370k623796q82089j8239
454.8H16651464k67804O37173J820744J008510l80814J50144J118362Q5712j144231
473.2H19679260m31299r54j475989k463997j503229j147211k929389m372180l320098
491.5H02034914o13629J697600K889335K952218J870155P78556J152575J899660P38561
509.9H15399945j091421k72751K279520K905190J876116J729906J690387K20120j314461
528.3H23422551j451611j974583m705846p706106p726848m602611m13358K642869K724469
$$ y = [820954025, 817716241, 816282570, 817971885, 819770336, 819232047, 818759859, 820177495, 821357727, 820570767, 819677472, 820060492, 819511414, 817601740, 816681564, 816724539, 815641105, 814780354, 816795707, 819940507, 821197212, 821335256, 822169065, 822335958, 820175588, 817551792, 816669703, 816651464, 816383660, 817020833, 818841577, 819850087, 819469273, 819619417, 820737779, 820823491, 819679260, 819247961, 819247007, 817771018, 815307021, 813803792, 812656581, 809727192, 805355012, 802034914, 801421285, 803118885, 806008220, 808960438, 810830593, 811609149, 812761724, 814661384, 815399945, 814308524, 814035773, 816315293, 819220483, 821096599, 822826505, 824516892, 824737012, 823422551, 821970940, 819996357, 815290511, 807584405, 799857557, 795254946, 794841588, 797484457, 800208926]
546.6H00208926O56009P53820M408955O975770N463660K521932R69708M44293l24249
565H22078824j384020k036392k517403m302501p015705p088900k821505J702368K302468
583.3G98917234k4736k795577n048454m265189J682818P538736P651925M337907L68118
601.7H08362782o209970j5672504j8054247n921841M624546k105534j5563131k4918556
618G24541545k9482842j7665565J6097784M3263078L8022995J5351117K6524j927495
634.3G88227141J445234K334296J601398J060546K83182K50577J110971J488686O10471
652.7G98412502j257181l406704n831659q759677j0626972q890927m811346O59108
669G55487144M766047O565690N598187m07457q457899j4144719j5307307j2617648
$$ y = [800208926, 800864935, 801618755, 806027710, 813003480, 818467140, 820989072, 821958780, 822403073, 822078824, 820694804, 818658412, 816141009, 811838508, 804822803, 797733903, 794912398, 796614766, 798917234, 798892498, 796096921, 791048467, 786783278, 788466096, 796004832, 803656757, 807994664, 808362782, 802152812, 786480308, 768426061, 762504220, 767128766, 765023232, 749460101, 724541545, 695058703, 677393138, 693490922, 736754000, 774776995, 790128112, 790154636, 788227141, 789672375, 792006671, 793608069, 794668615, 794951797, 795202374, 796313345, 797802031, 798412502, 797155321, 793748617, 787916958, 779157281, 768530309, 759639382, 754828036, 755487144, 760253191, 766818881, 772417068, 772009611, 763551712, 749406993, 734099686, 721482038]
685.3G21482038r965419j0148227r695530k959252O655991P246018m925549j3657928
701.6F84032142K392829L4623384N0546408M1805327K5481522J3391614O390571K351821
717.9H61015618K61903p91729k792358o386519q224129m163444K700030M045606j529813
736.3H44135165r038031j5041232j5259326n352854Q360922J2138128K452076j3214290
752.6H09180558k8115213l5285056k7576566j1003792n144894j8554866k9169560j0533154
768.9F43797457K8592706N7354510N7651281L7787557J8713414Q693696M876196N160928
785.2H62627745O249666M696965J948416P69198N92411J28627l26217j43647J22130
803.6H76665294j55151n08129m38691m37200r31322j340509j260578j065016j302421
$$ y = [721482038, 711516619, 701368392, 691672862, 688713610, 695369601, 702615619, 697690070, 684032142, 686424971, 721048355, 771594763, 813400090, 838881612, 852273226, 858663797, 861015618, 861277521, 860485792, 857693434, 851306915, 843082786, 838919342, 841619372, 845664978, 844135165, 835097134, 820055902, 804796576, 799443722, 807804644, 819942772, 822394848, 809180558, 781065345, 745780289, 718203723, 707199931, 702055037, 683500171, 654330611, 643797457, 672390163, 729744673, 787395954, 825183511, 843896925, 852590621, 857466817, 862627745, 868877411, 873574376, 875522792, 876291990, 876884401, 877013028, 876686811, 876543164, 876665294, 876510143, 876002014, 875563323, 875126123, 874194801, 872854292, 871593714, 870528698, 869226277]
821.9H69226277k229214m189491o647468o130218m75407M286468J494408o353975j3778209
840.3H35203171j9616902k5148988k5335729j2590587O662607K0155609K5713324K4464369
856.6H29506874J7563105R547949L706097M3154k590239n512178r376288j3982296
872.9H28906178j8851339k2851944k4495781k2636115j6325713l892958J4692486K8919875
889.3G63464689K6751995J3261617Q6009q807957j2956441j4197468j6465128j9897699
905.6G31239617k0628333j5541315m280210R421766J9596755K3558915K3499370K2312104
921.9G89178669K0000220J5072763Q865833O456435Q110344Q115888N755067M074931
938.2H65630150K890587J138985p15554k198994l220499k694964J02937K876461K924680
$$ y = [869226277, 866997063, 862807572, 856160104, 850029886, 849554479, 853840947, 855335355, 848981380, 835203171, 815586269, 790437281, 765101552, 752510965, 759173572, 779329181, 805042505, 829506874, 847069979, 856617928, 860324025, 860367179, 857776940, 852264762, 842888474, 828906178, 810054839, 787202895, 762707114, 740070999, 723745286, 719852328, 734544814, 763464689, 790216684, 803478301, 803564310, 794756353, 781799912, 767602444, 751137316, 731239617, 710611284, 695069969, 690789759, 700211525, 719808280, 743367195, 766866565, 789178669, 809178889, 824251652, 833117485, 839573920, 847684264, 855800152, 861555219, 865630150, 868520737, 869659722, 868944168, 866745174, 863524675, 860829711, 860932648, 863809109, 866733789]
956.6H66733789Q01921j275837k377629k851487k978861k551615j190722K83420K88963
974.9H54881942r24527k209604l675640n560279p077455p617355q094608q998633q013844
993.3H02709997l769100J151502N060911Q166015Q020223L797412j92643k308607m907787
1011.6H17727923p049203m527807J825035M461467O86526k928912k713502k156555
1027.9H05324972j324118K273918N017101L430605l46779l575385n407870o405294
1044.3G98987150p505238q622348r411693j0736882j3325990j6456425j8891454k0546138
1060.6F93490982k2401094k4439454k5558591k5400460k3896277j8805325q966804
1074.8E44022977j117229m052162j3774216j8390894j5404135j0560453p261664n086988
$$ y = [866733789, 867535710, 866259873, 863882244, 861030757, 858051896, 855500281, 854309559, 854592979, 854881942, 853957415, 851747811, 848072171, 842511892, 835434437, 827817082, 819722474, 810723841, 802709997, 798940897, 800092399, 805153310, 813319325, 821339548, 825136960, 824944317, 822635710, 817727923, 810678720, 806150913, 807975948, 812437415, 813123941, 810195029, 807481527, 805324972, 804000854, 806274772, 811291873, 814722478, 814375699, 810800314, 805392444, 798987150, 791481912, 782859564, 773447871, 762710989, 749384999, 732928574, 714037120, 693490982, 671089888, 646650434, 621091843, 595691383, 571795106, 552989781, 544022977, 542905748, 538853586, 525079370, 506688476, 491284341, 480723888, 473462224, 468375236]
1091.2D68375236k722621J324147P302552J3211340J5932560J2982964L943980l544926
1107.5E16805232L539860K1373749L2809972L3716381K8902054K2361994K4075031
1121.8F83584273L3885956L4491777K4120987J5544712J1575937R486676P838726O166756
1138.1H26695800M855275L984988K925455J646817J194298J675487J393080q11935
1154.4H43559265l807843n769670n957603n415142n399644o768584j0141135j1188328
1170.7G89111316k311408J2533247J7782152Q435011m469216r407878m044592N475342
1187H13103974J2603819J4864683J1727989O360948L105164K039969J278698K80440
1203.3H65365684l56555n74291r97662j722336k237678k656281l761410n678237p933736
$$ y = [468375236, 465652615, 466976762, 474279314, 487490654, 503423214, 516406178, 520350158, 516805232, 520345092, 541718841, 574528813, 608245194, 637147248, 659509242, 683584273, 717470229, 751962006, 776082993, 791627705, 803203642, 812690318, 820529044, 826695800, 831551075, 835536063, 838461518, 840108335, 841302633, 842978120, 844371200, 843559265, 839751422, 833981752, 828024149, 822609007, 817209363, 810440779, 800299644, 789111316, 786799908, 799333155, 817115307, 825550318, 821081102, 811673224, 807628632, 813103974, 825707793, 840572476, 852300465, 858661413, 861766577, 863806546, 865085244, 865365684, 865009129, 864434838, 863437176, 861714840, 859477162, 856820881, 853059471, 847381234, 839447498]
1221.7H39447498j0639846j4550924j9294322k2169769j9456565j0918498k052128
1236G40365446K427160M070402N793094P300198P656455P507623P511735O981194N096852
1254.3G94710159K054453j199007l976106o849587j1072576j6624511k1726906k4477303
1270.6G10838616k3666322j8249154q089066K891719P901848N800187L274024N252838
1287F85954690R285688J1477232J2311042J3983547J6341269J7580688J6827345J4619112
1303.3G98380613J1867047R376704P579744O382823N516470M943073M598379M152417
1319.6H52797270L511667K761841K186715K214313K298951J585305N57780K71678N59032
1338H68744552N32031L52204O75857R90570M35531o12915j288473j995802l700018
$$ y = [839447498, 828807652, 814256728, 794962406, 772792637, 753336072, 742417574, 740365446, 742792606, 746863008, 752656102, 759956300, 767612755, 775120378, 782632113, 789613307, 794710159, 796764612, 795565605, 791589499, 784739912, 773667336, 757042825, 735315919, 710838616, 687172294, 668923140, 660834074, 663725793, 671627641, 677427828, 680701852, 685954690, 695240378, 706717610, 719028652, 733012199, 749353468, 766934156, 783761501, 798380613, 810247660, 819624364, 827204108, 833586931, 839103401, 844046474, 848644853, 852797270, 856308937, 859070778, 861257493, 863471806, 865770757, 867356062, 867913842, 868185520, 868744552, 869276583, 869628787, 870304644, 871295214, 871730745, 871117830, 869829357, 867833555, 864133537]
1356.3H64133537n896211p214069o589473l343760J148104M843831O194651N011261
1372.6H58287871K462804n17547l476202o076932o596327l753722J42276J072705J23024
1391H41667950R13084K834558K863586R56178p15614k234876m896581q004188j1176348
1409.3H22207749j4978111j5968621r363055L954768J5910328J5508115J0612845Q891523
1425.7H36775541P897199N946040L194928J175523p85947l996372p055760j1026621
1442H32124531j5208482j2896538k356470M326463l02732r187997k1485924k5738478
1458.3G49274373p682264Q229256J5737235J5739978J1547863R735406J0434866R045660
1474.6H22062373M910112N49435l579378p212818j0635495j5275955k1921098k6930869
$$ y = [864133537, 858237326, 851023257, 844433784, 841090024, 842238128, 847081959, 853276610, 858287871, 860750675, 860233128, 856756926, 850679994, 844083667, 840329945, 840472221, 841544926, 841667950, 842581034, 845415592, 848279178, 849235356, 848519742, 846284866, 841388285, 833384097, 822207749, 807229638, 791261017, 781897962, 785852730, 801763058, 817271173, 827884018, 836775541, 844672740, 850618780, 853813708, 854989231, 854203284, 850206912, 843151152, 832124531, 816916049, 804019511, 801663041, 805989504, 805686772, 796498775, 775012851, 749274373, 741592109, 749821365, 765558600, 781298578, 792846441, 802581847, 813016713, 822062373, 826972485, 827521920, 823942542, 816729724, 806094229, 790818274, 768897176, 741966307]
1490.9G41966307k5424778k3160339k0572304j2929202q545756j1052370k0895839
1505.2F19385719k9131770l371477L4225106N7437897O0445905M8065841K9572070
1519.5H16629291J6915261Q891225L367722K28226j527667k704024m806101o000817
1535.8H30993116o848872j1087239j3020873r330570o739974p144630j2148917k0211637
1552.1G44460404k5936723j8816233R546638M0400207L3162713K3207128J6959787
1566.4H22983921R441196L497780q94308n771339r573937l795087L687143M475177
1582.7H24050546o64592p403016r729445p068098p257342j4287412k1809221k1333336
1599G34498084j0270238N582750J3909876R874642N0366q800149j5427351k6393473
$$ y = [741966307, 716541529, 693381190, 672808886, 659879684, 651333928, 640281558, 619385719, 590253949, 586882472, 621107578, 678545475, 738991380, 787057221, 816629291, 833544552, 842435777, 845803499, 846031725, 844504058, 841800034, 836993933, 830993116, 824144244, 813057005, 800036132, 790705562, 783965588, 776820958, 764672041, 744460404, 718523681, 699707448, 709254086, 749654293, 782817006, 806024134, 822983921, 832425117, 835922897, 835028589, 829257250, 819683313, 815888226, 819575369, 824050546, 823385954, 815982938, 806253493, 799185395, 791928053, 777640641, 755831420, 734498084, 724227846, 729810596, 743720472, 753595114, 753645480, 744845331, 729417980, 703024507]
1615.3G03024507m2536676m5957446m4217289l9268136j1339307K7337611N2368879
1629.6E99412143N3162158M5034051L9371311K6561618J4786959J0710001R040236
1643.9G98078477R062887Q499026N894363N594134O226897L786028K732456L076076
1660.2H42950344L387451K996207K357065K562046K894342K496839K204418K175570
1676.5H64024282K046942J974106J855552J540363J032710O91772N09202O27160R83834
1694.9H75285923Q68977K76208j86682r537J09911j80960j69337J74642K81394J6331
1715.3H76466870l85523n81204m90249m20510j55151K85387N19097N18858N16236N70059
1735.7H76843870O27160P22646Q73447J080573J054585P52091L96788J29819n4956
$$ y = [703024507, 660487831, 614530385, 570313096, 531044960, 519705653, 547043264, 599412143, 652574301, 697608352, 736979663, 763541281, 778328240, 789038241, 798078477, 807141364, 815640390, 821534753, 827128887, 833355784, 837141812, 839874268, 842950344, 846337795, 849334002, 851691067, 854253113, 857147455, 859644294, 861848712, 864024282, 866071224, 868045330, 869900882, 871441245, 872473955, 873165727, 873674929, 874302089, 875285923, 876154900, 876431108, 876244426, 876234889, 876344800, 876163840, 875994503, 876169145, 876450539, 876466870, 876081347, 875500143, 875009894, 874589384, 874434233, 874719620, 875238717, 875757575, 876273811, 876843870, 877471030, 878193676, 879067123, 880147696, 881202281, 881954372, 882351160, 882480979, 882426023]
1754H82426023k23517j85907l3140k53260n22018l68297j27792k00808p44760r44972
1774.4H78821552o01888n68092p39276m27067K87771P15613Q04544Q70525P34032L05593
1794.8H80203307J38878L00348L44575N1915k01940j07110N6029j14858l41297k12252
1815.2H80117595k4259r9063k14994j08123M1187R656j44362j05560J70767K26438
1835.6H79869282J23263K60412M45843K29299j40130q1540Q2195k2471j85966o7115
1856H80513072J60277J72257J49966L17037L96847Q3626k57552j44839J0788j43587
1876.4H81257892l07680k58684k94983n95450q43347r28342j023769j009226p85232
1894.7H75211179n27441n28813p36117p63059n69760n42582p55071p71404l83973P6652
$$ y = [882426023, 882202506, 882016599, 881983459, 881730199, 881208181, 880839884, 880712092, 880511284, 879766524, 878821552, 878219664, 877651572, 876912296, 876485229, 876773000, 877488613, 878293157, 879163682, 879897714, 880203307, 880342185, 880642533, 880987108, 881039023, 880837083, 880729973, 880786002, 880671144, 880329847, 880117595, 880093336, 879994273, 879779279, 879671156, 879712343, 879721999, 879577637, 879472077, 879642844, 879869282, 879992545, 880252957, 880698800, 880928099, 880787969, 880706429, 880788624, 880766153, 880580187, 880513072, 880673349, 880845606, 880995572, 881312609, 881709456, 881793082, 881535530, 881390691, 881401479, 881257892, 880950212, 880691528, 880396545, 879801095, 878957748, 878029406, 877005637, 875996411, 875211179, 874683738, 874154925, 873418808, 872655749, 872085989, 871543407, 870788336, 870016932, 869632959, 869709611]
1915.1H69709611L64959N99206Q04603Q27849O83307N74708N47588M78447L53038K92599
1935.5H75235915L42608L82483K95698J61529Q8334k4021k05099l23534l59535m49241
1955.9H75145137o53326q55684j023591j196981j224100q71897k24292K96533M47512
1974.3H69839311L51607K13802O8724r0658k25544l54469n01215o48261o84678m95553
1994.7H67473066k50101j07825J3590J77622K90095K38300P6413n4240j36435k07842
2015.1H67512643j98304k4796K07126L40998M07815N18561O02364N49496M62949M58777
2035.5H70837629M81605M51327L96311L75867L33488K16901J37508J64092J74164Q0765
2055.9H73649657k39L8922Q3924k683j00553k9683O4671k861q9764k3902P6294L8803
$$ y = [869709611, 870074570, 870673776, 871478379, 872306228, 872989535, 873564243, 874111831, 874590278, 874943316, 875235915, 875578523, 875961006, 876256704, 876418233, 876506567, 876482546, 876277447, 875953913, 875594378, 875145137, 874491811, 873636127, 872612536, 871415555, 870191455, 869319558, 869095266, 869391799, 869839311, 870190918, 870404720, 870473444, 870382786, 870157242, 869802773, 869301558, 868653297, 867968619, 867473066, 867222965, 867115140, 867128730, 867306352, 867596447, 867834747, 867911160, 867856920, 867720485, 867512643, 867314339, 867289543, 867496669, 867837667, 868245482, 868764043, 869366407, 869915903, 870378852, 870837629, 871319234, 871770561, 872166872, 872542739, 872876227, 873093128, 873230636, 873394728, 873568892, 873649657, 873649418, 873688340, 873772264, 873769581, 873669028, 873639345, 873704016, 873701155, 873611391, 873587489, 873663783, 873702586]
2080.3H73702586l1829M7922J61827J14739L1828P4864J25408O0797j0610K4378O5983
2102.8H74367893J1921l6300J5915N0068k5571q6128k4379M2141l2962j31726r0599
2125.2H74060273r358j9669m1843K4319Q8811K6047q1658p1645Q047k1637r6023m4465
2149.7H73821199L3617l3379j50203j24634l1054n7161j36256q2731K2173L576n9128
2172.1H73206019k0504L5704l8565j17600n5253J2815l6776r6262m4584L8505K9683
2194.6H72913182J371O3836R1493j4960o4075O7830J43110P809q5950K0146R7335l1054
2219H73210073j46926m4584L8743r0957j96159j28567j02043k03490j80304J9729Q4340
2241.5H72259855n6028j17481j4663J8537q5771r9659J1921K1756j00374j34587m1724
$$ y = [873702586, 873670757, 873718679, 873880506, 873995245, 874027073, 874101937, 874227345, 874288142, 874277532, 874301910, 874367893, 874379814, 874343514, 874359429, 874409497, 874383926, 874297798, 874273419, 874315560, 874282598, 874150872, 874060273, 874050915, 874031246, 873989403, 874013722, 874102533, 874128580, 874046922, 873975277, 873983324, 873961687, 873865664, 873821199, 873854816, 873821437, 873671234, 873546600, 873515546, 873458385, 873322129, 873239398, 873261571, 873265147, 873206019, 873185515, 873221219, 873182654, 873065054, 873009801, 873022616, 872985840, 872889578, 872844994, 872883499, 872913182, 872914553, 872978389, 873069882, 873054922, 872990847, 873058677, 873201787, 873209596, 873123646, 873143792, 873241127, 873210073, 873063147, 873018563, 873057306, 872966349, 872770190, 872641623, 872539580, 872336090, 872155786, 872175515, 872259855, 872203827, 872086346, 872071683, 872090220, 872004449, 871904790, 871916711, 871938467, 871838093, 871703506, 871661782]
2263.9H71661782j6331p8619l6597R8347Q8811p2419j33395n0545k3902o9260l3498
2286.3H71334374N6744L2842q9824j00315N841L0339l5465n0664l1471j18613k63691
2308.8H70770097k97487k26974k13802l31641m61399n11706n00917m27366l16560j75178
2329.2H67307067l6597j4663n6446n7935j20283k92003l21448K5452L40998J46627
2349.6H66920769k91049m92692m04895l07500j31249J26183K48432K20179K28107K94149
2370H66410434K46108R9122O1870J63615J83046L5822q0347l5107M6253O1333J02282
2392.4H67294431K05397K49267J76311J08480J19030Q6487l3975r1076j7285K4736
2412.8H68121803m8757q2254k0623k742p2539j22488p0691k3901r9421j55210q6844
$$ y = [871661782, 871645451, 871566832, 871530235, 871628582, 871717393, 871644974, 871511579, 871461034, 871437132, 871367872, 871334374, 871391118, 871423960, 871334136, 871233821, 871239662, 871270001, 871234536, 871183872, 871152401, 871033788, 870770097, 870472610, 870245636, 870031834, 869700193, 869238794, 868727088, 868226171, 867798805, 867482245, 867307067, 867270470, 867255807, 867199361, 867141426, 867021143, 866729140, 866407692, 866433144, 866774142, 866920769, 866629720, 866137028, 865732133, 865424633, 865293384, 865419567, 865667999, 865888178, 866116285, 866410434, 866656542, 866755664, 866817534, 866981149, 867164195, 867200017, 867119670, 867084563, 867130816, 867192149, 867294431, 867499828, 867749095, 867925406, 868033886, 868152916, 868239403, 868205428, 868114352, 868097067, 868121803, 868073046, 867990792, 867970169, 867967427, 867894888, 867772400, 867701709, 867677808, 867578387, 867423177, 867336333]
2435.2H67336333o4612j73986k19762j15573n3883j18136j69397j08421n9068j30653
2455.6H66122842j87278j53661j79589l18050m11391l75927l60250m59075m71532l02613
2476H62903476j83463j88470j10865Q1599J84297J58132J72913K44736K01404L8326
2496.4H63502085m8280l8862j03593k03371j70469m6968K6524J8656L6895J17481J04427
2518.9H63194525j4722m4227M6611O6280l6776q0764j4543m3512k03729k50041j71483
2541.3H62447619j96814l31700l86476l45827l74972m53651l98279k14159p3075k087
2561.7H59670579J19448K85983L41773K57254K20716K78473K32398O7532l099L3736
2582.1H61504793O855j11640j81556j36792j20282j62244q3387P5161P8976m6253q6546
$$ y = [867336333, 867271721, 867097735, 866877973, 866762400, 866708517, 866590381, 866420984, 866312563, 866253495, 866122842, 865935564, 865781903, 865602314, 865284264, 864872873, 864496946, 864136696, 863677621, 863206089, 862903476, 862720013, 862531543, 862420678, 862502277, 862686574, 862844706, 863017619, 863262355, 863463759, 863502085, 863453805, 863414943, 863311350, 863107979, 862937510, 862890542, 862917066, 862935722, 862972617, 863090098, 863194525, 863179803, 863135576, 863182187, 863248467, 863211691, 863130927, 863116384, 863072872, 862869143, 862619102, 862447619, 862250805, 861919105, 861532629, 861186802, 860811830, 860358179, 859959900, 859745741, 859672666, 859670579, 859790027, 860076010, 860417783, 860675037, 860895753, 861174226, 861406624, 861474156, 861471057, 861504793, 861511648, 861400008, 861218452, 861081660, 860961378, 860799134, 860715747, 860790908, 860869884, 860823631, 860737085]
2604.5H60737085l8266m4167j16110j38581j10447j35720j71303j12594q34K9385j5914
2626.9H59882534M530P1763N9307j3530j7464M3690L4690l6240m4882L278j6868r9838
2651.4H59870970j02103l1650l3557j37687j91450j15812q5354j61707j51157m4406
2671.8H58816087m3630j43350j69038j25408j64390k45631j92702n9783n9247j85311
2692.2H57427597k33591j87695k29656l46899l71337l41416m14490n63264o29783n67555
2712.6H53541911m29988k49028r0182r5964l06546m57347k96950K4616J77563J18017
2733H51936102Q4877J08063K5809j01745r5308l517l8981k35558l72350l63707l45886
2755.4H50597799l19362j89125m173P1705j3709j03534j07884j05143j44064k00451
$$ y = [860737085, 860698819, 860654652, 860538542, 860399961, 860289514, 860153794, 859982491, 859869897, 859869063, 859898448, 859882534, 859887064, 859958827, 860018134, 860004604, 859987140, 860030830, 860065520, 860029280, 859984398, 859987676, 859970808, 859870970, 859768867, 859737217, 859703660, 859565973, 859374523, 859258711, 859173357, 859011650, 858860493, 858816087, 858772457, 858629107, 858460069, 858334661, 858170271, 857924640, 857731938, 857672155, 857612908, 857427597, 857194006, 857006311, 856776655, 856429756, 856058419, 855717003, 855302513, 854739249, 854109466, 853541911, 853111923, 852862895, 852772713, 852676749, 852370203, 851912856, 851615906, 851640522, 851818085, 851936102, 852020979, 852129042, 852154851, 852053106, 851957798, 851954281, 851915300, 851679742, 851307392, 850943685, 850597799, 850278437, 850089312, 850085139, 850156844, 850143135, 850039601, 849931717, 849826574, 849682510, 849482059]
2775.8H49482059k10404k11477k51889k23220j12533q5473k38121m03643m31358m63546
2796.2H46850395o32524q50618r36032q75949p50423o03616n75602o83904p70151p92087
2816.6H39379489q26299r68396j219273j471639j735091k105534k474368k671241k825976
2835H23081672l187477l843785m572451n029440n227029n270302n127073n093753n907178
2853.3G79823184p995725j0992884j4271081j6890764j6736031j1504173j613855R081125
2869.7G08899796J6206503J8043816J5918195J1982322P439196K947331p65562l023744
2886G77647853l370226k010464Q5711J822770K606153K543927K023279J201094J66118
2904.3G82716215q59201j800180k785206l880143n019843n984784o392657n959451
$$ y = [849482059, 849271655, 849060178, 848808289, 848585069, 848472536, 848387063, 848148942, 847745299, 847313941, 846850395, 846217871, 845367253, 844431221, 843555272, 842804849, 842201233, 841625631, 840941727, 840171576, 839379489, 838553190, 837584794, 836365521, 834893882, 833158791, 831053257, 828578889, 825907648, 823081672, 819894195, 816050410, 811477959, 806448519, 801221490, 795951188, 790824115, 785730362, 779823184, 771827459, 760834575, 746563494, 729672730, 712936699, 701432526, 699818671, 708899796, 725106299, 743150115, 759068310, 771050632, 778489828, 781437159, 780671597, 777647853, 774277627, 772267163, 772352874, 774175644, 776781797, 779325724, 781349003, 782550097, 782716215, 781857014, 780056834, 777271628, 773391485, 768371642, 762386858, 755994201, 750034750]
2920.6G50034750m789174l435373k429843j942218k003669k527953l510058n158603
2937G24237859p200181q255840o765246k663255K311051N688071N756617K956092p1108
2955.3G15994060r23455N99802L505349O841302R702265J1362076J1809051J1663020
2971.6G70553470J1330008J0751903R896159Q710981P125437N482733M183889L198504
2987.9H31233084K342820J542211Q53538M19736K23458J53959J93357K65778L14474
3006.3H37542415L64661M11928M08828L11255J33932p3731k76804m92513p78318j111924
3026.7H36439729j372397j547873j758635k047122k196312k014220j806437j888514
3043H21808219k201974k676011l215551l660202l835976l743351l700912l596246k871275
$$ y = [750034750, 745245576, 741810203, 739380360, 737438142, 735434473, 732906520, 729396462, 724237859, 717037678, 708781838, 702016592, 699353337, 701664388, 707352459, 713109076, 716065168, 715994060, 715070605, 715670407, 719175756, 726017058, 735719323, 747081399, 758890450, 770553470, 781883478, 792635381, 802531540, 811242521, 818367958, 823850691, 828034580, 831233084, 833575904, 835118115, 835971653, 836391389, 836614847, 836768806, 836962163, 837227941, 837542415, 837907076, 838319004, 838727832, 839039087, 839173019, 839099288, 838822484, 838329971, 837551653, 836439729, 835067332, 833519459, 831760824, 829713702, 827517390, 825503170, 823696733, 821808219, 819606245, 816930234, 813714683, 810054481, 806218505, 802475154, 798774242, 795177996, 792306721]
3061.4G92306721j470685L29673K222300L784716M663944M738331M325688L815949
3077.7H14716637L213406K500772J761854J112401P60198O65128O24061O36578O04927
3096H26595962K65420l56019q09610o13034J30177Q26836J144170J206517J118303
3114.4H29508722Q68440N96821L49462R6202k4855K0921L8683j25468l03626k48789
3134.8H30776513p4566j29342m15444n32985m25696l82781l76284l20375m22478o09815
3155.2H27086747n79238m18008l49402m03106m99666n82039o49572p22706p81119p47561
3175.6H21354330o67990o48975o83725p09832p23362p47442p64608p34151o71208o52432
3196H14350605o32048n35845m67778n17726n85436o24121p32362q85725r94384j032412
$$ y = [792306721, 790836036, 791165709, 793388009, 797172725, 801836669, 806575000, 810900688, 814716637, 817930043, 820430815, 822192669, 823305070, 824065268, 824730396, 825354457, 825991035, 826595962, 826861382, 826505363, 825695753, 825082719, 825212896, 826039732, 827183902, 828390419, 829508722, 830377162, 830973983, 831323445, 831419647, 831394792, 831415713, 831454396, 831328928, 831025302, 830776513, 830701947, 830572605, 830157161, 829624176, 829198480, 828815699, 828439415, 828119040, 827696562, 827086747, 826507509, 826089501, 825740099, 825336993, 824837327, 824255288, 823605716, 822883010, 822101891, 821354330, 820686340, 820037365, 819353640, 818643808, 817920446, 817173004, 816408396, 815674245, 815003037, 814350605, 813718557, 813182712, 812714934, 812197208, 811611772, 810987651, 810255289, 809369564, 808375180, 807342768]
3216.4H07342768j028776j045108r96292q24451p02739o90699o45756o22273p86900
3234.7G99999774r82225j007021r33826q83043q59379p66874o04451n10156n53727
3253.1G92899072o42359o76930o92487p58052q10206p61866o43969n69820o82295q47280
3273.5G85813808r10699r71854r87112r24647r24587j016259j022995q42810p82430
3291.8G77430415j062274j375973j482129j440287j249254j028418j150370j642406
3308.2G66999304k036810k060890j914561j879513j953542j981080j908719j912058
3324.5G51352131k193868k461493k433479k375781k365172k274990k357483k663851
3340.8G32226014k896368k973855k834380k614200k821982l287971l352999l127635
$$ y = [807342768, 806313992, 805268884, 804272592, 803448141, 802745402, 802054703, 801408947, 800786674, 799999774, 799017549, 798010528, 797076702, 796193659, 795334280, 794567406, 793962955, 793452799, 792899072, 792256713, 791579783, 790887296, 790129244, 789319038, 788557172, 787913203, 787343383, 786661088, 785813808, 784903109, 783931255, 782944143, 782019496, 781094909, 780078650, 779055655, 778212845, 777430415, 776368141, 774992168, 773510039, 772069752, 770820498, 769792080, 768641710, 766999304, 764962494, 762901604, 760987043, 759107530, 757153988, 755172908, 753264189, 751352131, 749158263, 746696770, 744263291, 741887510, 739522338, 737247348, 734889865, 732226014, 729329646, 726355791, 723521411, 720907211, 718085229, 714797258, 711444259, 708316624]
3357.1G08316624l039956l144562l173113k961934k876162l150761l479898l480912
3373.4F83009326l205180k954483k793371k726913k670348k462387k095222j756609
3389.7F62344813j838684k242505k256096j756727j485050j889110k287209k017081
3406.1F46572351j565218j421511j464188j563370j536071j256407j019597j007855
3422.4F35738134r41455o34789l54410l80814l60727j01864j15693m00901l54767K3902
3442.8F32116616L35932M57763M62353N73814P68364Q44717R28044J083851J068175
3461.1F38639629J062453J382589J609802J270592P76291P88808J157165J476705J488447
3479.5F49652481J201332J187265J480102J484752J303613J365960J516401J547695
$$ y = [708316624, 705276668, 702132106, 698958993, 695997059, 693120897, 689970136, 686490238, 683009326, 679804146, 676849663, 674056292, 671329379, 668659031, 666196644, 664101422, 662344813, 660506129, 658263624, 656007528, 654250801, 652765751, 650876641, 648589432, 646572351, 645007133, 643585622, 642121434, 640558064, 639021993, 637765586, 636745989, 635738134, 634796679, 634161890, 633807480, 633426666, 633065939, 632964075, 632848382, 632447481, 632092714, 632116616, 632452548, 632910311, 633372664, 633946478, 634714842, 635559559, 636487603, 637571454, 638639629, 639702082, 641084671, 642694473, 643965065, 644741356, 645530164, 646687329, 648164034, 649652481, 650853813, 652041078, 653521180, 655005932, 656309545, 657675505, 659191906, 660739601]
3495.8F60739601J496136J506328J566470J390874J165331J306772J605094J734316
3512.1F72510922J617014J451671J508534J698912J850009J749277J532852J564622
3528.4F85483813J710236J835764J991868J993477J873136K005279K239406K167106
3544.7G01300085J850485J775921J992881K081931K035618K171754K413273K426505
3561.1G18048453K246499K245784K520263K564907K370060K376854K510548K600431
3577.4G37483799K746225K944052K965808K756834K565801K604485K671718K700210
3593.7G59438932K784193K881050K835989K665400K538145K506256K607465K663195
3610G80920625K599060K533138K358794K280712K359391K201199J955331J795828J865566
$$ y = [660739601, 662235737, 663742065, 665308535, 666699409, 667864740, 669171512, 670776606, 672510922, 674127936, 675579607, 677088141, 678787053, 680637062, 682386339, 683919191, 685483813, 687194049, 689029813, 691021681, 693015158, 694888294, 696893573, 699132979, 701300085, 703150570, 704926491, 706919372, 709001303, 711036921, 713208675, 715621948, 718048453, 720294952, 722540736, 725060999, 727625906, 729995966, 732372820, 734883368, 737483799, 740230024, 743174076, 746139884, 748896718, 751462519, 754067004, 756738722, 759438932, 762223125, 765104175, 767940164, 770605564, 773143709, 775649965, 778257430, 780920625, 783519685, 786052823, 788411617, 790692329, 793051720, 795252919, 797208250, 799004078, 800869644]
3628.4H00869644K016425J786113J557409J447201J381278J361072J317382J273692
3644.7H13010216J305401J356304J062691N91338N37395Q56280R21429O16610M46260
3663H20703924N12302M63903L45707M56631M23073J87755J92523L64602N12480O57797
3683.4H24820697Q48174J024306P17700J25050Q4102L11614L74853K74062J85490K69771
3703.8H29035819M26530M27008J83880o2108l5941M6372K3186j7166j5855m0471o56
3726.3H29970598K14756L86536L52859J35303K324L4452o8128k43724o1631K57016
3746.7H30980361M3749k21908n7161J22846O9260J4782O2823N5969J6213M947m1664
3769.1H31050217r2506o8248L9638J34646P3374j18673k25008j78337p4327j8000k8670
$$ y = [800869644, 802886069, 804672182, 806229591, 807676792, 809058070, 810419142, 811736524, 813010216, 814315617, 815671921, 816734612, 817325950, 817863345, 818719625, 819641054, 820257664, 820703924, 821216226, 821680129, 822025836, 822482467, 822905540, 823093295, 823285818, 823650420, 824162900, 824820697, 825668871, 826693177, 827410877, 827535927, 827620029, 827931643, 828306496, 828580558, 828766048, 829035819, 829462349, 829889357, 830073237, 830011129, 829975188, 830021560, 830044746, 830027580, 830011725, 829971254, 829970598, 830185354, 830571890, 830924749, 831060052, 831062376, 831096828, 831028700, 830784976, 830723345, 830980361, 831024110, 830802202, 830745041, 830867887, 830937147, 830951929, 831014752, 831070721, 831086934, 831091881, 831050217, 830957711, 830889463, 830929101, 831063747, 831137121, 831018448, 830793440, 830615103, 830540776, 830522776, 830494106]
3791.5H30494106k4498O4671R9063n7280j04725m8101k02298k47658k4676J07706K980
3814H30059290r1374l2663j34707k72989k20120j63257j38164j10864l0637O9022l9220
3836.4H28894317k49326k39492j52409r4652n066P9393m3511m03643l16858J05858
3856.8H27574611J73211P6830k8312l3379l0517r0182n3287j2338j7822n9902j25766
3879.2H27373147q4519p4387j35004j25289j17183r3937j7822k8491q9586q7738j16467
3901.7H26402724j66774r6738j8537k0683k6405j2636j2577r119L0517L1352m0173
3924.1H26060951o2049l0934m1962j2756M3571Q95k2591M18m5896j00851o1214j848
3948.6H25725734m0531q0824m1127l2127q4758j06275n2094k8134j09255j36733l6180
$$ y = [830494106, 830469608, 830534279, 830633342, 830576062, 830471337, 830423236, 830220938, 829973280, 829948604, 830056310, 830059290, 829967916, 829935253, 829800546, 829527557, 829307437, 829144180, 829006016, 828895152, 828864515, 828933537, 828894317, 828644991, 828405499, 828253090, 828158438, 828153372, 828232765, 828189254, 827785611, 827468753, 827574611, 827747822, 827824652, 827796340, 827762961, 827732444, 827642262, 827588975, 827576637, 827558815, 827498913, 827373147, 827288628, 827214241, 827079237, 826953948, 826836765, 826742828, 826725006, 826696515, 826606929, 826519191, 826402724, 826235950, 826139212, 826120675, 826099992, 826073587, 826060951, 826048374, 826039255, 826069772, 826101124, 826060951, 825998902, 825967968, 825926006, 825913250, 825956821, 825957716, 825935125, 825935543, 825889647, 825788796, 825727582, 825725734, 825685203, 825604379, 825563252, 825531125, 825446367, 825340092, 825287998, 825259864, 825150609, 825013876, 824977696]
3971H24977696K4199k8491q1002n1141o735j8657q6486j26123q6308o9976o2287j1325
3995.5H24373364l1828
3997.5H24341536
$$ y = [824977696, 825001895, 824973404, 824892402, 824841261, 824834526, 824815869, 824729383, 824603260, 824516952, 824446976, 824384689, 824373364, 824341536]
##END=$$ End of the data block
