##TITLE=Fenol dimetil $$ Begin of the data block
##JCAMP-DX=5.00 $$ ACD/SpecManager v 10.08
##SPECTROMETER/DATA SYSTEM=Alpha
##DATE=26 May 2014 07:44:38
##DATA TYPE=INFRARED SPECTRUM
##DATA CLASS=XYDATA
##ORIGIN=
##OWNER=
##NPOINTS=1765
##FIRSTX=399.75695801
##LASTX=3997.56933594
##MAXX=3997.56933594
##MINX=399.75695801
##MAXY=0.87789512
##MINY=0.18040428
##XFACTOR=1.0000000000
##YFACTOR=1.000000000000000e-9
##FIRSTY=0.79580683
##DELTAX=2.03957629
##XUNITS=1/CM
##YUNITS=ARBITRARY UNITS
##XYDATA=(X++(Y..Y))
399.8G95806825m092932k302169K018272M167974J918018J12176L19600q53836j889587
418.1G95204341J962483M613340J753271r12726n78821n80728k144277j830399Q49128
436.5G98335612J765966M01139P17223K161980Q03709j235187n08070J32799j809001
454.8H00766170k502024N02288J489341j841902m255653l607094k584636j644552J769185
473.2G88091123M734218K232313k545356m343808n068719q444906j0635793o541133
489.5G57477939P14421M709304M818499K460539m484415j4629602j8385113r193182
505.8G23488390P788778K0530283K0977974J4053106P697404M081011K078235k53618
522.1H00441563j904309Q4222K744615M16338o101787j2499273j7203271j9919932
$$ plain form
399.8 795806825 791713893 789411724 791429996 795597970 797515988 797628164 797947764 797093928 795204341
418.1 795204341 797166824 801780164 803533435 802620709 802041888 801461160 799316883 797486484 798335612
436.5 798335612 800101578 800502717 801219940 803381920 804185629 802950442 802442372 802575171 800766170
454.8 800766170 798264146 798766434 800255775 798413873 794158220 790551126 787966490 786321938 788091123
473.2 788091123 792825341 795057654 792512298 788168490 783099771 774654865 764019072 757477939
489.5 757477939 758192360 762901664 767720163 770180702 765696287 751066685 732681572 723488390
505.8 723488390 731277168 751807451 772785425 786838531 794535935 798616946 800695181 800441563
522.1 800441563 798537254 798621476 801366091 801782429 795680642 783181369 765978098 746058166
538.4G46058166j5366912O54221J8460393K2149086J2563467N282223N137026N425275
554.8H00362945L943085L404677L053725P16269j330197o30200J50800j566887l393292
573.1H04710925l952802m849374m686892o44267L777147K962053j723409m981101n080878
591.5G85531402l020227P8320J783610L3617m924655j0580540j6243219k4329544l2316088
609.8F96012676l2057166k7917326l1978428m2017460m9643815l6804199J4953196
624.1D90547478P5977087Q9921177N6800365K4793327J0187924o03914r720087j5230537
640.4G22672820j6725600j2424469n043566j563668l461778l704548j26362K23815
656.7F79846644m478275o147921r04918M341900N214989M253149J986564k623976r641945
$$ plain form
538.4 746058166 730691254 731345475 749805868 771954954 784518421 789800644 794937670 800362945
554.8 800362945 804306030 807710707 810764432 811480701 810150504 809520304 809671104 808104217 804710925
573.1 804710925 800758123 795908749 791221857 790577590 794354737 797316790 795593381 790612280 785531402
591.5 785531402 782511175 782589495 784373105 784406722 779482067 768901527 752658308 728328764 696012676
609.8 696012676 663955510 636038184 604059756 562042296 512398481 475594282 490547478
624.1 490547478 566524565 656445742 713246107 738039434 748227358 747623444 737903357 722672820
640.4 722672820 705947220 693522751 688479185 686915517 683453739 679749191 679622829 679846644
656.7 679846644 675368369 669220448 668315530 672657430 677872419 682125568 684112132 681488156 671846211
675.1F71846211j8372774k8296411l4177721k7733326r552836N923331m39465k9231847
691.4E29965162m8388898l4265280k378166K7953923N2970946P0308805P5666904O6652775
707.7G38486171M8871338L0489206J6407609Q793176N376219K476633L27230K10225
724H51437807J69933j755118l761769m369437p065595j5788197k9118717l6493242
740.4G53255665k3021102M604936J4088094j1166334n2048206p0769072m5909345k062321
756.7E66972315K5577307L4151554L2302022J7571449p620930j3487697J8925488N0775409
773G25166917M5624196K2848845J1464417J3183117J5252530J1991144P429897L975571
789.3H56936634O40511j662254j836837k039194l969490n940855p233023j0644734
$$ plain form
675.1 671846211 653473437 625177026 590999305 563265979 553713143 559636474 559197009 529965162
691.4 529965162 481576264 447310984 444932818 472886741 525857687 596166492 671833396 738486171
707.7 738486171 787357509 817846715 834254324 843047500 848423719 850900352 851227582 851437807
724 851437807 851607740 849852622 846090853 841721416 834655821 818867624 789748907 753255665
740.4 753255665 730234563 734839499 748927593 737761259 685713053 614943981 569034636 566972315
756.7 566972315 592549622 626701176 659003198 676574647 668953717 655466020 674391508 725166917
773 725166917 770791113 793639958 805104375 818287492 833540022 845531166 852961063 856936634
789.3 856936634 857577145 855914891 854078054 852038860 848069370 842128515 834895492 824250758
805.6H24250758j7319680k4136126k9027283l4239173l6881923k0204246K2306740
819.9F84749067N8728158N7204187L1395078R636104J407266L205657N960881L733635
836.2H56020033j328766n265117o634414o794870p789314r578466j1987686j8115699
852.5G88525701l0877471m6789885n6622505m9400985j9777954K2307396N3862452
866.8F61226749N7066024L5470187O887198j7521322l7323296m9958885m7668576l1847417
883.1E76330662j6664624l756941J8913329M5533955N5406630M1879356J9965052N080820
899.4G42688239j844526p71105Q659899J3865113K522290j9715667l9301693m7556341
915.8F58546209m1220605k3061156o16670J9060791L2395184L8805186L9196730L5226464
$$ plain form
805.6 824250758 806931078 782794952 753767669 719528496 682646573 662442327 684749067
819.9 684749067 743477225 800681412 832076490 841712594 843119860 846325517 852286398 856020033
836.2 856020033 854691267 849426150 842791736 835996866 828207552 818629086 806641400 788525701
852.5 788525701 757648230 710858345 654235840 604834855 585056901 607364297 661226749
866.8 661226749 718292773 753762960 760650158 743128836 705805540 655846655 608178079 576330662
883.1 576330662 559666038 555909097 574822426 620356381 675763011 717642367 737607419 742688239
899.4 742688239 740843713 740072608 748732507 762597620 765119910 745404243 706102550 658546209
915.8 658546209 617325604 594264448 593647778 612708569 645103753 683908939 723105669 758332133
932.1G58332133K8854370K2059501J6434729J1696994P125258L862083K443314J173675
948.4H51982057n11289r31263K7955L45707n61118j340866j894474l532887n757749
966.8H37826073o593227n808294m810214m188478m308879o494463j0387123j2694478
983.1G82540917j1531233q745015o358326n294561p508039j3490320j5774250l726005
999.4G10113168J6144395K3076355J3427913O18518r841621k0219147k6773513j9937694
1015.7F86608374J000881K0948649K5015414J4039397p68900q632779n270601M103244
1032G37043679J0401606R529770L935218j728654n770445r581685j2218893j0952294
1048.3G20658302q718311j1396945j8015862k4046897k8695822l2932699l6424577
$$ plain form
932.1 758332133 787186503 809246004 825680733 837377727 844502985 848365068 850808382 851982057
948.4 851982057 851470768 850539505 850567460 850913167 850352049 849011183 847116709 843583822 837826073
966.8 837826073 831232846 825424552 820614338 816425860 812116981 805622518 795235395 782540917
983.1 782540917 771009684 762264669 755906343 750611782 743103743 729613423 713839173 710113168
999.4 710113168 726257563 749333918 762761831 763380349 753538728 733319581 706546068 686608374
1015.7 686608374 687609255 708557904 733573318 747612715 746843815 738211036 732940435 737043679
1032 737043679 747445285 756975055 760910273 759181619 753411174 743829489 731610596 720658302
1048.3 720658302 711939991 700543046 682527184 658480287 629784465 596851766 560427189
1062.6E60427189l7960589l8049370l8428843l7179083l0905872k2368282j7341286
1076.9C38193864j7671645k1976709k7838469l0913264k6409417j5228614m876256
1091.2A93279490k004385n105272n765557J280903J1290610J7849237K1767929K7685926
1107.5B60278881L8196861N0151080N7521284N7454616N0173282M0431857M0104986
1121.8E94312847M8540532M7430098L5111130K4942219J9245148J4955163J1855840
1136G96392977R847403P836222N552054L769576K825261K780139L346741K925635J70231
1154.4H35446239l587723n323768k771199K449572N528510N115986L736436J920462
1170.7H42514515j051545m697979r334326j6023516k2815645k4303317j7478704o082714
$$ plain form
1062.6 560427189 522466600 484417230 445988387 408809304 377903432 355535150 338193864
1076.9 338193864 320522219 298545510 270707041 239793777 213384360 198155746 193279490
1091.2 193279490 191275105 186169833 180404276 181685179 192975789 210825026 232592955 260278881
1107.5 260278881 298475742 348626822 406148106 463602722 513776004 554207861 594312847
1121.8 594312847 642853379 690283477 725394607 750336826 769581974 784537137 796392977
1136 796392977 806240380 814076602 819628656 823398232 826223493 829003632 832350373 835276008 835446239
1154.4 835446239 831858516 826534748 823763549 826213121 831741631 836857617 840594053 842514515
1170.7 842514515 841462970 836764991 827430665 811407149 788591504 764288187 746809483 740726769
1187G40726769L753006J0689915J5775859J7914057J6659558J3474762R673417N758524
1203.3H34425867K199888l72470k283036m581929p203757r577692j2448430j7036438
1219.7G83122003k3657799l2347619m3046832n3642989n9836447n8217227m8720539
1233.9D63652551l3453822j5222877J255154J0708064J2028247R920121J0340392J4235556
1250.3D73463386J8708796K2981584K8894484L6242962M1550636M2016268L8622677
1264.5G02480793L3797085K8224707K1987319J5816748J0235787N510807K513766J798093
1280.8H22365105K359152K697110K582848K382457K045215J705885J595914R73523
1297.2H38707209j293838m995585r331524j4526129k0958304k6335657k6066780j7095208
$$ plain form
1187 740726769 744479775 755169690 770945549 788859606 805519164 818993926 828667343 834425867
1203.3 834425867 836625755 836253285 833970249 829388320 822184563 812606871 800158441 783122003
1219.7 783122003 759464204 727116585 684069753 630426764 570590317 512373090 463652551
1233.9 463652551 430198729 414975852 416231006 426939070 438967317 448887438 459227830 473463386
1250.3 473463386 492172182 515153766 544048250 580291212 621841848 663858116 702480793
1264.5 702480793 736277878 764502585 786489904 802306652 812542439 818053246 820567012 822365105
1280.8 822365105 824724257 827421367 830004215 832386672 834431887 836137772 837733686 838707209
1297.2 838707209 837413371 832417786 823086262 808560133 787601829 761266172 735199392 718104184
1313.5G18104184j730681J3156831K2198558K3952484K0904839J6437412J2291491
1327.8H25315118Q564234N054712K369523J269340J574219K384722K634346J872063
1344.1H51038277N10812j214027k935946m793883p488668j0744095j2818753j2754500
1360.4G98799217j0211528l992140M686713J2673259J3759732N967260k581477m732848
1376.7H14368188l787636n678356q629084n925297R45389K877474J337826L161132
1393G98669636N301297K526224j867533m970729r101987j5143037k0731271k5816202
1409.3G28866398k8758466k4449289j5197217o686330P47383M572749M799962O045341
1425.7F69940531P887185R251654R062946O439805L849983K207220j382411r052276
$$ plain form
1313.5 718104184 716373503 729530334 751728892 775681376 796586215 813023627 825315118
1327.8 825315118 833879352 838934064 841303587 842572927 844147146 846531868 849166214 851038277
1344.1 851038277 851549089 850335062 847399116 842605233 835116565 824372470 811553717 798799217
1360.4 798799217 788587689 784595549 789282262 801955521 815715253 821682513 819101036 814368188
1376.7 814368188 810580552 804902196 796273112 790347815 791293204 794170678 795508504 798669636
1393 798669636 803970933 806497157 804629624 799658895 790556908 775413871 754682600 728866398
1409.3 728866398 700107932 675658643 660461426 653775096 654522479 659095228 663895190 669940531
1425.7 669940531 677827716 687079370 696142316 702582121 706432104 708639324 707256913 698204637
1442F98204637j6894758j4177561o24239M658162n338430j6860664k6492119k9041827
1458.3E93433201j8520057j0842740o197453l11136K579987J28627o372452j4703632
1474.6E39194345k0728409k1230668j3689100J334756J8849969L2666564L8857103
1488.9E75254560L1373679J4486075N273580J1631012K7512312L4726560L0757547
1503.2G31015325K7388095K8329969J9407391R600699M964948J649320j9490q48234
1519.5H21488023j774669k059162k741754l824293m829288p367968j0233522j0176658
1535.8G78480709j3131857k3255647k5834143j9901037j7854094j6944707j6733289
1550.1F44825935j8850743k4123073k3680866m433691L4982621M7166527M5670569
$$ plain form
1442 698204637 681309879 667132318 666508079 671166241 665827811 648967147 622475028 593433201
1458.3 593433201 574913144 564070404 557872951 557561815 560141802 560270429 553897977 539194345
1474.6 539194345 518465936 497235268 483546168 484880924 503730893 536397457 575254560
1488.9 575254560 606628239 621114314 626387894 638018906 665531218 700257778 731015325
1503.2 731015325 758403420 786733389 806140780 815741479 820706427 822355747 822336257 821488023
1519.5 821488023 819713354 817654192 814912438 811088145 806258857 798890889 788657367 778480709
1535.8 778480709 765348852 742093205 716259062 696358025 678503931 661559224 644825935
1550.1 644825935 625975192 601852119 578171253 573737562 608720183 655886710 701557279
1564.3G01557279L9917826K7825952J7629564P230222n320847j7266452j1133850N903721
1580.7G66343415J5001416J2036681J964927r375990j9824385k9040814l4045159k9901743
1597F73158348j7004311j204670J3044953K0215333J4723241j584470k0286858l4734547
1613.3F46327019n2823603p2274864o4539939m8765183l3877998k088458L8763345
1627.6D10720319O9760054P3099196O3085198N6540251M0239215K3356914J6468466
1641.8G53269613J2477755J1270345J1852860Q575022N939126Q373499P891774M687310
1658.2H24337304K943396L350854M803002L955781K282084K626717L170073K521336
1674.5H49990547K503216K197266P69734q22663K68876K894581K490043J395285L20912
$$ plain form
1564.3 701557279 741475105 769301057 786930621 794160843 788839996 771573544 760439694 766343415
1580.7 766343415 781344831 793381512 795346439 785970449 766146064 737105250 703060091 673158348
1597 673158348 656154037 654949367 667994320 688209653 702932894 701348424 681061566 646327019
1613.3 646327019 593503416 521228552 456688613 407923430 374045432 371956974 410720319
1627.6 410720319 480480373 553579569 616664767 673205018 713444233 736801147 753269613
1641.8 753269613 765747368 777017713 788870573 797445595 803384721 811758220 819649994 824337304
1658.2 824337304 827280700 830631554 835434556 839390337 841672421 844299138 847469211 849990547
1674.5 849990547 852493763 854691029 855460763 854638100 854906976 857801557 860291600 861686885 862007797
1692.8H62007797o61731m51207K02477J516878K389074J469612J127005J224935O20126
1711.2H69444966n03778j499236n61833J927316K070308P85827K90037P9095n09262
1729.5H71523440j194716q75771J201511J352012L31879N24342Q59499L12030l16620
1747.9H73717606L3975J114845R39369k8133j96040l48627p61152p56919j274765k147495
1768.3H70292664k509773j777828L1769N48125j30296k08318L42250M35173M7088o41108
1788.7H66429746j179218j74463J427770J516401Q43525M76122N24700M77552J06752
1807H70448887m51028o28829k57313j22607k19762J21653O28412P20262P09057O90222
1827.4H71638954R50277J766502J697779Q88467N97238L55900n44667r55999J41501
$$ plain form
1692.8 862007797 861346066 860894859 861097336 862614214 865003288 866472900 867599905 868824840 869444966
1711.2 869444966 868941188 867441952 866880119 868807435 870877743 871663570 871953607 872032702 871523440
1729.5 871523440 870328724 869452953 870654464 872006476 872338355 872862697 873722196 874034226 873717606
1747.9 873717606 873751581 874866426 875805795 875777662 875581622 875232995 874471843 873714924 872440159 870292664
1768.3 870292664 867782891 866005063 866036832 866584957 866454661 866246343 866588593 867023766 867070854 866429746
1788.7 866429746 865250528 865076065 866503835 868020236 868863761 869339883 869864583 870342135 870448887
1807 870448887 869997859 869369030 869111717 868989110 868769348 868891001 869519413 870239675 870948732 871638954
1827.4 871638954 872589231 874355733 876053512 876941979 877539217 877895117 877350450 876394451 876535952
1845.8H76535952Q11279L71575P630k7657j30951l53694k29776J69813J19985m93110
1866.2H76781046n01275N59926P98762p8261o00815n31792n48005p17461p33018q94010
1886.6H73535097j447022j621425j270771r46522n59271j93238M9830P1704j79648
1904.9H67438734k63215J49072N96404M54426n663K7835N71192O78599O52075R68694
1925.3H71268153Q86142M17591K34842L42548K13980k16662o12796p45296n39482l76940
1945.7H70872080m00185m92633p87079r86755p62522n89252q71360j071572o76632
1964.1H64234090N4717O18577P18474M97043J03236m60267p92206o28173l71337l23534
1984.5H63650620j87516J28329J83522K0683k4378q4281k95818n33938n36085l12209
$$ plain form
1845.8 876535952 877347231 877718806 877726436 877698779 877567828 877214134 876984358 877154171 877274156 876781046
1866.2 876781046 876279771 876839697 877638459 877560198 876959383 876427591 875879586 875162125 874429107 873535097
1886.6 873535097 872088075 870466650 869195879 868249357 867690086 867496848 867546678 867618382 867438734
1904.9 867438734 867175519 867324591 867920995 868375421 868369758 868397593 868968785 869647384 870299459 871268153
1925.3 871268153 872154295 872571886 872806728 873149276 873363256 873146594 872533798 871788502 871249020 870872080
1945.7 870872080 870471895 869979262 869192183 868205428 867442906 866853654 865982294 864910722 864234090
1964.1 864234090 864288807 864907384 865625858 866122901 866226137 865765870 864973664 864345491 863974154 863650620
1984.5 863650620 863463104 863591433 863774955 863795638 863771260 863686979 863391161 862857223 862321138 862008929
2004.9H62008929k79069m89354n62489m72367m62472l42906J02938M98056N92649O44088
2025.3H61238003Q81076J121223J088082R79364J138568J333475J160920Q77976Q05498
2043.6H70624185O96778M05431K19464K72036K83062O6221r0063M2141J05142j12533
2064H72511864j83106L7432J01984q3268j24514Q2493J62482j311k9147J48415J37329
2086.5H72760653r0241j03593J03176J13904n4955l0160J72377J64687l5405k5570
2106.9H72974873J57058J12712r1672p1048P6055k8312k43843j71840O855q6308k04086
2129.3H72430444j252J93775L9816j32084k4915N3942j32322k37823p3254p808j88529
2151.7H71919990k42770m2439J7226j63495j81377O437n961k06649j62124P1346K8789
$$ plain form
2004.9 862008929 861729860 861240506 860678017 860205650 859743178 859400272 859503210 860001266 860593915 861238003
2025.3 861238003 862119079 863240302 864328384 865307748 866446316 867779791 868940711 869818687 870624185
2043.6 870624185 871320963 871726394 871945858 872217894 872500956 872567177 872477114 872519255 872624397 872511864
2064 872511864 872328758 872366190 872468174 872384906 872260392 872342885 872505367 872504056 872474909 872623324 872760653
2086.5 872760653 872670412 872566819 872669995 872783899 872728944 872698784 872871161 873035848 873000443 872974873
2106.9 872974873 873131931 873244643 873152971 873081923 873157978 873129666 872885823 872713983 872720838 872634530 872430444
2129.3 872430444 872429192 872622967 872662783 872530699 872505784 872559726 872427404 872189581 872116327 872108519 871919990
2151.7 871919990 871677220 871634781 871652007 871488512 871307135 871313572 871307611 871100962 870938838 871010184 871038973
2174.2H71038973k02953j77980j728r4235k94090j83165L5048k4975j50025R478K33471
2196.6H70187819J91808Q6546K04622L23058J81555K2710J04487J69813j8477j55747
2217H71298194p6473r5665k94805l45766j89543j43886k30729j93000m6432k4617j40071
2239.4H69517207j50204l8445m4465j02341K4677K07901J72138m530k4617Q7261P1883
2261.9H69716465l6418k0862N8830J4126q4519n1021M6074J0550q3983p6473o8903
2284.3H69423866k02894l54707l35515k13861j73867k00987j69396j35482k42292m51923
2304.7H66942942o03199p11918r50217j168489j138270j112223j254439j226604q24929
2323.1H57952654m39286m83334o47068m76897k97725n02169o91116n44429k85506J27435
$$ plain form
2174.2 871038973 870836020 870658040 870656312 870562077 870267987 870084822 870119870 870094895 869944870 869954348 870187819
2196.6 870187819 870379627 870466173 870670795 870993853 871175408 871198118 871302605 871472418 871453941 871298194
2217 871298194 871221721 871126056 870831251 870485485 870295942 870152056 869921327 869728327 869681895 869657278 869517207
2239.4 869517207 869367003 869328558 869284093 869181752 869206429 869414330 869586468 869581938 869557321 869644582 869716465
2261.9 869716465 869680047 869659185 869718015 869732141 869647622 869596601 869642675 869653225 869569242 869492769 869423866
2284.3 869423866 869220972 868866265 868530750 868316889 868143022 867942035 867772639 867637157 867394865 866942942
2304.7 866942942 866339743 865627825 864677608 863509119 862370849 861258626 860004187 858777583 857952654
2323.1 857952654 857513368 857030034 856382966 855906069 855608344 855106175 854415059 853870630 853585124 853712559
2343.5H53712559J097023J626313N67734j171768k110004j772463j062811m82797R6202
2361.8H50499988P29262J182855J354158J496732J608848J385093J009405Q84413Q71420
2380.2H61022174O01411K35439K06649M32491N01931L90470L52919L52979J88410k921
2400.6H64281952P153M8995p5698j68145k3722J32322M3929o5923M8697J26362p1705
2423H64284217k37822j13189K0086r2029j83284m9711m172k10047l10540j51157q2672
2445.4H62869680k41757k96831j67369k22743m95493n82338m78983n70655q38995r13798
2465.8H58060718q24333r19640j108050r52125n18441k49624r7990K52306N92649N57185
2486.2H54792655L89575M89772O29723M55975K56181L55244M48465K45750N6923J46210
$$ plain form
2343.5 853712559 854809582 856435895 857003629 855831861 853721857 851949394 850886583 850403786 850499988
2361.8 850499988 851229250 852412105 853766263 855262995 856871843 858256936 859266341 860150754 861022174
2380.2 861022174 861623585 861859024 862065673 862498164 863000095 863390565 863743484 864096463 864284873 864281952
2400.6 864281952 864289105 864338100 864262402 864094257 864070535 864202857 864246786 864180863 864229560 864355922 864284217
2423 864284217 864046395 863933206 863953292 863861263 863677979 863628268 863624096 863414049 863103509 862952352 862869680
2445.4 862869680 862627923 862331092 862163723 861940980 861445487 860863149 860384166 859813511 858974516 858060718
2465.8 858060718 857236385 856316745 855208695 854256570 853738129 853488505 853390515 853642821 854235470 854792655
2486.2 854792655 855182230 855672002 856301725 856757700 857013881 857369125 857817590 858063340 858120263 858266473
2506.6H58266473K01583m351j44780j5557M0531j30236j64509P1109J86503L8385K0087
2529H58365238J96099J47164j28091j97410r3281k12074m45783m01497k32339l28779
2549.4H56669247m89473l40581j14143j64688k69651j42157j252r2745j96695p4506
2569.8H54783356L5584q3327j64747k504J24038l636j19925l4690k4259k47538l75748
2592.3H53886604k36928j51575k59399k51055l7014M6312j13308j80423j00375k08795
2612.7H52394044m44591m54247k88605k35498k37465n3823K37465L66926L49224L97980
2633.1H52031410M44412K91645P0096N5313J53958N9844j31548j47164r9957k07901
2653.5H52520108l28064k55048j47760k21550l09527k02000q9646j52945j85848n6624
$$ plain form
2506.6 858266473 858468056 858463705 858318925 858303368 858343899 858213663 858049154 858120263 858306766 858345151 858365238
2529 858365238 858561337 858708501 858580410 858383000 858289719 858077645 857631862 857230365 856998026 856669247
2549.4 856669247 856179774 855839193 855725050 855560362 855290711 855148554 855147302 855054557 854857862 854783356
2569.8 854783356 854818940 854735613 854570866 854568362 854692400 854688764 854568839 854534149 854509890 854262352 853886604
2592.3 853886604 853649676 853498101 853238702 852987647 852950633 852996945 852883637 852703214 852602839 852394044
2612.7 852394044 851949453 851495206 851206601 850971103 850733638 850679815 850917280 851284206 851633430 852031410
2633.1 852031410 852475822 852767467 852837563 852892876 853046834 853106678 852975130 852827966 852728009 852520108
2653.5 852520108 852192044 851936996 851789236 851567686 851258159 851056159 850966513 850813568 850627720 850571096
2673.9H50571096n722j66714k83659k10583j97411l31759l34024j71125j72079l86894
2694.3H48311126m84109m20510n25654q18252r63033r53138j123368j493156j689792
2712.6H39840114j484573j001537m72247j77860l81947q85665j080692o58691K3722
2731H33720624M60625P40349J082778J161158P81656L46482J96158J35601r6977l39746
2751.4H38188708l65555l06547l61681l59595r5546J98126K24113J07885O0200l397
2771.8H37286711j74105l41952l62456l38376m31597m85897m06563m64618p91312j069009
2792.2H32420826j118243j215160j537144j849949j950205j998961k014637j749813
2808.5H18986714j423836j449108j694739j839876j976371k451002l189266l879190
$$ plain form
2673.9 850571096 850565374 850398660 850115001 849904418 849707007 849375248 849041224 848870099 848698020 848311126
2694.3 848311126 847827017 847406507 846880853 846062601 845099568 844146430 843023062 841529906 839840114
2712.6 839840114 838355541 837354004 836881757 836703897 836321950 835436285 834355593 833696902 833720624
2731 833720624 834181249 834921598 836004376 837165534 837947190 838293672 838489830 838625431 838528454 838188708
2751.4 838188708 837823153 837516606 837154925 836795330 836699784 836897910 837122023 837229908 837290108 837286711
2771.8 837286711 837112606 836770654 836408198 836069822 835638225 835152328 834745765 834281147 833489835 832420826
2792.2 832420826 831302583 830087423 828550279 826700330 824750125 822751164 820736527 818986714
2808.5 818986714 817562878 816113770 814419031 812579155 810602784 808151782 804962516 801083326
2824.8H01083326m664898n769312p039487q282066r410202r953141r201944p333398
2841.1G39428878n698741n525827o635487q154154r948015j2643695j6967952k3166895
2857.4F50688112l0273855l5145879l2774091k0340979j464247J6373217K7987122
2871.7E75049400L2089830K9656946K3002625J4747798O827534M04894l815889n457878
2888F72505260m706920k391100M17233K722204L857314L782153K874315J443625n02289
2906.4F80001795l005802n809844q585453j1198342j3269067j3952016j2658239r593308
2922.7F01929724n640387j947165M43459Q25941q78393m249514q748054j3275623j5463353
2941E52996635j2702107m982948L889858R477079J0356665P615685L020287j083851
$$ plain form
2824.8 801083326 796418428 790649116 783609629 775327563 765917361 755964220 746762276 739428878
2841.1 739428878 733730137 728204310 721568823 713414669 703466654 690822959 673855007 650688112
2857.4 650688112 620414257 585268378 552494287 532153308 530689061 547062278 575049400
2871.7 575049400 607139230 636796176 659798801 674546599 681374133 681779027 677963138 672505260
2888 672505260 667798340 665407240 665824473 668546677 672403991 676186144 679060459 680504084 680001795
2906.4 680001795 676995993 671186149 662600696 651402354 638133287 624181271 611523032 601929724
2922.7 601929724 596289337 594342172 594785631 595611572 594733179 590483665 581735611 568459988 552996635
2941 552996635 540294528 535311580 539201438 548678517 559035182 566650867 569671154 568587303
2957.4E68587303k161383O69717N830229J0914981J4785230J7725408K0167470K2020638
2973.7F58539593K2866130K2339106K0517885J7976463J5332222J2852788J0556221
2987.9G80980408Q492172O712496N135894L731310K634764J924813J440763R44913
3004.3H11997533M80890K44439J34527j05917m34220p05838j000941j307070j458526
3022.6H07844877j619816k023995k490341k839148l105939l420233l603876l093541
3038.9G85647988k142131j863718k888203m948735p356584r483099j0593951r888649
3055.3G36482918p349550l864289o06835J574278K856076M083931N697489P313073
3071.6G46187091Q062065P444918N715251L471315J334548j87636o22690M75884K755463
$$ plain form
2957.4 568587303 566425920 567095637 572925866 583840847 598626077 616351485 636518955 658539593
2973.7 658539593 681405723 703744829 724262714 742239177 757571399 770424187 780980408
2987.9 780980408 789472580 796185076 801320970 805052280 807687044 809611857 811052620 811997533
3004.3 811997533 812478423 812722862 812857389 812751472 812317252 811611414 810610473 809303403 807844877
3022.6 807844877 806225061 804201066 801710725 798871577 795765638 792345405 788741529 785647988
3038.9 785647988 783505857 781642139 778753936 773805201 766448617 756965518 746371567 736482918
3055.3 736482918 729133368 725269079 724662244 726236522 729092598 733176529 738874018 746187091
3071.6 746187091 754249156 761694074 767409325 770880640 772215188 772027552 771404862 771880746 774636209
3089.9G74636209M833937N662203N383491M566312L578901K706528K129078J837313
3106.2H05333972J773536J931071K151728K127826J817763J450539J107395P55190
3122.6H18449020M81964L56137L00288J49131p0989j22070j9193p1883l76880o00696
3143H18474829n89907o24359p54773q12829q74698q69572n48780j08481N2989o8188
3163.4H13276231k31325l32654m61578p09534r80019j109005j067280r41694p97153
3181.7H06645989o63459o36399p26759q30770r25302j019955j006663q14557n86867
3200.1G99435258m91738m83990m49300m80831o87539r27389j017272j011849j068055
3218.4G92817295j109958j013041q84056p90298o66439n65708o01113p83324r88603
$$ plain form
3089.9 774636209 779470146 785132349 790515840 795082152 798661053 801367581 803496659 805333972
3106.2 805333972 807107508 809038579 811190307 813318133 815135896 816586435 817693830 818449020
3122.6 818449020 818930984 819287121 819587409 819736540 819665551 819543481 819524288 819452405 819075525 818474829
3143 818474829 817884922 817260563 816505790 815692961 814818263 813948691 813399911 813291430 813344419 813276231
3163.4 813276231 813044906 812712252 812250674 811541140 810561121 809452116 808384836 807443142 806645989
3181.7 806645989 805982530 805346131 804619372 803788602 802863300 801843345 800836682 800022125 799435258
3200.1 799435258 798943520 798459530 798010230 797529399 796841860 795914471 794897199 793885350 792817295
3218.4 792817295 791707337 790694296 789810240 789019942 788353503 787787795 787186682 786403358 785414755
3236.8G85414755j096069j151324j207411j150906q92520n93543m33803m07040m28617
3255.1G78053522m86314o07252p18773p49647p38442p13706o94216q04722r86278j038372
3275.5G70515800j011670j004398j006126j027525j092851j144409j089931j045882
3291.8G62093008j155436j363099j581371j659572j487494j261413j374721j850724
3308.2G50359178k238214k282262k155841k117455k171337k216399k205729k208055
3324.5G32763886k427578k696871k727092k689361k653361k546250k672553k998352
3340.8G11352468l134668l179193l148734k973736l094196l536344l690004l470838
3357.1F85124755l302455l389835l497780l326833l137112l333091l741622l789664
$$ plain form
3236.8 785414755 784318686 783167362 781959951 780809045 779916525 779322982 778889179 778482139 778053522
3255.1 778053522 777567208 776959956 776241183 775491536 774753094 774039388 773345172 772540450 771554172 770515800
3275.5 770515800 769504130 768499732 767493606 766466081 765373230 764228821 763138890 762093008
3291.8 762093008 760937572 759574473 757993102 756333530 754846036 753584623 752209902 750359178
3308.2 750359178 748120964 745838702 743682861 741565406 739394069 737177670 734971941 732763886
3324.5 732763886 730336308 727639437 724912345 722222984 719569623 717023373 714350820 711352468
3340.8 711352468 708217800 705038607 701889873 698916137 695821941 692285597 688595593 685124755
3357.1 685124755 681822300 678432465 674934685 671607852 668470740 665137649 661396027 657606363
3373.4F57606363l363967l006935k943277k949774k847672k592981k209186j819969
3389.7F35872602j861691k322733k399683j823962j408816j800477k297401k086759
3406.1F19871080j617313j448690j490117j574397j580417j422465j226902j042723
3422.4F08468056q11756n71549l74794l37005k39551J2517o4790l72589l06725N7995
3442.8F05459809L23236M96567O70850P96378Q71479R56297J088738J175106J084685
3461.1F12923145J139880J548111J755714J361788Q44419Q69870J275360J603485J567661
3479.5F24889433J252830J262188J544893J570523J482248J511336J553535J616299
3495.8F36683285J608670J518905J528561J547396J471818J470327J701176K003849
$$ plain form
3373.4 657606363 654242396 651235461 648292184 645342410 642494738 639901757 637692571 635872602
3389.7 635872602 634010911 631688178 629288495 627464533 626055717 624255240 621957839 619871080
3406.1 619871080 618253767 616805077 615314960 613740563 612160146 610737681 609510779 608468056
3422.4 608468056 607656300 607084751 606709957 606372952 606133401 606145918 606081128 605708539 605401814 605459809
3442.8 605459809 605783045 606279612 606950462 607746840 608618319 609574616 610663354 611838460 612923145
3461.1 612923145 614063025 615611136 617366850 618728638 619573057 620442927 621718287 623321772 624889433
3479.5 624889433 626142263 627404451 628949344 630519867 632002115 633513451 635066986 636683285
3495.8 636683285 638291955 639810860 641339421 642886817 644358635 645828962 647530138 649533987
3512.1F49533987J979470J725912J658619J767158J890540J825750J660943J834453
3528.4F63876832K245366K429187K406836K332449K216220K190590K190947K154112
3544.7F82042539K205074K290785K316296K448917K614558K572000K487719K417802
3561.1G01395690J981497J525283K348781L707111L616988K884031K683282K846181
3577.4G22988844L041029L090382K678513K038062K295792L378749L401577K805889
3593.7G45718837K890885L232717L231526L166556K839208K148389K046645K512634
3610G67787397K655446K728045K520681K249062K941132L295958K256631P83086P26104
3628.4G87943542K759755L396094K656400K128541J688719J345277J006186J67608
$$ plain form
3512.1 649533987 651513457 653239369 654897988 656665146 658555686 660381436 662042379 663876832
3528.4 663876832 666122198 668551385 670958221 673290670 675506890 677697480 679888427 682042539
3544.7 682042539 684247613 686538398 688854694 691303611 693918169 696490169 698977888 701395690
3561.1 701395690 703377187 704902470 707251251 710958362 714575350 717459381 720142663 722988844
3577.4 722988844 726029873 729120255 731798768 733836830 736132622 739511371 742912948 745718837
3593.7 745718837 748609722 751842439 755073965 758240521 761079729 763228118 765274763 767787397
3610 767787397 770442843 773170888 775691569 777940631 780881763 784177721 786434352 787217438 787943542
3628.4 787943542 790703297 794099391 796755791 798884332 800573051 801918328 802924514 803092122
3644.7H03092122r23097l31879K257049K840102J614392J396060J845002J389802O67154
3663H13846707J17243p44701j193702k85268j13427k54035J443386K311766J803577
3681.4H16931546J097023J32740o44505j44303J346707J872957J267254L71337k94923
3699.8H21935833j48953N72145L50416p42435j239121J132J469314J099587o974o12438
3720.1H22678506n63800j83701K99274M11630m20570j445592j074195Q02875J756430
3738.5H22260857N26964j362920j380324J51813k25067m88698J230537J701355O66559
3756.9H23081076K27153O58274N18441j05321l09050j26481M55022P42793J89185m65632
3777.3H24865460m42028O9380J46687R1672L15845L23236l0160n76913r02295q50737
$$ plain form
3644.7 803092122 802169025 801837146 804094195 806934297 808548689 809944749 811789751 813179553 813846707
3663 813846707 813963950 813219249 812025547 811740279 811626852 811372817 812816203 815127969 816931546
3681.4 816931546 818028569 818161309 817516804 817372501 818719208 820592165 821859419 822230756 821935833
3699.8 821935833 821786880 822359025 822709441 821967006 820727885 820729017 822198331 823297918 823290944 822678506
3720.1 822678506 822114706 821931005 822230279 822641909 822221339 820775747 819701552 820504427 822260857
3738.5 822260857 822787821 821424901 820044577 820196390 819971323 819482625 820713162 822414517 823081076
3756.9 823081076 823308229 823966503 824484944 824379623 824070573 823944092 824399114 825141907 825331092 824865460
3777.3 824865460 824423432 824492812 824639499 824731171 825047016 825370252 825340092 824763179 823860884 823010147
3797.7H23010147j023353n56647N49912M12762M11332Q39055J57415j124858j531780
3816H21143985r67980p33614K02477R99034M12285j25170m65691p19607p24315q35419
3836.4H18185985n27263M32730J022756J124740O99878m49777k015829k431274M34995
3854.8H16476941K246857J138747k94030r21190m36664j03414m54068j11162N69283
3873.1H18111300P47681L02434o04749n70535o9619O0916M18306J16825k61486K92898
3893.5H18543971K50756p28607j238644p59661J46627J001597J155615O09815M5359
3911.9H19026828l55780n75126l11911J03593K3186j95980l2842l338k82228j58488
3932.3H17237914L05295L49879l9280m35114m42862n1320P5877l8028P3910J40071
$$ plain form
3797.7 823010147 821986794 821430147 821980059 822392821 822804153 823643208 823800623 822675765 821143985
3816 821143985 820176005 819442391 819644868 820643902 821056187 820931017 820465326 819745719 819021404 818185985
3836.4 818185985 817658722 818091452 819114208 820238948 820938826 820489049 818473220 816041946 816476941
3854.8 816476941 818723798 819862545 819568515 818647325 818210661 818107247 817653179 817542017 818111300
3873.1 818111300 818858981 819161415 818556666 817986131 817916512 817977428 818395734 818512559 818251073 818543971
3893.5 818543971 818794727 818066120 816827476 816067815 816214442 817216039 818371654 818981469 819026828
3911.9 819026828 818671048 818095922 817784011 817887604 817910790 817714810 817681968 817678630 817396402 817237914
3932.3 817237914 817543209 817893088 817853808 817418694 816975832 816924512 817000389 816962361 817036271 817176342
3952.7H17176342R716o6579q7559j06692q285P5578j3709r9182q0347m3571K1458N3644
3977.1H16830814k1100k8074K2590n0843j60515j77562j30713p1526k4080k5034
3997.5H16163957
$$ plain form
3952.7 817176342 817186058 817119479 817031920 816925228 816916943 816992521 816978812 816879630 816799283 816755712 816777170 816830814
3977.1 816830814 816809714 816781640 816804230 816753387 816592872 816415310 816284597 816213071 816188991 816163957
3997.5 816163957
##END=$$ End of the data block
