##TITLE=Fenol dimetil $$ Begin of the data block
##JCAMP-DX=5.00 $$ ACD/SpecManager v 10.08
##SPECTROMETER/DATA SYSTEM=Alpha
##DATE=26 May 2014 07:49:52
##DATA TYPE=INFRARED SPECTRUM
##DATA CLASS=XYDATA
##ORIGIN=
##OWNER=
##NPOINTS=1765
##FIRSTX=399.75695801
##LASTX=3997.56933594
##MAXX=3997.56933594
##MINX=399.75695801
##MAXY=0.81872696
##MINY=0.01799196
##XFACTOR=1.0000000000
##YFACTOR=1.000000000000000e-9
##FIRSTY=0.70417005
##DELTAX=2.03957629
##XUNITS=1/CM
##YUNITS=ARBITRARY UNITS
##XYDATA=(X++(Y..Y))
399.8G04170048q177936K522707J0549665J0469615M168153k941728o123721l188491
416.1G11448312L446221O799519L142715r65655l825724n922675o939710m742026N99504
434.4G03040481M620730M653812K118587j532673l920198k308011J446962K809167
450.7G10928857Q2195l286183l013611J743496N915165M716992J64032l373146l942609
469.1G09935188k756774j960337k982855n625904p933378q979320j0811806j4901102
485.4F53983712j6958833j2852132q778214j0980308j0069430Q57115P929265M46379
501.7F03577554j0558605q338749Q213818K4319052K6929617J8501997Q514941K186954
518.1F73346579q4877O32346K011597J329839r66191j874983j246155j170575l390611
$$ plain form
399.8 704170048 695992112 698514819 709064484 719534099 723702252 720760524 714636803 711448312
416.1 711448312 714894533 721694052 724836767 723871112 720045388 714122713 707183003 702440977 703040481
434.4 703040481 707661211 712315023 714433610 712900937 708980739 706672728 708119690 710928857
450.7 710928857 711011052 707724869 704711258 706454754 712369919 717086911 717250943 713877797 709935188
469.1 709935188 707178414 705218077 702235222 696609318 688675940 679696620 668884814 653983712
485.4 653983712 637024879 624172747 615394533 604414225 594344795 595201910 603131175 603577554
501.7 603577554 593018949 584680200 592894018 617213070 644142687 662644684 671159625 673346579
518.1 673346579 673261702 673894048 675905645 677235484 676269293 674394310 673148155 671977580 668586969
536.4F68586969r255528j9258440k7071178j8068850P893086K6515305K4559557J3960839
552.7F67861760O422698L602743L194690K799392J418710j22250o67512j26183M19140
571.1F84803188j59919q51632N97120L513813N009591M144788J413584k877176q181274
589.4F87412083j1905908r318412q00788N707145L468871m937709q378327n998253
605.8F55248702j0650158k3485244m0182292o1835289p7887744q2872420q2670361
620B75665194o5411136k1228298L6982819Q8898972J07324838Q5809529N4192722L7839890
636.3F00074530L1294405K1928191J4376164J3156950J1694134P339715K299011L92556
652.7G02555656L413439O669641N352497q66652j0012328j6506911j7861127j0487020
$$ plain form
536.4 668586969 659331441 640073001 613001823 594932973 602826059 629341364 653900921 667861760
552.7 667861760 674284458 677887201 681081891 683881283 685299993 685177743 684510231 684384048 684803188
571.1 684803188 684643269 683791637 684388757 687902570 692912161 697056949 698470533 695593357 687412083
589.4 687412083 675506175 666187763 665386975 671094120 674562991 669625282 661246955 655248702
605.8 655248702 644598544 621113300 580931008 519095719 441207975 358335555 275665194
620 275665194 210254058 189025760 226008579 314907551 422232389 508041918 562234640 600074530
636.3 600074530 631368935 653297126 667673290 680830240 692524374 699864089 702163100 702555656
652.7 702555656 705969095 712638736 717991233 717124581 707112253 690605342 672744215 662257195
669F62257195k358556n830646j1723995j3240933j2483478j4570057k1759570l5076916
685.3E45213044n4151148o8382323o8453401o4265549o1529771n0856813j9053162
699.6A58520877L6647573Q2961247R6153706R8549605J02070123Q8380694N5880606
713.8G19164431K5946796R433329L033400J038313o81937l822386r754837k1746159
730.2G22610950m2395472o2124491m6329260J6758144O2855780M6941817Q123338j9993603
746.5F86447203m5732021q0467940j13467782j13395125p0605338k3901522j9055962
760.8B19821513l9862097k4626270K3744360O4388767J00452438J17782414R5792144
775E57493269O1349690L9261699L0141115K8402746K9412925K7614117J9946992J0937512
$$ plain form
669 662257195 659898639 654067993 642343998 629103065 616619587 602049530 580289960 545213044
685.3 545213044 491061896 422679573 354226172 289960623 228430852 177574039 158520877
699.6 158520877 195168450 278129697 374283403 472833008 574903131 663283825 719164431
713.8 719164431 745111227 754544556 757577956 758616269 757934332 754111946 744357109 722610950
730.2 722610950 680215478 618090987 571761727 588519871 651375651 698317468 706440806 686447203
746.5 686447203 640715182 560247242 446779460 333384335 262778997 238877475 219821513
760.8 219821513 179959416 155333146 179077506 243466273 343918711 461701125 557493269
775 557493269 618842959 658104658 688245773 716648519 746061444 773675561 793622553 804560065
791.4H04560065M730404J169383m23133k40028O17981J091301N47827o19233j411498
809.7H10023069j262724p15613o45876j230657k353967l943145o705344j1807859j6533911
828.1G64823973j0929644M356325J1520087N349398j560748k946436k072334j878977
844.4G66661644k771974m030466k844572K463222O185949L577709j680494m784286
860.7G62776732n566477o162882q043349j1270046j4652431j7781198k1887005k9754579
877F47658765m5604765p1133494q6757154o1984479m325539L9496154M0350467K2291719
893.3D79991674J9222796L3345044N0126910N3148568M0424108K4276734J2332678
907.6G12868512N683958K750993P24018k695799q270026j6350805k4248481k5801063
$$ plain form
791.4 804560065 809290469 810459852 810036719 809796691 810414672 811505973 812053800 811434567 810023069
809.7 810023069 808760345 808044732 807398856 806168199 803814232 799871087 793165743 781357884 764823973
828.1 764823973 753894329 758250654 769770741 775120139 773559391 770612955 768540621 766661644
844.4 766661644 763889670 759859204 757014632 759477854 765663803 769241512 767561018 762776732
860.7 762776732 757210255 751047373 743004024 731733978 717081547 699300349 677413344 647658765
877 647658765 602054000 530920506 444163352 382178873 377853334 417349488 457699955 479991674
893.3 479991674 499214470 532559514 582686424 635834992 676259100 700535834 712868512
907.6 712868512 718552470 721303463 722027481 719331682 711061656 694710851 670462370 644661307
923.9F44661307k4045050k6723385k1417617O844401L6283076L7767231J9369662J125693
940.2F73865318j1769294j8609643j8629313j1260092K771973J6970933K3568094K1453559
956.6F78361535J4561296P083237J172900l920436q304477j1130869j2822092j3491213
972.9F51509881j0455132j885652M186273q22008j1372089j9053400k1894693k0546198
989.2E69666982j6552449j1234760r246409j1360824p003784P594287J9613564J7186582
1005.5E58663189K626539j4126003k8155983l6403417l1377673k1468044k5130719
1019.8D04627889l3906519l0564606j9203276p496357M901141J6107381K0384162J4175028
1036.1C69024843m90278j6713053k9057682l5460293l4851551l0604482k7924850k6509270
$$ plain form
923.9 644661307 620616257 593892872 572475255 579319656 615602732 653369963 672739625 673865318
940.2 673865318 662096024 643486381 624857068 613596976 616368949 633339882 656907976 678361535
956.6 678361535 692922831 700006068 701178968 697258532 688954055 677823186 665001094 651509881
972.9 651509881 641054749 639169097 643355370 642533362 631161273 612107873 590213180 569666982
989.2 569666982 553114533 541879773 532633364 521272540 514268756 521863043 541476607 558663189
1005.5 558663189 561289728 547163725 519007742 482604325 451226652 429758608 404627889
1019.8 404627889 370721370 340156764 320953488 313457131 318358272 334465653 354849815 369024843
1036.1 369024843 368534565 351821512 322763830 287303537 252451986 221847504 193922654 167413384
1052.4A67413384k4456695k2190601j8961444j3484500o779097q47921L325537N047842
1068.7H9066505L989026Q31940l243968o115206n982764l916405k951227m477747p077221
1087.1F0122933q657578q794975q153136o768335m439537j788502j57809j65457j150809
1105.4B0046795j601095m53736K297669O395961J0659964J2476664J3457511K3245119
1121.8H6524852M4143147O2173143O7526818O4442068N8565617N2049547M5638293
1136D81063485L9294422L2682359K5729835J9319654J5999078J6946853J7224073J1300921
1152.4F59560680q50200j7378569l2678962k8651058J616716K7485967K6016354J2288869
1168.7F47409797J147270p824361j7895639l1017959m4859291n0498217m0411293k0866543
$$ plain form
1052.4 167413384 142956689 120766088 101804644 88320144 81541047 80693126 84018663 89066505
1068.7 89066505 93055531 93887471 90643503 84528297 78545533 74629128 71677901 67200154 60122933
1087.1 60122933 51465355 42670380 34517244 27748909 23309372 21520870 21363061 21197604 20046795
1105.4 20046795 18445700 17991964 20289633 26685594 37345558 49822222 63279733 86524852
1121.8 86524852 130667999 192841142 260367960 324810028 383375645 435425192 481063485
1136 481063485 520357907 553040266 578770101 598089755 614088833 631035686 648259759 659560680
1152.4 659560680 658710480 641331911 608652949 580001891 581618607 609104574 635120928 647409797
1168.7 647409797 648557067 640732706 622837067 591819108 546959817 496461600 456050307 435183764
1185D35183764n016864J659036J152634l976941j3333559k5687217l6588192m1584880
1201.3C11807781l8874298k9338032j5305117J139894J8247903L3528447M3595195
1215.6C24801773M6225488M1987181L3358395K1956235P489711j0325730k9573768
1229.9D35919285m5840800n3050488m5414031k3471594J604051J6096174J6575397
1244.1C02417994J1545687J2787283K6930869N1242351P2366953P6253265O2712491
1258.4F16256893M2546868K4127305R652972j162231p820904p757485j45615R207011
1274.7F84904814J3038873J1336267R091199Q650303Q757949Q063376O079614K927184
1291G52849579n90980l953397p587314j2294650j8380463k4781704k8205455k5671899
$$ plain form
1185 435183764 430166900 431825936 432978570 429001629 415668070 389980853 353392661 311807781
1201.3 311807781 272933483 243595451 228290334 229430228 247678131 281206578 324801773
1215.6 324801773 371027261 413014442 446372837 468329072 475818783 465493053 435919285
1229.9 435919285 390078485 337027997 291613966 268142372 269746423 285842597 302417994
1244.1 302417994 313963681 326750964 353681833 404924184 477291137 553544402 616256893
1258.4 616256893 658803761 682931066 692584038 691421807 683600903 675843418 675697803 684904814
1274.7 684904814 697943687 709279954 718371153 727021456 735779405 743842781 749922395 752849579
1291 752849579 752258599 748305202 740717888 728423238 710042775 685261071 657055616 631383717
1307.4F31383717j8037379q715749o34789N736113J1226058J2541413N852401n155921
1323.7F34195864j4313698j7690718j4419317p371962l02315N509734J0983408J6547203
1340F13138199K0753085K2604645K1457135J6209662Q160174j107454j1591494k2155821
1356.3F67468131k7016581j9446969J530290K4543941L4014106K8710663J3814271
1370.6G23617852o25253q733332r779632p278502r234846j2746692p676124J255095
1386.9F68798566L541350K36154m665554r918511j2547373j4354527j8919349k7362406
1403.2E84808350l9693058m7547102m5549065l4261971j1887432J5046507L1547726
1417.5D52463955K8010785J4703870R401590Q036077P379055R285688R970248P162750
$$ plain form
1307.4 631383717 613346338 604630589 603995800 609731913 620957971 633499384 639351785 634195864
1323.7 634195864 619882166 602191448 587772131 580400169 580097854 585607588 596590996 613138199
1340 613138199 633891284 656495929 677953064 694162726 702322900 701215446 689623952 667468131
1356.3 667468131 640451550 621004581 622534871 647078812 681092918 709803581 723617852
1370.6 723617852 722992599 714259267 704479635 697201133 687966287 675219595 667543471 668798566
1386.9 668798566 672339916 672576070 667910516 657992005 645444632 631090105 612170756 584808350
1403.2 584808350 545115292 497568190 452019125 417757154 405869722 420916229 452463955
1417.5 452463955 480474740 495178610 504580200 512616277 519995332 529281020 539251268 546414018
1433.8E46414018L917873j446724j2474716k9418767m3240130l0446648J1863291L7377030
1450.1D82545227K0993858q427083l7954331m0767669l778696J5896856J2299032L525406
1466.4D44332600M004210Q860022P969916p328242k8919131m6936899o1481983o8213075
1482.8B52287418n9066549l8775534j0435775J6544238K5353685L0614138N0251990
1497B66773611O9767565O9990605N9895635N6839853N7850421L4043848J4346659P495940
1513.4F37004137K907455p99298m292488q464814j1202275j2413919j4322937j5758216
1529.7E72657645k0769477l0246437l1501233l0198962l7639022l3792227k3655802
1543.9C64854485k5472433l3529430m3655545m2883858k4140611O707847N0537825
$$ plain form
1433.8 546414018 550331891 548885167 536410451 506991684 463751554 433304906 445168197 482545227
1450.1 482545227 503539085 495112002 457157671 416390002 412611306 428508162 440807194 444332600
1466.4 444332600 448336810 457196832 465166748 457838506 428919375 381982476 320500493 252287418
1482.8 252287418 193220869 154445335 144009560 160553798 185907483 216521621 266773611
1497 266773611 336541176 406531781 466427416 523267269 581117690 615161538 629508197 637004137
1513.4 637004137 639911592 639112294 634819806 626354992 615152717 602738798 588415861 572657645
1529.7 572657645 551888168 521641731 490140498 459941536 422302514 388510287 364854485
1543.9 364854485 339382052 305852622 262197077 219313219 195172608 201880455 252418280
1558.2B52418280P6619357N4338365N3262443O0167372N4610044L7273585O687880
1572.5E95377326k9040575n2821815j8028587L0061692M4146120K8764069m83155l0569017
1588.8E67406058n4020881o9646836p2892576n4516971j9333124J4469474L2557070
1603.1C44022214K6762039N05090l1414926n3209842n9154927o3641578o5861024m4403829
1619.4E3603217k1268830l420718K1395665N6402575R1337994J01707280R8546654
1633.7C98303837R6434146O6116631L3098697K2307575K1306694K6244879K6498258
1648F90310717J5910148J1052430J1700511P173061M229069M280448O496668Q539080
1664.3G59692132P651151O420374N447208M189730M702926N706310M108429J980722
$$ plain form
1558.2 252418280 329037637 383376002 436638445 496805817 551415861 588689446 595377326
1572.5 595377326 566336751 513514936 495486349 525548041 569694161 598458230 597975075 567406058
1588.8 567406058 513385177 443738341 370845765 316328794 296995670 311465144 344022214
1603.1 344022214 370784253 371289343 339874417 286664575 227509648 163868070 98007046 53603217
1619.4 53603217 32334387 28913669 50309334 106711909 198049903 299757183 398303837
1633.7 398303837 494737983 560854614 593953311 616260886 637567580 663812459 690310717
1648 690310717 706220865 717273295 728973806 736146867 740375936 744656384 751153052 759692132
1664.3 759692132 767343283 773763657 779210865 783400595 788103521 793809831 797918260 799898982
1680.6G99898982M99785L3855N66364R04321R95160R18984J073837J498759J935422
1699H08325469K346695J953304J180112Q19028O99937P73132P25388M31419K09093
1717.3H17463577J55926O4551p2062J06633K47419J52588j25706k84791P1168L75211
1737.7H18154514L63767K08676m3750m13895p79509j313389j819670k239942k980173
1756.1H09136629l567994l710269m085720m100025l968179m092216m155636m569829
1772.4G76886761l817081j774967J43230J732707K720475L392756M087627M259527
1788.7G87631035L866255L065765J781821O40750k8729k30909j73330l18587r25421
1807G95308650j887322k540767k002001p72476k08795n97477r52721j08659K140045
$$ plain form
1680.6 799898982 800398767 800432622 800998986 801903307 802898467 803817451 804891288 806390047 808325469
1699 808325469 810672164 812625468 813805580 814624608 815324545 816097677 816823065 817254484 817463577
1717.3 817463577 817619503 817684054 817611992 817718625 817966044 818118632 817992926 817708135 817779303 818154514
1737.7 818154514 818518281 818726957 818683207 818269312 817489803 816176414 814356744 812116802 809136629
1756.1 809136629 805568635 801858366 797772646 793672621 789704442 785612226 781456590 776886761
1772.4 776886761 773069680 771294713 771437943 773170650 775891125 779283881 783371508 787631035
1788.7 787631035 791497290 794563055 796344876 796985626 796956897 796725988 796552658 796234071 795308650
1807 795308650 793421328 790880561 788878560 788106084 787897289 787299812 786347091 786238432 788378477
1825.4G88378477M060268M488707L723025K374769J310944O78420L15070n3107m40538
1843.8H04836035n22912m16100m00901l57628l12685k61009o8903K91586P08639R90928
1864.2H04487050R84132P46548M04656q5950o22213j017272j246691j495242j954794
1882.5H00200224k702534l721953m923522n386591m208028k445400j248718r24050
1898.8G74639428j278818j709223j244485L63946J804828J945913J445473J196086
1915.1G77163148J057386P72775N56290O29306P41124Q09312J249671J975715K197087
1933.5G87151814J554965O04153j39356n77151p06196q50320j453876k358139l141046
1951.9G80084848l625512l613293l037631k535046k817571l536820l533304k175629
$$ plain form
1825.4 788378477 792438745 796927452 800650477 803025246 804336190 805014610 805329680 805276573 804836035
1843.8 804836035 804313123 803897023 803496122 803138494 802825809 802564800 802495897 802787483 803496122 804487050
1864.2 804487050 805471182 806217730 806622386 806536436 805914223 804896951 803650260 802155018 800200224
1882.5 800200224 797497690 793775737 788852215 783465624 779257596 776812196 775563478 774639428
1898.8 774639428 773360610 771651387 770406902 770770848 772575676 774521589 775967062 777163148
1915.1 777163148 778220534 778993309 779549599 780178905 780920029 781729341 782979012 784954727 787151814
1933.5 787151814 788706779 789310932 789171576 788594425 787888229 787037909 785584033 783225894 780084848
1951.9 780084848 776459336 772846043 769808412 767273366 764455795 760918975 757385671 755210042
1968.2G55210042p26163n77271q37446l70085K50042M06086L47257K81214L57867O03318
1988.6G54944861Q10206R19998R28521R82642J392543J874626J762688J132727N04195
2006.9G65253007L3319l72290o98447q47161p81358n57184k86519k8849J30594O3896
2027.3G61909008k11775m50552l33309L86715J483023K242685K298235J936734J689196
2045.7G70949960J842618K151012K134264J739204J250922Q43644N39184L21090J58847
2064G81930745K3722k6583J1444P5280J36495J73926J58489J06573Q5354J02282P5757
2086.5G82853484k2232r9421j02878l6120M4406M9769n7518k62678m94599o55174o79076
2108.9G80537963n89252m88519m91560o16610p57038p58052n89490l96371l00586l33667
$$ plain form
1968.2 755210042 754483879 753906608 753069162 752699077 752949119 753355205 753702462 753983676 754341543 754944861
1988.6 754944861 755755067 756675065 757603586 758586228 759978771 761853397 763616085 764748812 765253007
2006.9 765253007 765286326 764914036 764215589 763368428 762587070 762029886 761743367 761714518 761845112 761909008
2027.3 761909008 761697233 761246681 760913372 761300087 762783110 765025795 767324030 769260764 770949960
2045.7 770949960 772792578 774943590 777077854 778817058 780067980 780911624 781450808 781771898 781930745
2064 781930745 781954467 781927884 781939328 782014608 782151103 782325029 782483518 782590091 782675445 782777727 782853484
2086.5 782853484 782831252 782731831 782628953 782592833 782637239 782687008 782629490 782366812 781872213 781217039 780537963
2108.9 780537963 779948711 779460192 778968632 778352022 777594984 776836932 776247442 775851071 775550485 775216818
2129.3G75216818m56870n36978m82023l96073m04060m78029n16772m48942k97308j94252
2149.7G71005511k77400n01990p07269p45475n60761k81095q7023o0499j51217k23636
2170.1G67409146j82152r0718o5863j86384m35829p04944q95143r31919q31127o59704
2190.5G62425363l83854N2452N05567P37965O43194K68638j74821m45544m91083m01199
2210.9G62736678l23772m20749o41048p72715o53327k44379K41876M84586M09901J76310
2231.3G60993361p4327k22444j90139q1658n3287l0994Q9466J93656J22070j24395
2251.7G60621309l84271n26130n08785l82006k37167j32680m9472P5102K46048L63350
2272.1G59085298L02314R1374j46806l68237n52595p03454q84950j038015r78649n87463
$$ plain form
2129.3 775216818 774759948 774222970 773740947 773344874 772940814 772462785 771946013 771497071 771199763 771005511
2149.7 771005511 770728111 770226121 769518852 768773377 768212616 767931521 767844498 767783999 767632782 767409146
2170.1 767409146 767226994 767136276 767070413 766884029 766448200 765743256 764848113 763916194 763085067 762425363
2190.5 762425363 762041509 762093961 762599528 763337493 763980687 764249325 764074504 763628960 763137877 762736678
2210.9 762736678 762412906 761992157 761351109 760578394 759925067 759680688 759922564 760407150 760817051 760993361
2231.3 760993361 760919034 760696590 760506451 760424793 760371506 760340512 760429978 760623634 760745704 760621309
2251.7 760621309 760237038 759710908 759202123 758820117 758582950 758450270 758400798 758475900 758721948 759085298
2272.1 759085298 759387612 759478986 759332180 758963943 758411348 757707894 756822944 755784929 754806280 754218817
2292.5G54218817j0491M05193M78208K98857O3658j46329l41237n28097p57039j098096
2312.9G52583444j520455j950323k332986k453267k067268j159728j32918M79519N65350
2331.2G42011368L34561L5584j37865l23058o50525p58886k70844L46482L56853P8142
2351.6G41021812J08421L40760L27944Q2553k25127m63605n68390n77211n76973p27058
2372G38743126j070439j339257j287878r17792l51727K56121P63655J063287J115024
2390.4G36974120R87768P66754N28276L10421J07646l3736q7678r2387j28806k22683
2410.8G39109695k53916j33574O2823J87994J61111J5020j79648l58463m10616l31342
2431.2G37869084k87712l93569o05166q22902r70662j027405j086950j233935j422823
$$ plain form
2292.5 754218817 754208326 754613519 755091727 755390584 755454242 755307913 754966676 754438579 753681540 752583444
2312.9 752583444 751062989 749112666 746779680 744326413 742259145 741099417 740966499 741446018 742011368
2331.2 742011368 742345929 742381513 742243648 741920590 741270065 740511179 740240335 740586817 740943670 741021812
2351.6 741021812 741130233 741470993 741798937 741881490 741656363 741192758 740624368 740047157 739470184 738743126
2372 738743126 737672687 736333430 735045552 734127760 733776033 734032154 734795809 735859096 736974120
2390.4 736974120 737961888 738728642 739256918 739567339 739674985 739641249 739553571 739461184 739332378 739109695
2410.8 739109695 738855779 738722205 738785028 738973022 739134133 739149153 738969505 738611042 738200426 737869084
2431.2 737869084 737581372 737187803 736582637 735759735 734789073 733761668 732674718 731440783 730017960
2449.5G30017960j552701j573682j564324j663327j925230k281368k599358k765596
2465.8G14092374k727509k479136k017677j345932n45859K20060Q19623J205445J381874
2484.2G08603263J411319J377105J330078J284778J213312J095951R46999P85470O28411
2502.5G18676686N15938M47810L78787L15726K47002J35064k7180j56283j46687j6093
2522.9G20370770J41501K27570K18869J65522J05858O1333J9789q1063k28524l58701
2543.3G20642924m37438m53055m18544l49998k85626k76565l11435l00407k26915j68264
2563.7G17414677j90914k92539l80695l54648k09629r1851j30236k82705m54783o31154
2584.1G14395523q16584j006782j203477j329541j258552r18150l60310J65045L88026
$$ plain form
2449.5 730017960 728465259 726891577 725327253 723663926 721738696 719457328 716857970 714092374
2465.8 714092374 711364865 708885729 706868052 705522120 704976261 705196321 706015944 707221389 708603263
2484.2 708603263 710014582 711391687 712721765 714006543 715219855 716315806 717262805 718048275 718676686
2502.5 718676686 719192624 719640434 720019221 720334947 720581949 720717013 720689833 720533550 720386863 720370770
2522.9 720370770 720512271 720739841 720958710 721124232 721230090 721291423 721311212 721230149 721001625 720642924
2543.3 720642924 720205486 719752431 719333887 718983889 718698263 718421698 718110263 717809856 717582941 717414677
2563.7 717414677 717223763 716931224 716550529 716195881 715986252 715894401 715764165 715481460 715026677 714395523
2584.1 714395523 713578939 712572157 711368680 710039139 708780587 707862437 707502127 707667172 708055198
2602.5G08055198K95758M9353k06411l92258m54187l56794j58012N37J1921p3433j34170
2624.9G06637502j07050o2168j62899m06862n93483n90444m50909l06010k23696j63496
2645.3G03570485p5459L8504J40906J79708J23441K2292k4796Q464O2228L8087j02937
2667.7G03980923k66195l02612j91808l2783J03057J58608J15275L8981Q941K6167
2688.1G03638554J7821p7009k12788k79010k27928r3281J371o0082k28941l72708m34756
2710.6G01671243m60089m93407n83708p95364j110316j389503j445771j327335j370907
2728.9F92694843j668275j681625r59576n0008L33309L15249K17617J29998J22487
2747.3F89454019K46108M39167M85420K71022l7849k40624l07858l16679l26276l53277
$$ plain form
2602.5 708055198 708350956 708400309 708193898 707801640 707347453 706990659 706832647 706833184 706845105 706771672 706637502
2624.9 706637502 706530452 706468284 706305385 705898523 705305040 704714596 704263687 703957677 703733981 703570485
2645.3 703570485 703495026 703533530 703674436 703854144 703977585 703999877 703975081 703983545 704045773 704083860 703980923
2667.7 703980923 703714728 703412116 703220308 703187525 703290582 703449190 703564465 703603446 703612387 703638554
2688.1 703638554 703656375 703579366 703366578 703087568 702859640 702766359 702767730 702707648 702478707 702105999 701671243
2710.6 701671243 701211154 700717747 700134039 699338675 698228359 696838856 695393085 694065750 692694843
2728.9 692694843 691026568 689344943 688385367 688335359 688668668 688983917 689201534 689331532 689454019
2747.3 689454019 689700127 690139294 690624714 690895736 690857887 690617263 690309405 689992726 689666450 689313173
2767.7F89313173l57330l04877k60711l19004m32909m71830m55260m51207m22121l84449
2788.1F85453475m12941m91679n51045n95451p08878q84354j002133j052022j094758
2806.4F78660214j158655j245916j267731j183986j044393r26197r52839j201094j611709
2824.8F68067694k027035k387166k691984k892196l023982l154278l300906l452539
2841.1F45137608l494263l315925k967119k591670k287745j980782j389504k68042
2857.4F26842558J131177K118945K276659J767576J016259L79742k1458k53499l49640
2875.8F34908319k80798o7532J51932J43111k15590q06987j370967j752317k093076
2894.1F28616095k618552l403127m394472n512118o695926p901311r080827j0073960
$$ plain form
2767.7 689313173 688955843 688650966 688390255 688071251 687638342 687166512 686711252 686260045 685837924 685453475
2788.1 685453475 685040534 684548855 683997810 683402359 682693481 681809127 680806994 679754972 678660214
2806.4 678660214 677501559 676255643 674987912 673803926 672759533 671833336 670880497 669679403 668067694
2824.8 668067694 666040659 663653493 660961509 658069313 655045331 651891053 648590147 645137608
2841.1 645137608 641643345 638327420 635360301 632768631 630480886 628500104 627110600 626842558
2857.4 626842558 627973735 630092680 632369339 634136915 635153174 635532916 635511458 635257959 634908319
2875.8 634908319 634627521 634559989 634711921 634855032 634639442 633832455 632461488 630709171 628616095
2894.1 628616095 625997543 622594416 618199944 612687826 605991900 598090589 589009762 578935802
2910.4E78935802j0603786j0136723p848740l593444J441061N660653Q167565Q950710
2926.8E70973098Q412361O921769M829406K446890k6822k355397m036188m424989l483295
2945.1E79256833k096713j123965o19054k72750Q9764N69403J215697J838386K072394
2963.5E80929995J716494Q80122p7665p81714j049161r42707p91848p33614m05312
2981.8E78744590M62890J646757K719879L480315L971994M066408L468275K270639
2998.1F00831747Q85308m04418j365125j834035j828193j543940j319766j370430j717269
3016.5E90333879k302885l076375m112660n539835p091641p981122p496595n646289
3032.8E47086477l462434j907587r24289n51462j384795l588915o261706p856727p830143
$$ plain form
2910.4 578935802 568332016 558195293 550346553 546753109 548194170 553854823 562022388 570973098
2926.8 570973098 579385459 586307228 591136634 593583524 593556702 591201305 587165117 582740128 579256833
2945.1 579256833 577160120 576036155 575417101 575144351 575234115 575803518 577019215 578857601 580929995
2963.5 580929995 582646489 583526611 583448946 582667232 581618071 580675364 579883516 579149902 578744590
2981.8 578744590 579207480 580854237 583574116 587054431 591026425 595092833 598561108 600831747
2998.1 600831747 601717055 601312637 599947512 598113477 596285284 594741344 593421578 592051148 590333879
3016.5 590333879 588030994 584954619 580841959 575302124 568210483 560229361 552732766 547086477
3032.8 547086477 543624043 541716456 540792167 540240705 538855910 535266995 529005289 521148562 513318419
3051.2E13318419p272124p173478p219047o541669m818797k400786J83344K528697
3067.5D80604559M437089N869657O914765P830768Q652330Q735180P372856M831493
3083.8E35248697K482295J857281L172695M831135N208374M351973L190160K238452
3100.1E62581062J499534R63509Q61585J397073K367855L136754L250181K856314K288223
3118.5E81202090J720428J245082Q71181N24819J94788r9182l64423m96030m64320
3136.8E84334433m93288p01189q97467r55820j035214j173973j259565j287580j179397
3155.2E75350940q51094m77493k93255l43919n42879q28564j162350j452744j648367
3173.5E67750275j724183j590372j304686j100838j080870j239777j582146j980245
$$ plain form
3051.2 513318419 506046295 498872817 491653770 485112101 480293304 477892518 478075862 480604559
3067.5 480604559 485041648 490911305 497826070 505656838 514309168 523044348 530417204 535248697
3083.8 535248697 537730992 539588273 542760968 547592103 552800477 557152450 560342610 562581062
3100.1 562581062 564080596 565044105 565905690 567302763 569670618 572807372 576057553 578913867 581202090
3118.5 581202090 582922518 584167600 585038781 585563600 585758388 585659206 585294783 584798753 584334433
3136.8 584334433 583841145 583139956 582242489 581286669 580251455 579077482 577817917 576530337 575350940
3155.2 575350940 574499846 574022353 573729098 573385179 572842300 572013736 570851386 569398642 567750275
3173.5 567750275 566026092 564435720 563131034 562030196 560949326 559709549 558127403 556147158
3189.9E56147158k235174k188504j801371j207531o75142m75704o42121r89437j363933
3208.2E44568241j737237k072573k255082k222955j941443j377821p03871j96040p391
3226.6E32053828j99795p06553j225293j500487j643062j749277j678526j399338j025379
3244.9E20926118o55115m38571n22673q35061j144469j313507j419425j570702j727760
3263.3E11298835j824558j836478j809478j848817j951158k042890k089053k107263
3279.6D95789140k144217k202958k250165k244949k196640k239465k446056k693921
3295.9D77370769k841830k818048k630622k477348k652317l097027l414601l433645
3312.2D54005331l319621l278584l327995l378570l349811l324628l543198l866136
$$ plain form
3189.9 556147158 553911984 551723480 549922109 548714578 548039436 547563732 546921611 545932174 544568241
3208.2 544568241 542831004 540758431 538503349 536280394 534338951 532961130 532257259 532061219 532053828
3226.6 532053828 531854033 531147480 529922187 528421700 526778638 525029361 523350835 521951497 520926118
3244.9 520926118 520271003 519832432 519309759 518474698 517330229 516016722 514597297 513026595 511298835
3263.3 511298835 509474277 507637799 505828321 503979504 502028346 499985456 497896403 495789140
3279.6 495789140 493644923 491441965 489191800 486946851 484750211 482510746 480064690 477370769
3295.9 477370769 474528939 471710891 469080269 466602921 463950604 460853577 457438976 454005331
3312.2 454005331 450685710 447407126 444079131 440700561 437350750 434026122 430482924 426616788
3328.6D26616788l951907l855616l722549l612339l783912m146307m293740m324168
3344.9C94926250m283905m099608m219442m648507m756570m520386m395664m544884
3361.2C59457284m631609m385650m242479m586399n082488n178601m901796m703939
3377.5C21744323m668623m672200m646420m552931m317671l993273m087508m550695
3393.8B86255002m508167l866941l500253l860712m165769l652423k889574k487451
3410.1B57323712k289951k111643j812846j292005q32409n88074k99245J14858M67628
3428.5B48680025N59837O62565Q97169P95156M87745O20335J160205J670420K045363
3446.8B57578820K335072K679586L111809L561706M057467M482031M645943M844398
$$ plain form
3328.6 426616788 422664881 418809265 415086716 411474377 407690465 403544158 399250418 394926250
3344.9 394926250 390642345 386542737 382323295 377674788 372918218 368397832 364002168 359457284
3361.2 359457284 354825675 350440025 346197546 341611147 336528659 331350058 326448262 321744323
3377.5 321744323 317075700 312403500 307757080 303204149 298886478 294893205 290805697 286255002
3393.8 286255002 281746835 277879894 274379641 270518929 266353160 262700737 259811163 257323712
3410.1 257323712 255033761 252922118 251109272 249817267 248984858 248396784 248097539 248212397 248680025
3428.5 248680025 249239862 249902427 250799596 251594752 252082497 252702832 253863037 255533457 257578820
3446.8 257578820 259913892 262593478 265705287 269266993 273324460 277806491 282452434 287296832
3463.2B87296832N335092N607665N250364M812956M963905N383521N632907N582661
3479.5C29865903N273848N153776N298108N253404N035400M984647N002350M942208
3495.8C70809644M749716M560202M522234M330010M002213M001111M257887M382700
3512.1D05615717M198551L938645L947527M115045M249722M116058L828496L833174
3528.4D37842935L983438M056305M152983M119605L892392L889412M061699M068911
3544.7D70067680L878146L718198L826946L998607L964424L920049M017174M003763
3561.1E01394987L703773L530800L904760M089058L698230L449738L486991L521382
3577.4E30779719L551662L587902L426313L127575L018975L115654L016055K859533
$$ plain form
3463.2 287296832 292631924 298239589 303489953 308302909 313266814 318650335 324283242 329865903
3479.5 329865903 335139751 340293527 345591635 350845039 355880439 360865086 365867436 370809644
3495.8 370809644 375559360 380119562 384641796 388971806 392974019 396975130 401233017 405615717
3512.1 405615717 409814268 413752913 417700440 421815485 426065207 430181265 434009761 437842935
3528.4 437842935 441826373 445882678 450035661 454155266 458047658 461937070 465998769 470067680
3544.7 470067680 473945826 477664024 481490970 485489577 489454001 493374050 497391224 501394987
3561.1 501394987 505098760 508629560 512534320 516623378 520321608 523771346 527258337 530779719
3577.4 530779719 534331381 537919283 541345596 544473171 547492146 550607800 553623855 556483388
3593.7E56483388K888143K918959K811789K675712K524495K296865K239585K324581
3610E77163517K280117K192258J983524J823485J989007J972317J603544J223207J219511
3628.4E93450487J647412J683236J464963J317203J192331J092374J002550Q75354
3644.7F03725910P70033J099050J724124J721739J571298J962006K213895J864076
3661F16652131J535773J448572J254082J073003J238107J145482R40502J131475J180172
3679.4F27599299J015663Q51035O92427N32687K89381J74403K79724K55704P4268r5666
3699.8F31668925p4863J40667J54733j37031m67956l38792J95920K38895j53780l73721
3720.1F30852997k40802j7941J08838J16527j5378j89841j77145K09749M58955P2003
$$ plain form
3593.7 556483388 559371531 562290490 565102279 567777991 570302486 572599351 574838936 577163517
3610 577163517 579443634 581635892 583619416 585442901 587431908 589404225 591007769 592230976 593450487
3628.4 593450487 595097899 596781135 598246098 599563301 600755632 601848006 602850556 603725910
3644.7 603725910 604495943 605594993 607319117 609040856 610612154 612574160 614788055 616652131
3661 616652131 618187904 619636476 620890558 621963561 623201668 624347150 625287652 626419127 627599299
3679.4 627599299 628614962 629465997 630158424 630691111 630980492 631154895 631434619 631690323 631764591 631668925
3699.8 631668925 631594062 631734729 631889462 631752431 631284475 630945683 631141603 631380498 631226718 630852997
3720.1 630852997 630612195 630594254 630703092 630819619 630804241 630614400 630437255 630647004 631105959 631177962
3740.5F31177962o43015p93994j20878j05798m13537k0862K60771n186k33412q6844
3760.9F29015207J6690j19150k18928k34485j43408l3260n3644q3744j12057j88053
3781.3F27845168k43902k19941j33276j31190k62618m12345m54605l87251m71234n22316
3801.7F24606490k76089k99990l31878m3571p809l46005n82754m89354n86748m82500
3822.1F21159792m1068l5941k52486l76045l23415k38597m94302p18117l95596l1113
3842.5F18253112J30772J12534j48118o68585j215458o09934L43442K49922j87456
3860.9F16260231m74930m37618l62992n27203n21481l59535l12984l79265n97715n50210
3881.3F11736298l78609n13315n19097n14627o34074l98099j51277l42846o33180o40273
$$ plain form
3740.5 631177962 630534947 629740953 629620075 629514277 629100740 629079878 629340649 629335463 629102051 629015207
3760.9 629015207 629031897 628912747 628693819 628459334 628315926 628282666 628229022 628145278 628033221 627845168
3781.3 627845168 627601266 627381325 627248049 627116859 626854241 626441896 625987291 625600040 625128806 624606490
3801.7 624606490 624330401 624030411 623698533 623654962 623647153 623301148 622718394 622229040 621642292 621159792
3822.1 621159792 621118724 621082783 620830297 620454252 620130837 619892240 619397938 618679821 618284225 618253112
3842.5 618253112 618383884 618496418 618348300 617679715 616464257 615854323 616197765 616447687 616260231
3860.9 616260231 615785301 615347683 614984691 614457488 613936007 613576472 613263488 612884223 612286508 611736298
3881.3 611736298 611357689 610844374 610325277 609810650 609176576 608778477 608627200 608284354 607651174 607010901
3901.7F07010901l89278p4089J06812J11461K7001j47224l61144m28141l28004k72512
3922.1F05255783k86341k40803k53200l73841l58820k02536j85252l06665m23670m47393
3942.5F02177262l40044k65122k52962k11239j85728j81675j65581j26124j18732j81318
3962.9F00148737k31742k35498k21253k18689k58684k76387k54095k74896k62082j75238
3983.2E97740173j60932k00749k13921k25186k01464j61588j95503
3997.5E96380830
$$ plain form
3901.7 607010901 606621623 606547534 606654346 606765807 606792808 606645584 606284440 605856299 605528295 605255783
3922.1 605255783 604969442 604728639 604475439 604101598 603742778 603540242 603354990 603048325 602624655 602177262
3942.5 602177262 601837218 601572096 601319134 601107895 600922167 600740492 600574911 600448787 600330055 600148737
3962.9 600148737 599916995 599681497 599460244 599241555 598982871 598706484 598452389 598177493 597915411 597740173
3983.2 597740173 597579241 597378492 597164571 596939385 596737921 596576333 596380830
3997.5 596380830
##END=$$ End of the data block
