##TITLE=Fenol $$ Begin of the data block
##JCAMP-DX=5.00 $$ ACD/SpecManager v 10.08
##SPECTROMETER/DATA SYSTEM=Alpha
##DATE=30 May 2014 08:24:52
##DATA TYPE=INFRARED SPECTRUM
##DATA CLASS=XYDATA
##ORIGIN=
##OWNER=
##NPOINTS=1666
##FIRSTX=601.67492676
##LASTX=3997.56933594
##MAXX=3997.56933594
##MINX=601.67492676
##MAXY=0.86449248
##MINY=0.57023722
##XFACTOR=1.0000000000
##YFACTOR=1.000000000000000e-9
##FIRSTY=0.84794092
##DELTAX=2.03957629
##XUNITS=1/CM
##YUNITS=ARBITRARY UNITS
##XYDATA=(X++(Y..Y))
601.7H47940922k615392k850831l466606l883600l457785k437174j318336k46167P53224
$$ 847940922 845325530 842474699 839008093 835124493 831666708 829229534 827911198 827665031 828418255
620H28418255J580059K141714K478660K832651L243088L287077K820492K123952J266241
$$ 828418255 829998314 832140028 834618688 837451339 840694427 843981504 846801996 848925948 850192189
638.4H50192189L28601k36690k22087Q4698L67582M76777M17829L47435L50237K68638
$$ 850192189 850520790 850284100 850062013 850146711 850514293 850991070 851408899 851756334 852106571 852375209
658.8H52375209P2122j12116l33786o81878j018524j122355r40204p30812j029790
$$ 852375209 852447331 852335215 852001429 851319551 850301027 849178672 848238468 847507656 846477866
677.1H46477866j868248k528488k979875l716707m462660m850745m755139l944695
$$ 846477866 844609618 842081130 839101255 835384548 830921888 826071143 821316004 817371309
693.5H17371309k507329q24034Q70764K636433M450142N955040O641507O212652N225718
$$ 817371309 814863980 814039946 814910710 817547143 821997285 827952325 834593832 840806484 846032202
711.8H46032202M430652L470838K103150Q97109N6684l38614k12490R8526L22163M78745
$$ 846032202 850462854 853933692 856036842 856933951 856990635 856652021 856439531 856538057 856860220 857338965
732.2H57338965O29306P38024P32840N02884l48806j964510l302991l623069l796041
$$ 857338965 857968271 858706295 859439135 859942019 859593213 857628703 854325712 850702643 846906602
750.6H46906602m795312n986393o132782m973113k979636p82728P14540J148760J528681
$$ 846906602 842111290 836124897 829992115 825019002 822039366 821256638 821971178 823119938 824648619
768.9H24648619K514004L556073L904343L700852L875077M213512L583610K177954
$$ 824648619 827162623 830718696 834623039 838323891 842198968 846412480 849996090 852174044
785.2H52174044J440763J876474K655148K929449K320171Q18193p38085j202881q20041
$$ 852174044 853614807 855491281 858146429 861075878 863396049 864214242 863476157 862273276 861453235
803.6H61453235m37558k77102k76446m74691q04067r45210o72520j28686N4300p29323
$$ 861453235 861015677 860738575 860462129 859987438 859183371 858238161 857565641 857436955 857491255 856761932
824H56761932j857757k289891k072752j742959j420498r62496l54051K80738Q18431
$$ 856761932 854904175 852614284 850541532 848798573 847378075 846415579 846061528 846342266 847160697
842.3H47160697J223922J673341K349495L045500L273308K643049J449168O90817N76496
$$ 847160697 848384619 850057960 852407455 855452955 858726263 861369312 862818480 863509297 864085793
860.7H64085793M06683j2040l67224n06997n23091n06580m44591m16994p44104j417101
$$ 864085793 864492476 864480436 864113212 863606215 863083124 862576544 862131953 861714959 860970855 859553754
881.1H59553754j835525j730680j348198q85486m25339k0206L42011O45221P61926
$$ 859553754 857718229 855987549 854639351 853753865 853328526 853308320 853650331 854295552 855057478
899.4H55057478O79016O02186O38068O26504L02076l99828j119494j605749j929164
$$ 855057478 855736494 856338680 856976748 857603252 857905328 857505500 856386006 854780257 852851093
917.8H52851093j920283j479447q42512k11358L49999P70092J011491J191973J402021
$$ 852851093 850930810 849451363 848608851 848397493 848747492 849517584 850529075 851721048 853123069
936.2H53123069J553595J558244J412332J111090N55873k32756p74920p28965m44889
$$ 853123069 854676664 856234908 857647240 858758330 859314203 859081447 858306527 857577562 857132673
954.5H57132673l17335l56912m19558m34398m28915m48227n07713n54323n30243m95135
$$ 857132673 856815338 856458426 856038868 855604470 855175555 854727328 854219615 853665292 853135049 852639914
974.9H52639914n33045n85496n58138o15001j024365j576960j850009j786411j504541
$$ 852639914 852106869 851521373 850963235 850348234 849323869 847746909 845896900 844110489 842605948
993.3H42605948j116633p63893n23567l45111j76430j09136k49863m86254o86169j028478
$$ 842605948 841489315 840725422 840201855 839856744 839680314 839571178 839321315 838835061 838148892 837120414
1013.7H37120414j740694k590359l037571l041804l093720l456890m012704m601538
$$ 837120414 835379720 832789361 829751790 826709986 823616266 820159376 816146672 811545134
1030H11545134n130649n473912n694091o116510o714582o931126o382883n110800l232121
$$ 811545134 806414485 800940573 795246482 789129972 782415390 775484264 769101381 763990581 760758460
1048.3G60758460r02296J546979L737629N415082O497383O964266O742001N891979
$$ 760758460 759856164 761403143 765140772 770555854 777053237 784017503 790759504 796651483
1064.7G96651483M692077L258586J534164k11120j526057k359748l008723l661275
$$ 796651483 801343560 804602146 806136310 805925190 804399133 802039385 799030662 795369387
1081G95369387m206181m499376m681050n030215n591572o136179o409406o338537n856097
$$ 795369387 791163206 786663830 781982780 776952565 771360993 765224814 758815408 752476871 746620774
1099.3G46620774m787326l309130k025366j110554l1888J403391K764702L590226L581464
$$ 746620774 741833448 738524318 736498952 735388398 735356510 736759901 739524603 743114829 746696293
1117.7G46696293K800227J888752J614987K216518L335953M481912N571902O754756
$$ 746696293 749496520 751385272 753000259 755216777 758552730 763034642 768606544 775361300
1134G75361300P803320Q433879Q997738R876847J0505617J0046184Q355200N784274
$$ 775361300 783164620 791598499 800596237 810473084 820978701 831024885 839380085 845164359
1150.3H45164359K697706l82424k680242l783226l871500l318071k436936j404822
$$ 845164359 847862065 847479641 844799399 841016173 837144673 833826602 831389666 829984844
1166.6H29984844k63453R74715K172708L103495L683329L926217L729940K877593J358151
$$ 829984844 829721391 830696106 832868814 835972309 839655638 843581855 847311795 850189388 851547539
1185H51547539k10583j030207j034617o83367l34800j69098k33352m82083r34183j743078
$$ 851547539 851336956 850306749 849272132 848588765 848253965 848084867 847851515 847369432 846435249 844692171
1205.4H44692171k987087m395008n486131n917788n621671m996658m836320n275667
$$ 844692171 841705084 837310076 831823945 825906157 820284486 815287828 810451508 805175841
1221.7H05175841n362809m392326k610564o02901J272202K909481M243314N150974
$$ 805175841 799813032 795420706 792810142 792207241 793479443 796388924 800632238 805783212
1238H05783212N555272N647242N823732O175458O237865N329668L304541J087904l53396
$$ 805783212 811338484 816985726 822809458 828984916 835222781 840552449 843856990 844944894 844591498
1256.4H44591498j133799j729548k541721l827870n041540n357503m739166l648698
$$ 844591498 843457699 841728151 839186430 835358560 830317020 824959517 820220351 816571653
1272.7H16571653k311885o83189J174331L011286M575193N732656O398260O421387
$$ 816571653 814259768 813576579 814750910 817762196 822337389 828070045 834468305 840889692
1289H40889692N869568N001604L732622K128959R29474N03242L93212K11954N305p0810
$$ 840889692 846759260 851760864 855493486 857622445 858551919 859055161 859448373 859660327 859665632 859594822
1309.4H59594822L874J32263K14159J88530m17l61562p79986j152635j485109j767397
$$ 859594822 859598696 859730959 859945118 860133648 860133231 859771669 858991683 857839048 856353939 854586542
1329.8H54586542j933873j930952j723886j333773r27508p89821j035631j436769j630843
$$ 854586542 852652669 850721717 848997831 847664058 846736550 845946729 844911098 843474329 841843486
1348.2H41843486j489461j143694p69317m75645k35200P1168N14388J088977J730561
$$ 841843486 840354025 839210331 838441014 837965369 837730169 837801337 838315725 839404702 841135263
1366.5H41135263K323091K693713K629459K028108J122355L41237n2870j46985j76727
$$ 841135263 843458354 846152067 848781526 850809634 851931989 852273226 852220356 852073371 851896644
1384.9H51896644k35677k68996k88129n00202j175821k367139l689646m608274m775762
$$ 851896644 851660967 851391971 851103842 850603640 849427819 847060680 843371034 838762760 833986998
1403.2H33986998m232347l364146k311707j029014M34994J902998L183365M267394
$$ 833986998 829754651 826390505 824078798 823049784 823484778 825387776 828571141 832838535
1419.5H32838535N077601N218267M436016K595961j56641l124535n500555o788254
$$ 832838535 837916136 843134403 847570419 850166380 850009739 846885204 841384649 834596395
1435.9H34596395p044076o592036n430400l812254k352476j221001J15633J996875
$$ 834596395 827552319 820960283 815529883 811717629 809365153 808144152 808259785 810256660
1452.2H10256660L861666N158424N763829N566478M624188L383457K374351J843870
$$ 810256660 814118326 819276750 825040579 830607057 835231245 838614702 840989053 842832923
1468.5H42832923J641631J515389J212716J83880j794815m039526n195379m926026
$$ 842832923 844474554 845989943 847202659 847386539 845591724 841552198 836356819 831430793
1484.8H31430793m162550l171921j659274n79774j238823m418552r316981j2451232
$$ 831430793 827268243 824096322 822437048 821857274 820618451 816199899 806882918 794431686
1501.1G94431686j1788487q786798n287170k171695N09560L168106O363451R836913
$$ 794431686 782643199 773856401 768569231 766397536 766907096 770075202 776438653 786275566
1517.4G86275566J2641370J4479339J5180528J3055861P284165p17461q078039j1712969
$$ 786275566 798916936 813396275 828576803 841632664 848916829 848199368 840121329 828408360
1533.7H28408360j2108683j1543691j0479033q873582o825745m094899j028538K044618
$$ 828408360 816299677 804755986 794276953 785403371 778577626 774482727 773454189 775498807
1550.1G75498807M843653P347643R471595J0489464J0026276Q140385N333424K693892
$$ 775498807 780342460 787690103 797161698 807651162 817677438 825817823 831151247 833845139
1566.4H33845139Q97884K742k55585k85447j15275K46108j98305j940668m320383o061733
$$ 833845139 834743023 834745765 834490180 834204733 834089458 834335566 834137261 832196593 827876210 821814477
1586.8H21814477o542027o172955n779385n780995n573869m536748k861440k351224
$$ 821814477 815272450 809099495 803320110 797539115 791965246 787428498 784567058 782215834
1603.1G82215834m111290q191049j3120234j6674757j8240750j7607630j4654696r558200
$$ 782215834 778104544 769913495 756793261 740118504 721877754 704270124 689615428 680057228
1619.4F80057228k934933M052400J0516465J6199172K0854175K4105787K5099158K2534252
$$ 680057228 677122295 681174695 691691160 707890332 728744507 752850294 777949452 800483704
1635.7H00483704J7089486J0586858N294024K550185J648128J691461J811683J865089
$$ 800483704 817573190 828160048 833454072 836004257 837652385 839343846 841155529 843020618
1652H43020618K047658K160132K092421J918137J669943J449704J312137J142323R58204
$$ 843020618 845068276 847228408 849320829 851238966 852908909 854358613 855670750 856813073 857771277
1670.4H57771277Q73805P77125O55413N52773M81010L97384K61366J47402J25110J27912
$$ 857771277 858645082 859422207 860077620 860630393 861111403 861508787 861770153 861917555 862042665 862170577
1690.8H62170577R6023O7413P5877R5546Q7559P9751J11818J44840J53661J57952J58846
$$ 862170577 862266600 862334013 862409890 862505436 862592995 862672746 862784564 862929404 863083065 863241017 863399863
1713.2H63399863J35124J06394J10746J30176J16349O5326J8597j2160m3749o1989
$$ 863399863 863534987 863641381 863752127 863882303 863998652 864063978 864082575 864070415 864026666 863964677
1733.6H63964677m3392k2233l1113n7996q4042j19329j63019j78992j67728j70409
$$ 863964677 863921285 863899052 863867939 863809943 863725901 863606572 863443553 863264561 863096833 862926424
1754H62926424k09392k61485k86341k85327k66016k10762j36912q3565m6552r715K1398
$$ 862926424 862717032 862455547 862169206 861883879 861617863 861407101 861270189 861186624 861140072 861130357 861151755
1776.5H61151755M7862R8825J85192K53379K50459K01582J50264Q8513j0252j32323
$$ 861151755 861199617 861298442 861483634 861737013 861987472 862189054 862339318 862427831 862417579 862285256
1796.9H62285256k56955l93093n27203o05702o10412n69105m90367l64602k13563o8426
$$ 862285256 862028301 861635208 861108005 860502303 859891891 859322786 858832419 858467817 858254254 858185828
1817.2H58185828P0750K17259L39210L90888L73244L15070K30432J31547N3823J7285
$$ 858185828 858256578 858473837 858813047 859203935 859577179 859892249 860122681 860254228 860308051 860325336
1837.6H60325336p748m5896q2612j03831j20699j33872j33276j29939j36137j35541
$$ 860325336 860317588 860271692 860189080 860085249 859964550 859830678 859697402 859567463 859431326 859295785
1858H59295785j05738n7638k1636j3888l8505j03533j96636k72035k93255k75672k65896
$$ 859295785 859190047 859132409 859110773 859096885 859058380 858954847 858758211 858486176 858192921 857917249 857651353
1880.5H57651353k90871l49223m22717m67658m37796l33786k02298q4996P808O9559
$$ 857651353 857360482 857011259 856588542 856120884 855683088 855349302 855147004 855062008 855069816 855139375
1900.9H55139375R2685J07884J59264K38538K90394K76506K05218J06216Q166n4956
$$ 855139375 855232060 855339944 855499208 855737746 856028140 856304646 856509864 856616080 856624246 856569290
1921.3H56569290o0856l0518o199%k443k3604p3731j22845j41203j50681j81198k34246
$$ 856569290 856508434 856477916 856471717 856471717 856469274 856445670 856371939 856249094 856107891 855957210 855776012 855541766
1945.7H55541766l16263m44769n88298o63400o38962n65767m92930m17412l32832k60115
$$ 855541766 855225503 854780734 854192436 853529036 852890074 852324307 851831377 851413965 851081133 850821018
1966.1H50821018j98781j10328J3172J28091K01344K27630J99735J33753R7633J32024
$$ 850821018 850622237 850511909 850525081 850653172 850854516 851082146 851281881 851415634 851513267 851645291
1986.5H51645291J81794J82092J36435O9440j8418j17421j87278k04444j93417j81258
$$ 851645291 851827085 852009177 852145612 852215052 852196634 852079213 851891935 851687491 851494074 851312816
2006.9H51312816j62780j32859j08600r1016o5327m2617m4286n7638o0379o0916p0036
$$ 851312816 851150036 851017177 850908577 850817561 850752234 850709617 850665331 850607693 850547314 850486398 850416362
2029.4H50416362o9439m8161k3365p391R179K7776L1054J5319L337O199J1206J6809
$$ 850416362 850346923 850298762 850275397 850268006 850277185 850304961 850336015 850351334 850354671 850360870 850372076 850388885
2053.8H50388885L5166N8532O6876O2943O4731P0870O6995N2095L4928J0550k8729
$$ 850388885 850424051 850482583 850549459 850612402 850677133 850748003 850814998 850867093 850902021 850912571 850883842
2076.3H50883842p0215r8169j17600j37806j47640j36197j13368q8334n5253j4246
$$ 850883842 850813627 850715458 850597858 850460052 850312412 850176215 850062847 849974513 849919260 849905014
2096.7H49905014J8716L8564N8174P9274Q6546P5579N4658K5331j2815m6908o2228
$$ 849905014 849923730 849962294 850020468 850099742 850186288 850261867 850316525 850341856 850329041 850282133 850219905
2119.1H50219905o3359o1989n7221m6134l8683m1068m2736l7790l6358m3691n2571
$$ 850219905 850156546 850094557 850037336 849991202 849952519 849911451 849868715 849830925 849794567 849750876 849698305
2141.5H49698305o1512p4923q8751r5546r7633j01983j04189r8706r1552q7679q0645
$$ 849698305 849636793 849561870 849473119 849377573 849279940 849177957 849073768 848975062 848883510 848795831 848715186
2164H48715186o7830n8114n8353o6162p4505q0765q3804q1837p4446o5208n4657m1306
$$ 848715186 848647356 848589242 848530889 848464727 848390222 848309457 848225653 848143816 848069370 848004162 847949505 847908199
2188.4H47908199k8014j7345r120m113n960j6272l3557n1678o4194p0572p3731p7307
$$ 847908199 847880185 847862840 847853720 847849607 847843647 847827375 847793818 847742140 847677946 847607374 847533643 847456336
2212.9H47456336q5294r9361j16170j31428j43945j52588j56224j52647j39594j20282
$$ 847456336 847371042 847271681 847155511 847024083 846880138 846727550 846571326 846418679 846279085 846158803
2233.3H46158803r7812p2002m5776k5034j4008j4185k5213m2916o0498p3672q3565
$$ 846158803 846060991 845988989 845943213 845918179 845904171 845889986 845864773 845821857 845761359 845687687 845604122
2255.8H45604122r0063r2089r4116j01566j12713j19090j16229j10626j12653j21832
$$ 845604122 845514059 845421970 845327854 845226288 845113575 844994485 844878256 844767630 844654977 844533145
2276.1H44533145j31368j34170j26958j10984r2387p6175o2883n6386o3121q0407r6977
$$ 844533145 844401777 844267607 844140649 844029665 843937278 843861103 843798220 843741834 843678713 843598306 843501329
2298.6H43501329j06275j14083j32859j65105k01582k35737k69294l06010l45230l76046
$$ 843501329 843395054 843280971 843148112 842983007 842781425 842545688 842276394 841970384 841625154 841249108
2319H41249108l88026l78847l49104l04401k61605k18690j55449p7307j4782J0789
$$ 841249108 840861082 840482235 840133131 839828730 839567125 839348435 839192986 839115679 839100897 839111686
2339.4H39111686j79m8578j27017k18094k96235l40581l48747l27229k77281k09331
$$ 839111686 839111507 839062929 838935912 838717818 838421583 838081002 837732255 837405026 837127745 836918414
2359.8H36918414j43230p4387L934P2360J14262J34885J45138J40965J24633J10686
$$ 836918414 836775184 836700797 836704731 836777091 836891353 837026238 837171376 837312341 837436974 837547660
2380.2H37547660J06633J05261J01388R8944R8228Q5592M8459q285p0989j29402j71661
$$ 837547660 837654293 837759554 837860942 837959886 838058114 838143706 838192165 838183880 838112891 837983489 837811828
2402.6H37811828j91272j97529k05756k16841k23875k33889k55346k76208k86460k96891
$$ 837811828 837620556 837423027 837217271 837000430 836776555 836542666 836287320 836011112 835724652 835427761
2423H35427761l17454l40820l57926l71277l74913l49045k88427k09272j26063m4227
$$ 835427761 835110307 834769487 834411561 834040284 833665371 833316326 833027899 832818627 832692564 832648337
2443.4H32648337K5332O9916Q8155Q3328M6134k8491j17898j90199k31862k43723k17974
$$ 832648337 832673669 832743585 832831740 832915068 832961202 832932711 832814813 832624614 832392752 832149029 831931055
2465.8H31931055j54198p3313O377Q0169J39772J70887J69396J38820P5757j9073j19329
$$ 831931055 831776857 831703544 831709921 831790090 831929862 832100749 832270145 832408965 832484722 832465649 832346320
2488.3H32346320j89245k15411k06053j67131j05799m3750K027L7193O7115Q1480P1645
$$ 832346320 832157075 831941664 831735611 831568480 831462681 831418931 831420958 831458151 831525266 831606746 831678391
2510.7H31678391M6133J2458l4690r3579j49131j92166k25782k50339k61486k68757
$$ 831678391 831724524 831736982 831702292 831608713 831459582 831267416 831041634 830791295 830529809 830261052
2531.1H30261052k84493l06845l23832l33488l40700l42071l30210l11732k94924k76506
$$ 830261052 829976559 829669714 829345882 829012394 828671694 828329623 827999413 827687681 827392757 827116251
2551.5H27116251k52783k25663j96457j63556j30116j07408j01626j04010j02460r3818
$$ 827116251 826863468 826637805 826441348 826277792 826147676 826040268 825938642 825834632 825732172 825638354
2571.9H25638354p8798n8591m1246l0697j8477J430K4200M4703O2287P4208P4625O0439
$$ 825638354 825559556 825500965 825459719 825429022 825410545 825411975 825436175 825480878 825543165 825617373 825691998 825752437
2596.4H25752437L8684K0504Q106j908j2695k9505n5015p8618q7738q4222p7247p2301
$$ 825752437 825791121 825811625 825819731 825817823 825805128 825775623 825720608 825641990 825554252 825470030 825392783 825320482
2620.8H25320482o6817o2108o3896p1823p8321q4460r9003j22488j52230j90854k42054
$$ 825320482 825253665 825191557 825127661 825055838 824977517 824893057 824794054 824671566 824519336 824328482 824086428
2643.3H24086428l00825l60668m18543m68791m98235m95911m61817m03702l23832k27630
$$ 824086428 823785603 823424935 823006392 822537601 822039366 821543455 821081638 820677936 820354104 820126474
2663.7H20126474j28508l5643N3346J31249J79470J90019J72616J35541Q4996L2186
$$ 820126474 819997966 819962323 820015669 820146918 820326388 820516407 820689023 820824564 820909560 820941746
2684.1H20941746j0669m2319o7830q8632r9898j02997j03831r8884q7500p9632q0645
$$ 820941746 820931077 820888758 820820928 820732296 820632398 820529401 820425570 820326686 820239186 820159554 820078909
2706.5H20078909q3387q1121p8023q3327r4056j06216j21176j38342j54317j66535
$$ 820078909 819995522 819914401 819836378 819753051 819658995 819552779 819431603 819293261 819138944 818972409
2726.9H18972409j75715j78277j65940j41143j15753r5009p6175n9605n2869o0618
$$ 818972409 818796694 818618417 818452477 818311334 818195581 818100572 818024397 817964792 817911923 817851305
2747.3H17851305p5936r5308j20044j48117j75953j99080k19464k45035k76685l14831
$$ 817851305 817775369 817680061 817560017 817411900 817235947 817036867 816817403 816572368 816295683 815980852
2767.7H15980852l61204m08173m38511m49837m51565m40776m07696l56435l01183k47121
$$ 815980852 815619648 815211475 814772964 814323127 813871562 813430786 813023090 812666655 812365472 812118351
2788.1H12118351j94549j50740j25051j17242j21713j34587j50383j58429j53482j43230
$$ 812118351 811923802 811773062 811648011 811530769 811409056 811274469 811124086 810965657 810812175 810668945
2808.5H10668945j31249j13130r3043q8453j11997j53780j88768k03550k05576k07901
$$ 810668945 810537696 810424566 810331523 810243070 810131073 809977293 809788525 809584975 809379399 809171498
2828.9H09171498k20359k44617k78890l21329l65436m02689m19378m09067l86774l70682
$$ 809171498 808951139 808706522 808427632 808106303 807740867 807338178 806918800 806509733 806122959 805752277
2849.3H05752277l60787l46958l18706k72095k16186j74880j61052j69695j96457k37703
$$ 805752277 805391490 805044532 804725826 804453731 804237545 804062665 803901613 803731918 803535461 803297758
2869.7H03297758k84195l19958l29971l22759l19600l23415l26335l27528l19421k88546
$$ 803297758 803013563 802693605 802363634 802040875 801721275 801397860 801071525 800743997 800424576 800136030
2890.1H00136030k47717k24948k13504j89066j56879j42515j54972j80483k10404k50638
$$ 800136030 799888313 799663365 799449861 799260795 799103916 798961401 798806429 798625946 798415542 798164904
2910.4G98164904k98262l35156l64721m05431m52220m90308n20885n37455n14865m52519
$$ 798164904 797866642 797531486 797166765 796761334 796309114 795818806 795297921 794760466 794245601 793793082
2930.8G93793082l96192l84629m03463m27425m61161n06223n37157n37514n28038n30183
$$ 793793082 793396890 793012261 792608798 792181373 791720212 791213989 790676832 790139318 789611280 789081097
2951.2G89081097n33402n30243n22435m97162m49777m01735l68476l35992k80082k04086
$$ 789081097 788547695 788017452 787495017 786997855 786548078 786146343 785777867 785441875 785161793 784957707
2971.6G84957707j27077l9697O7234J61946K14815K25425J94549J15574j0908j78695
$$ 784957707 784830630 784790933 784858167 785020113 785234928 785460353 785654902 785770476 785759568 785580873
2992G85580873l79085n85616p56561q66831r16898r18627q76903p97689p16389o81877
$$ 785580873 785201788 784616172 783859611 782992780 782075882 781157255 780280352 779482663 778766274 778084397
3012.4G78084397p15136q19206r80199j162708j341402j498640j596927j587511j440882
$$ 778084397 777369261 776550055 775569856 774407148 773065746 771567106 769970179 768382668 766941786
3030.8G66941786j179815q71002o05762m93348n99861q87096j263440j673460k074658
$$ 766941786 765761971 764890969 764285207 763791859 763191998 762304902 761041462 759368002 757293344
3049.1G57293344k365113k441942k290011j942515j434982q22783j89185L75390Q13008
$$ 757293344 754928231 752486289 750196278 748253763 746818781 745995998 745806813 746182203 746995211
3067.5G46995211J086712J169264J122117J073360J067579J048863R93788R51886R48430
$$ 746995211 748081923 749251187 750373304 751446664 752514243 753563106 754556894 755508780 756457210
3085.8G56457210R46283R00268P86603N88715K93732q0586m67658p96079j012683j076579
$$ 756457210 757403493 758303761 759090364 759679079 759972811 759892225 759424567 758628488 757615805 756539226
3106.2G56539226j003743q68976p34329o10352m90248l78668k81155j92106j14500
$$ 756539226 755535483 754666507 753932178 753321826 752831578 752452910 752171755 751979649 751865149
3124.6G51865149q8633j63257l33130n44786p36356q55446r08017r50396j006902j063585
$$ 751865149 751776516 751613259 751280129 750735343 749998987 749143541 748235524 747285128 746278226 745214641
3145G45214641j108348j143098j174688j200259j208663j207769j224399j265108j312971
$$ 745214641 744106293 742963195 741788507 740588248 739379585 738171816 736947417 735682309 734369338
3163.4G34369338j360834j405597j445412j499296j585960j694381j801670j893401
$$ 734369338 733008504 731602907 730157495 728658199 727072239 725377858 723576188 721682787
3179.7G21682787j965463k030909k108395k202750k305328k393425k434015k411843
$$ 721682787 719717324 717686415 715578020 713375270 711069942 708676517 706242502 703830659
3196G03830659k343714k258479k179563k121151k093911k101481k141178k212345k323151
$$ 703830659 701486945 699228466 697048903 694927752 692833841 690732360 688591182 686378837 684055686
3214.3F84055686k489448k712726k973020l244460l494799l694713l841400l954053
$$ 684055686 681566238 678853512 675880492 672636032 669141233 665446520 661605120 657651067
3230.7F57651067m043460m097879m103720m056454l950238l773332l519773l193200
$$ 657651067 653607607 649509728 645406008 641349554 637399316 633625984 630106211 626913011
3247F26913011k801597k354682j866161j344622q02457k68757K25246O52432J002312
$$ 626913011 624111414 621756732 619890571 618545949 617743492 617474735 617699981 618352413 619354725
3265.3F19354725J278102J473546J582861J615644J596689J551688J488328J406610
$$ 619354725 620632827 622106373 623689234 625304878 626901567 628453255 629941583 631348193
3281.6F31348193J307606J197100J099944J040220J015068R97483R59397R02295Q40425
$$ 631348193 632655799 633852899 634952843 635993063 637008131 638005614 638965011 639867306 640707731
3300F40707731P72357O96421O19590N56410N17487M80771M14312L09229J77622N6624
$$ 640707731 641480088 642176509 642796099 643352509 643869996 644350767 644765079 645074308 645251930 645308554
3320.4F45308554j0073m2796j08302k17140l45230m84883o13869p17342q24630r50813
$$ 645308554 645298481 645255685 645147383 644930243 644585013 644100130 643486261 642768919 641944289 640993476
3340.8F40993476j076698j197398j329482j487791j646817j750171j788676j835287
$$ 640993476 639916778 638719380 637389898 635902107 634255290 632505119 630716443 628881156
3357.1F28881156j937627k054334k154172k230942k268314k288580k332449k382398
$$ 628881156 626943529 624889195 622735023 620504081 618235767 615947187 613614738 611232340
3373.4F11232340k376437k295434k208352k165914k104163j959622j800716j730800
$$ 611232340 608855903 606560469 604352117 602186203 600082040 598122418 596321702 594590902
3389.7E94590902j730501j726985j709640j690924j680494j692593j711011j694560
$$ 594590902 592860401 591133416 589423776 587732852 586052358 584359765 582648754 580954194
3406.1E80954194j622498j529217j456856j370728j220227j022160q23557o44744m75943
$$ 580954194 579331696 577802479 576345623 574974895 573754668 572732508 571908951 571264207 570788264
3424.4E70788264l17812j79231n4002N7638J46806K29359L16739L92139M58121N50628
$$ 570788264 570470452 570291221 570237219 570294857 570441663 570671022 570987761 571379900 571838021 572388649
3444.8E72388649O71864P75218Q72969J024664J202106J315653J352966J362860J385391
$$ 572388649 573060513 573835731 574708700 575733364 576935470 578251123 579604089 580966949 582352340
3463.2E82352340J435578J478911J489758J489162J485765J477242J478910J485527
$$ 582352340 583787918 585266829 586756587 588245749 589731514 591208756 592687666 594173193
3479.5E94173193J494288J531244J595199J651525J668215J650810J627207J621127
$$ 594173193 595667481 597198725 598793924 600445449 602113664 603764474 605391681 607012808
3495.8F07012808J640976J658737J656116J648128J632869J625180J646698J671850
$$ 607012808 608653784 610312521 611968637 613616765 615249634 616874814 618521512 620193362
3512.1F20193362J684010J689315J694501J718640J752853J758099J744985J760006
$$ 620193362 621877372 623566687 625261188 626979828 628732681 630490780 632235765 633995771
3528.4F33995771J816214J874148J900375J906812J916051J939416J956463J952648
$$ 633995771 635811985 637686133 639586508 641493320 643409371 645348787 647305250 649257898
3544.7F49257898J959205J980066J975477J969516K006114K054036K096116K151430
$$ 649257898 651217103 653197169 655172646 657142162 659148276 661202312 663298428 665449858
3561.1F65449858K211332K257228K305388K370179K433240K481878K536238K597630
$$ 665449858 667661190 669918418 672223806 674593985 677027225 679509103 682045341 684642971
3577.4F84642971K644300K660096K653598K671004K723694K760768K751171K716363
$$ 684642971 687287271 689947367 692600965 695271969 697995663 700756431 703507602 706223965
3593.7G06223965K684593K660990K659678K652705K600431K548456K532840K512813
$$ 706223965 708908558 711569548 714229226 716881931 719482362 722030818 724563658 727076471
3610G27076471K443552K338827K262175K209544K161324K103984K016604J918078J835942
$$ 727076471 729520023 731858850 734121025 736330569 738491893 740595877 742612481 744530559 746366501
3628.4G46366501J756310J646102J496851J376450J309991J230359J124501J029492
$$ 746366501 748122811 749768913 751265764 752642214 753952205 755182564 756307065 757336557
3644.7G57336557R66966R52661R55701R46999Q97407Q42333Q05736P44581O51180N38052
$$ 757336557 758303523 759256184 760211885 761158884 762056291 762898624 763704360 764448941 765100121 765638173
3665.1G65638173M45723M07756L73840L33667L31998L62694L87907M06504M27544M18186
$$ 765638173 766083896 766491652 766865492 767199159 767531157 767893851 768281758 768688262 769115806 769533992
3685.5G69533992L69489L43204L27587K83122K22087J49786R3818P4684P4685P3850
$$ 769533992 769903481 770246685 770574272 770857394 771079481 771229267 771323085 771397769 771472454 771546304
3705.9G71546304N7399K0803j0431j4544p152j9491n2989o7412l5882J5258J2458n0664
$$ 771546304 771603703 771624506 771614075 771599531 771592379 771572888 771519899 771452487 771416605 771431863 771444321 771393657
3730.3G71393657p1883o6042r6679j32084j42694j46150j49012j32978j09374r9063
$$ 771393657 771321774 771255732 771159053 771026969 770884275 770738125 770589113 770456135 770346761 770247698
3750.7G70247698r0897o0380o497L4213K0564j6809j9013l3021p4506r1374q7798r1016
$$ 770247698 770156801 770096421 770089924 770124137 770144701 770127892 770108879 770075858 770001352 769909978 769822180 769731164
3775.2G69731164r8884r8527j00970j02579j16110j61231j95384k13683k31981k31564
$$ 769731164 769632280 769533753 769432783 769330204 769214094 769052863 768857479 768643796 768411815 768180251
3795.6G68180251k08497j90556j89900j81020j83463k02834k03669j96338j87755j73926
$$ 768180251 767971754 767781198 767591298 767410278 767226815 767023981 766820312 766623974 766436219 766262293
3816G66262293j78635j86920j80424k02417k30670k29299k10106j87934j51217j06394
$$ 766262293 766083658 765896738 765716314 765513897 765283227 765053928 764843822 764655888 764504671 764398277
3836.4G64398277j61886k70963l03447k82109k45691k17020j88231j52708j56641j96516
$$ 764398277 764236391 763965428 763661981 763379872 763134181 762917161 762728930 762576222 762419581 762223065
3856.8G62223065k21551k17020j78456j36435j15514j33515k20656k75195k48968k26379
$$ 762223065 762001514 761784494 761606038 761469603 761354089 761220574 760999918 760724723 760475755 760249376
3877.2G60249376k13682j88232j54853j45733j82807k31624k54214k45750k22266k05040
$$ 760249376 760035694 759847462 759692609 759546876 759364069 759132445 758878231 758632481 758410215 758205175
3897.6G58205175j81734j57774j44362j18077r5427r1255o8843l2544k8849o6519j13546
$$ 758205175 758023441 757865667 757721305 757603228 757507801 757416546 757347703 757315159 757286310 757219791 757106245
3920G57106245j40548j37568j24633j21951j21832j23203j30713j31607j23799j21176
$$ 757106245 756965697 756828129 756703496 756581545 756459713 756336510 756205797 756074190 755950391 755829215
3940.4G55829215j22726j20640j23262j35839j44661j39594j30057j27494j37568j58191
$$ 755829215 755706489 755585849 755462587 755326748 755182087 755042493 754912436 754784942 754647374 754489183
3960.8G54489183j74939j84894j88291j79231j64747j54615j49250j47104j47224j47163
$$ 754489183 754314244 754129350 753941059 753761828 753597081 753442466 753293216 753146112 752998888 752851725
3981.2G52851725j46032j46925j54495j65344j74284j86085k06531k25901
$$ 752851725 752705693 752558768 752404273 752238929 752064645 751878560 751672029 751446128
3997.5G51446128
$$ 751446128
##END=$$ End of the data block
