##TITLE=$$ Begin of the data block
##JCAMP-DX=5.00 $$ ACD/SpecManager v 10.08
##SPECTROMETER/DATA SYSTEM=Varian
##DATE=07 Jan 2013 16:42:12
##DATA TYPE=INFRARED SPECTRUM
##DATA CLASS=XYDATA
##ORIGIN=
##OWNER=
##NPOINTS=3735
##FIRSTX=399.26403809
##LASTX=4000.35498047
##MAXX=4000.35498047
##MINX=399.26403809
##MAXY=78.10258484
##MINY=4.01330614
##XFACTOR=1.0000000000
##YFACTOR=0.000000100000000
##FIRSTY=11.18790817
##DELTAX=0.96440572
##XUNITS=1/CM
##YUNITS=TRANSMITTANCE
##XYDATA=(X++(Y..Y))
399.3A11879082J0452308L229170m113416m71850p59640J090775J8144703M421625
407A43872757k454414o282015l83168R64613m61835P293348L89862P206593J146307
415.7A51292048k458487K541923q860969n817261M635277R452381P251034P991714
423.4A66027660K29493M29706R387417O916981N585670O65550J52626P58954M225425
432.1A94379482K405834j278820J742955r004822o763649K450352L348827K527542
439.8A89807701j962719K054081Q28896P02381J704807J595135J265240m152318m14981
448.4A91428223J275406J435070L702087L731880J858998L005523K410622P24773P738400
457.1B17310982K60162j0390587k762165K061939J952305j073684M44488P45697M688759
$$ plain form
399.3 111879082 122331390 125560560 121447144 120975294 120215654 121306429 139451132 143872757
407 143872757 141418343 135136328 134753160 135717773 135255938 142549286 142939148 150145741 151292048
415.7 151292048 148833561 151375484 142514515 136697254 141332531 150784912 158035946 166027660
423.4 166027660 166257153 166686859 176074276 182991257 188576927 189242477 189395103 190154057 194379482
432.1 194379482 196785316 195506496 197249451 188244629 181480980 183931332 187280159 189807701
439.8 189807701 187844982 189899063 190727959 191430340 193135147 194730282 195995522 191843204 191428223
448.4 191428223 192703629 194138699 197840786 201572666 203431664 206437187 208847809 209572582 217310982
457.1 217310982 217571144 207180557 204418392 206480331 208432636 207358952 207803440 208549137 213237896
465.8B13237896O048260N793380O058407O469593J1020546O914482J448975L772278
473.5B60763817Q776607J0295830M273243O845360M989166M237061O213550M670410
481.2C11065044Q655053M605693L291970J497993L563385P786522O615486N884476
489C52965622j220551j32484M54292M176216M129754N53855M542733L318786M080010
497.6C72868233J444320K904778J283417L21045O603088O54869J006737L781242O249008
506.3C97116737k61268J336746O488647n09491K780838L738442M180489J140975J658173
515D17670288N570335j309738j296005K244301N592461J666488K779274J815300k002601
523.7D32730103K553253m01573K483100M612465K902871L2196J684951L553315O97746
$$ plain form
465.8 213237896 219286156 225079536 231137943 237607536 248628082 255542564 256991539 260763817
473.5 260763817 269540424 279836254 284109497 290954857 295944023 300181084 306394634 311065044
481.2 311065044 319720097 324325790 327617760 329115753 332679138 340465660 347081146 352965622
489 352965622 351745071 351612587 352066879 356243095 360372849 360926704 365469437 368788223 372868233
497.6 372868233 374312553 377217331 378500748 378821793 385424881 386079750 387086487 390867729 397116737
506.3 397116737 396855469 398192215 404680862 404171371 406952209 410690651 414871140 416012115 417670288
515 417670288 423240623 421930885 420634880 422879181 428471642 430138130 432917404 434732704 432730103
523.7 432730103 435283356 434881783 437364883 441977348 444880219 444912415 446597366 450150681 450848427
532.4D50848427O875763L017959J885033M672852M350204O418037N233460P318916
540.1D90620651L429413N020332N257912M130058N660172L177490N182037K413750
547.8E24891815N219765K406158J176911L959617K705613N295715J340065M013977
555.5E51009636J941719K254791M704399K577134N576896K489624M301415K733116
563.2E77588730K348900K618866K727050L256569o08291K760963M72717K694893O61240
571.9E94521637n45349L359070J281852K891426J474762M783135J115723K9182J805611
580.6F10717049l78342K453155r69390K417640K310868J748428k19765l197708O80618
589.3F15562553K89917K540551Q24966K128639p8468j343308J77422O7406M882354
$$ plain form
532.4 450848427 457724190 460742149 462627182 467300034 471650238 478068275 483301735 490620651
540.1 490620651 494050064 499070396 504328308 508458366 514118538 517296028 522478065 524891815
547.8 524891815 530111580 532517738 533694649 537654266 540359879 545655594 546995659 551009636
555.5 551009636 552951355 555206146 559910545 562487679 568064575 570554199 574855614 577588730
563.2 577588730 579937630 582556496 585283546 588540115 587931824 590692787 591165504 593860397 594521637
571.9 594521637 593976288 597335358 598617210 601508636 602983398 607766533 608882256 608911438 610717049
580.6 610717049 610338707 612791862 611822472 614240112 616550980 618299408 618079643 614881935 615562553
589.3 615562553 615852470 618393021 619217987 621346626 621268158 619924850 620102272 620169678 625052032
597.9F25052032n378J729774Q79517j090851J048470P36999K296028l115768r8191
606.6F27432632M32892R52416P15294j190873J720238j246795J569099j448784j826630
615.3F27109489n32798L52440K417221j826210J267585j463775p06368p96432j648979
624F24172173k51046l201065k42309k074433M88549j496811l737450j478348k158699
632.7F10020561j81732l229065q45947k055054k450752j375427k863655l073426n876693
641.3E88068810j542855k515678j694985j093139k137566j138954k487183O25038l305015
650E72778473j755486M3869J48468J15242k663726N36384j670418M77143n35469j730042
659.7E65744438j603355l618889p98378m194260m090423o297188l884583P6409j2143898
$$ plain form
597.9 625052032 625046654 626776428 627655945 626565094 627613564 628350563 630646591 627530823 627432632
606.6 627432632 627865524 628817940 629533234 628342361 630062599 628815804 630384903 628936119 627109489
615.3 627109489 626576691 626929131 629346352 627520142 628787727 627323952 626617584 625821152 624172173
624 624172173 623921127 620720062 620477753 618403320 618891869 617395058 613657608 612179260 610020561
632.7 610020561 609838829 606609764 605763817 603708763 601258011 599882584 597018929 593945503 588068810
641.3 588068810 586525955 584010277 582315292 581222153 579084587 577945633 575458450 576083488 572778473
650 572778473 571022987 571066856 571215324 571330566 568666840 569203224 567532806 568009949 567474480 565744438
659.7 565744438 564141083 560522194 559723816 555529556 551439133 545141945 541257362 541333771 529189873
668.3E29189873j215515Q86535K763443K662735L927117K707252K526360M747352K243805
677E50438957K992630O65512J143227n56793K74696K993469M07181J306381p13997
685.7E58951263M92745N52063J34201j060181r14497J330604j046333J403847O27365
694.4E60471077J084099j77765j031418J324959j242829K12517j509437j198693j901435
703.1E56031075l276253k863465m592781m112625o718521o185341j0299072j3692513
710.8E04290504j3293266r945259O0158L308601M433327J676063j233215m177017p434387
719.5D77685509q551827j3664970j4455643j7614174j9362411k1129875k4823990k5037689
727.2C33044930j9941445o458168J0970764K9697800M0464249M3429298M3989181M0310174
$$ plain form
668.3 529189873 527974358 528860893 531624336 534287071 538214188 540921440 543447800 548195152 550438957
677 550438957 553431587 554097099 555240326 554683533 554958229 557951698 558358879 559665260 558951263
685.7 558951263 559444008 559996071 560130272 559070091 558155594 559486198 558439865 559843712 560471077
694.4 560471077 561555176 561377411 560345993 561670952 560428123 560640640 559131203 557932510 556031075
703.1 556031075 552754822 549891357 545298576 541185951 534467430 528282089 517983017 504290504
710.8 504290504 490997238 481051979 481112137 484420738 488854065 490530128 489296913 485119896 477685509
719.5 477685509 469133682 455468712 441013069 423398895 404036484 382906609 358082619 333044930
727.2 333044930 313103485 306645317 317616081 347313881 387778130 431207428 475196609 515506783
734.9E15506783L6440696K8549156K3997879J8876458J4908142J1580353O513443N930328
742.6F62303238J680221K273484P12280J367569J295319n31998J521606j980056j046753
751.3F67594910k137909p83692p11593j157456j67694l597412j250610k896729k049713
760F52842102j691055l70407J25122l046494O1341j809998r84497j896591j376496
768.6F41853027o44989k035026R51576j665497j176796k342911j607017j187439q23135
777.3F31321793Q19435k032433K71416k183609j681061k322121j715316J338729j955337
786F21861496k18849j359101j23138j774025k001343p57370k311096J061020j294861
794.7F13082733o07872k051849k181549k303772l397408j75323j424980j71853k775230
$$ plain form
734.9 515506783 551947479 580496635 604494514 623370972 638279114 649859467 656372910 662303238
742.6 662303238 663983459 666256943 666969223 668336792 669632111 669100113 670621719 668641663 667594910
751.3 667594910 665457001 664673309 663961716 662804260 662636566 659039154 657788544 654891815 652842102
760 652842102 651151047 650780640 650905762 647859268 647920609 646110611 645126114 643229523 641853027
768.6 641853027 641208038 639173012 640124588 638459091 637282295 634939384 633332367 632144928 631321793
777.3 631321793 632141228 630108795 630380211 628196602 626515541 624193420 622478104 623816833 621861496
786 621861496 621642647 620283546 620160408 618386383 616385040 615627670 613316574 614377594 613082733
794.7 613082733 612474861 610423012 608241463 605937691 602540283 602364960 600939980 600768127 597992897
803.4E97992897j275024j608506l241043j610756l353843j93940k532691j764069k794762
812E79618263l791160k091446l520661j610069l927994o83975j574020l564225l258552
820.7E55596161l895035r97848l337670j295013k570877k226982j736603l420181j807785
829.4E34308167m499360k051811k494469k314529k242928k884101k769471n342712
837.1E09708786k704239l591385k836494l305130l841171l920136n262337m170875
844.8D80077019p402802p240715q145561n045776m031105q433495j2510223j2446404
852.5D14820938P775192J4110566L4484p753524q502350p110062r069862r080506r745788
861.2C85479088r517365r595337r989585j0589409j2006913j2246666j4644050j4765511
$$ plain form
803.4 597992897 596717873 595109367 591868324 590257568 586903725 586709785 584177094 582413025 579618263
812 579618263 575827103 573735657 570214996 568604927 564676933 563992958 562418938 558854713 555596161
820.7 555596161 551701126 550703278 547365608 546070595 543499718 541272736 539536133 536115952 534308167
829.4 534308167 529808807 527756996 525262527 522947998 520705070 517820969 515051498 509708786
837.1 509708786 507004547 503413162 500576668 497271538 493430367 489510231 484247894 480077019
844.8 480077019 472674217 465433502 457287941 452242165 448211060 439777565 427267342 414820938
852.5 414820938 422596130 436706696 436741180 428987656 420485306 413375244 404305382 395224876 385479088
861.2 385479088 375961723 366366386 356376801 345787392 333780479 321533813 306889763 292124252
868.9B92124252j7154102k0089245k0303020j9290333j6466675j3824615j0748959
875.7A74247303q460655p225390n377044l156500j609259M6044M126119J0768318J7140675
884.4A80499611K1762543K3871803K3376102K1536618K0566406J7371120J6051388
891.1C25035591J4469605J2011184J0858803Q814049P506103N135460N192337L641205
898.8C92664337L577385L193169J520500K789192K166672K250214K33116M13208N35202
907.5D09342995M22439Q09784q1939J859588L03764R94225J61209j021423l58772j254006
917.2D11177864Q31146q6746L42713m92516j445046j109390j468391m81415j686325
925.8D05581894q17947j829987j436577j235084k651520k342453k926941j180077k334938
$$ plain form
868.9 292124252 274970150 254880905 234577885 215287552 198820877 184996262 174247303
875.7 174247303 165786648 158561258 153184214 150027714 148418455 148464499 152590618 163358936 180499611
884.4 180499611 202262154 226133957 249510059 271046677 291613083 308984203 325035591
891.1 325035591 339505196 351516380 362375183 371189232 378695335 383830795 389023132 392664337
898.8 392664337 396241722 399434891 400955391 403744583 405911255 408161469 408394585 408807793 409342995
907.5 409342995 409765434 410575218 410493279 412352867 412656631 413650856 413812065 412790642 412431870 411177864
917.2 411177864 412009010 411922264 412264977 411772461 410327415 409218025 407749634 407268219 405581894
925.8 405581894 404763947 402933960 401497383 400262299 397610779 395268326 392341385 391161308 388826370
934.5C88826370k310829k329063l695565l852424l902207k502823l914871l412246
942.2C62906342l809395m218560l333854l776741l781548m853515l751946l766861
949.9C31613922l010788k556343k774773k394714l324070j711082k003918j444454
957.7C12393780j271687j472359p13806k368850j625328j158371l72734r00155j282310
966.3C01228180m87366r59377k67506j299820j146469j996479k236633r87072j606121
975B90241337j703930j871567j197967k600289k497310j618481j796990j121521j953296
983.7B73879986k168789k958260j919651j875839k615166j451378j948337j943798
991.4B56998768j876106j290055j729698j463852j068764j536636j132317k619819
$$ plain form
934.5 388826370 386515541 384186478 380490913 376638489 372736282 370233459 366318588 362906342
942.2 362906342 359096947 354878387 351544533 347767792 343986244 339132729 335380783 331613922
949.9 331613922 328603134 326046791 323272018 320877304 317553234 315842152 313838234 312393780
957.7 312393780 311122093 309649734 308935928 306567078 304941750 303783379 303410645 302510490 301228180
966.3 301228180 300740814 299781437 299513931 298214111 297067642 295071163 292834530 291847458 290241337
975 290241337 288537407 286665840 285467873 282867584 280370274 278751793 276954803 275833282 273879986
983.7 273879986 271711197 268752937 266833286 264957447 262342281 260890903 258942566 256998768
991.4 256998768 255122662 253832607 252102909 250639057 249570293 248033657 246901340 244281521
999.1B44281521j601029n23529n94597j220531k380047j317138r15185n80196j664791
1007.8B33484478j610622o39706p15542l27263j110649j272125q47759O50348O57921
1016.5B28269081P13959J796017J309299J926250K009507K985744L074284K837257
1024.2B44921398L285256K978477L718739K631855K355480K265472K643509J840744
1031.9B66640930J159744K956391J820106J575165J353569J547108R25693M53053R54876
1040.6B79386635j01929R38225O61507J424293P90825J92528J478367J794071L044109
1049.3B89608631J402283J668568K012596K496490K719364K208824L222084K208405
1057C07547245L074608R89456J043873K002602J284999K055016N82066J766395J267014
$$ plain form
999.1 244281521 242680492 242156963 241562366 240341835 237961788 236644650 235729465 235149269 233484478
1007.8 233484478 231873856 231234150 230518608 230191345 229080696 227808571 226960812 227611160 228269081
1016.5 228269081 228983040 230779057 232088356 234014606 236024113 239009857 242084141 244921398
1024.2 244921398 248206654 251185131 254903870 257535725 259891205 262156677 264800186 266640930
1031.9 266640930 267800674 270757065 272577171 274152336 275505905 277053013 277978706 278431759 279386635
1040.6 279386635 279284706 280222931 280884438 282308731 283099556 283292084 284770451 286564522 289608631
1049.3 289608631 291010914 292679482 294692078 297188568 299907932 302116756 305338840 307547245
1057 307547245 310621853 311611309 312655182 314657784 315942783 317997799 318579865 320346260 321613274
1065.7C21613274J922378J545677J146202J787873J77154J579285O16188J482964P04574
1074.4C32575569M84505J366539M75349J613655L36190J649780k03095n52330L87764
1083C38133926J40496J353264m06685J315345L35770R70459P98187l09181J269913
1091.7C43601494J34544J889000Q06770R73473J18103o78406M3412k90337K164459
1100.4C48762512J189537K323990J315346J503982K501450O40106R35631p61223J028671
1109.1C59440002P06444Q58460M22134n7297J242447p19948M68865n93071R46998P74994
1118.7C63490028m46243M45595q43201J154556L25966O84967k92091p6294K68364j022530
1128.4C63689117R74274m43077O16341l0556K87704L0251q71353Q25500j088829M42620
$$ plain form
1065.7 321613274 323535652 325081329 326227531 328015404 328192558 329771843 330388031 331870995 332575569
1074.4 332575569 333060074 334426613 334901962 336515617 336851807 338501587 338298492 337746162 338133926
1083 338133926 338274422 339627686 339221001 340536346 340872116 341842575 342640762 342331581 343601494
1091.7 343601494 343736038 345625038 346431808 347405281 347523384 346844978 346888390 346598053 348762512
1100.4 348762512 349952049 352276039 353591385 355095367 357596817 358236923 359172554 358411331 359440002
1109.1 359440002 360146446 361004906 361427040 361369743 362612190 361892242 362361107 361768036 362715034 363490028
1118.7 363490028 363043785 363489380 362646179 363800735 364126701 364811668 364519577 364443283 364711647 363689117
1128.4 363689117 364663391 364220314 364836655 364806099 365093803 365124054 364252701 365078201 363989372 364431992
1138C64431992l17421n4779k9793l91274L11775j424179J34163j124496P4234j62621
1147.6C61447601k59895Q35457r42612K06833q25005N82123p13348p70264K22588j281204
1157.3C58502274L280j459999j74370n21965n1269k92511j181565O50750r43375j91307
1166.9C54339943j351814o73447l95355p80068K18659p12586M89922j143952m09584
1175.6C49581718o62956n87425k43073j335487O49033p22428J70555r12742j230011
1184.3C44707184n531n47677L43323j071358l43513j103325l85055l56064p56150L34053
1193.9C40815887r89532K95753l48358K90299o28739j163292j50985r94797j57433
1202.6C36968803j468467J08490m68788p15523l99971j572685k98653j623154j50986
$$ plain form
1138 364431992 364114571 364059792 364029999 363638725 363950500 362526321 362660484 361535988 361610222 361447601
1147.6 361447601 361187706 362023163 361080551 361287384 360462379 361044502 360331154 359560890 359783478 358502274
1157.3 358502274 358505554 357045555 356871185 356349220 356297951 356005440 354823875 355474625 354531250 354339943
1166.9 354339943 352988129 352314682 351919327 351139259 351357918 350645332 351135254 349991302 349581718
1175.6 349581718 348918762 348331337 348088264 346752777 347401810 346679382 346849937 345937195 344707184
1184.3 344707184 344701653 344153976 344497299 343425941 343082428 341979103 341594048 341237984 340481834 340815887
1193.9 340815887 339826355 340122108 339773750 340064049 339435310 338272018 338121033 337126236 336968803
1202.6 336968803 335500336 335608826 335140038 334424515 334024544 332451859 332153206 330530052 330379066
1211.3C30379066n29212n25742n83878j817474n90096j183395J221j060753p38525
1220C23351212n90897q74252m75960j974564n52330j285915n78747p57732r51100j16272
1229.6C15193443p65419J12992j257573n79128r37309n18456l59745j432037k27585
1238.3C09229183j277675n37968r22680l07522m62112j382714m44812j080666m52614
1247C02360420j729679p19356m99325q42629j41735j121158o81057j949463j058979
1255.7B93617039j070538o65741m47674j298980j25599j346741o95229j460247r47742
1264.3B85558548o54488j343345m34666j543484m20875j499424j247406p28321q05016
1273B76881523k40707j491661m92421j635856j480122j542759j355324p59925j530800
$$ plain form
1211.3 330379066 329849854 329324112 328740234 326922760 326332664 325149269 325150490 324089737 323351212
1220 323351212 322760315 321886063 321410103 319435539 318883209 317597294 317018547 316260815 315309715 315193443
1229.6 315193443 314428024 314541016 313283443 312704315 311767006 311248550 310888805 309456768 309229183
1238.3 309229183 307951508 307413540 306490860 306183338 305721226 304338512 303893700 302813034 302360420
1247 302360420 300630741 299911385 299412060 298569431 298427696 297306538 296625481 294676018 293617039
1255.7 293617039 292546501 291880760 291433086 290134106 290008507 288661766 287966537 286506290 285558548
1264.3 285558548 284904060 283560715 283126049 281582565 281161690 279662266 278414860 277686539 276881523
1273 276881523 276640816 275149155 274656734 273020878 271540756 269997997 268642673 267882748 266351948
1281.7B66351948k23141j145687r31530j520996j351147j082611j329765p2613j527996
1290.4B57166462j147003j643811j091880q24795j184864n48821j485939n34267j354351
1299B47350731q58097j208363j320171n77431j778908p66716j431675r74025j356926
1307.7B37078419j126404q05607j917248j116447j709213q62790j647758r00135p38182
1316.4B26254635j661110n94921k053833j012001j340695j245327j076622j321830
1324.1B15948296j162816j974525q01582j754589r91764j340867j893062r47628j417446
1332.8B03664017q58727j889381j096955j651325j281013o79093k315979j177864j655559
1341.5A91058121q27809j405906j176434j255283j954689j137009j904411j134339
$$ plain form
1281.7 266351948 266128807 264983120 264051590 262530594 261179447 260096836 258767071 258694458 257166462
1290.4 257166462 256019459 254375648 253283768 252458973 251274109 250725288 249239349 248705082 247350731
1299 247350731 246492634 245284271 243964100 243386669 241607761 240841045 239409370 238435345 237078419
1307.7 237078419 235952015 235146408 233229160 232112713 230403500 229540710 227892952 226992817 226254635
1316.4 226254635 224593525 223998604 221944771 220932770 219592075 218346748 217270126 215948296
1324.1 215948296 214785480 212810955 212009373 210254784 209263020 207922153 206029091 205081463 203664017
1332.8 203664017 202805290 200915909 199818954 198167629 196886616 196207523 193891544 192713680 191058121
1341.5 191058121 190230312 188824406 187647972 186392689 184438000 183300991 181396580 180262241
1349.2A80262241j957988j327362j377793k099438j124248j691818j520939k374096
1356.9A66788559j553803j548290j240597j105480k249717j108513k701073j332846
1364.6A53948240j629228j777611j108074j915236j409254k060575j390658j764440
1372.3A40893164j527701j944456k564421j190967k033091j391344j814747j628522
1380.1A26797915j877337k011986j619882k502671j454467j693554j731921k451753
1387.8A11454344j850567j298122k171174j775550k082825j227942k296333k715473
1395.5I6036358j242447j813116j595163k719841j452160j592961k169704j790304
1403.2H1660662j303282j502366k409573j182656j656451j250086j083293j722384
$$ plain form
1349.2 180262241 178304253 176976891 175599098 173499660 172375412 170683594 169162655 166788559
1356.9 166788559 165234756 163686466 162445869 161340389 159090672 157982159 155281086 153948240
1364.6 153948240 152319012 150541401 149433327 147518091 146108837 144048262 142657604 140893164
1372.3 140893164 139365463 137421007 134856586 133665619 131632528 130241184 128426437 126797915
1380.1 126797915 124920578 122908592 121288710 118786039 117331572 115638018 113906097 111454344
1387.8 111454344 109603777 108305655 106134481 104358931 102276106 101048164 98751831 96036358
1395.5 96036358 94793911 92980795 91385632 88665791 87213631 85620670 83450966 81660662
1403.2 81660662 80357380 78855014 76445441 75262785 73606334 72356248 71272955 69550571
1410.9F9550571j113948j734572j337476j794872j752238j214938j329866m88391l063888
1419.6E5720382j742668r39808j513477j453046j764274q34594r88011j008659j001005
1428.3D4474840j092048q21299p43899m6621n36246n54080l34249k13337P52316k91438
1437.9D0593939R2759j45755N02548O97132K91924L58353j43524J42742J32341Q48870
1447.6D3371329J28856L38888J022930L61910Q82549J86434N83158M09794N03254J349077
1457.2D9138179K72560K265134K28524P83529O38871N59950P14560P74403J794734
1465.9E7170444L22089R59167M53878Q05092R81073O39858J613612l00622J659966
1474.6F4304557N12171Q98733O55331O08077J293154O26188J350269M33898J089859
$$ plain form
1410.9 69550571 68436623 66702051 65364575 63569703 61817465 60602527 59272661 58784270 55720382
1419.6 55720382 53977714 53037906 51524429 50071383 48307109 47472515 46484504 45475845 44474840
1428.3 44474840 43382792 42561493 41817594 41770973 41234727 40680647 40346398 40133061 40885377 40593939
1437.9 40593939 40686698 40540943 41043491 41740623 42032547 42390900 42247376 42390118 42522459 43371329
1447.6 43371329 43500185 43839073 44862003 45223913 46106462 46292896 46876054 47285848 47789102 49138179
1457.2 49138179 49410739 51675873 51904397 52687926 53326797 53886747 54601307 55375710 57170444
1465.9 57170444 57492533 58451700 58905578 59710670 60691743 61331601 62945213 62644591 64304557
1474.6 64304557 64816728 65715461 66370792 66978869 68272023 68898211 70248480 70682378 71772237
1483.2G1772237N57775P73993J357422M63390K348723N20745J356315K60950J086258
1491.9H0497808J614180R88417J944628M51803K185917J123113J717472J752825R83963
1500.6I3260126K332831J259002K418108J683636L223104L976269J062184K904319
1508.3A12119579N09138L159275P00846L163309K354164J885500K790919J279373M788532
1517A32750635K71301K480021J712980L357458M447661j0252L518123J112900L811989
1525.7A53452816J342211K637539K711305R40533K605839J591587L781242J426335
1533.4A70489407K660122J810646J860923L093319Q81329N718918j889229M139442
1541.1A88764877J823044K300816K971916N21564L657513J196308K887478J915417
$$ plain form
1483.2 71772237 72330012 73104005 74461427 74924817 77273540 77794285 79150600 79411550 80497808
1491.9 80497808 82111988 83100405 85045033 85496836 87682753 88805866 90523338 92276163 93260126
1500.6 93260126 95592957 96851959 99270067 100953703 104176807 108153076 109215260 112119579
1508.3 112119579 112628717 115787992 116488838 119652147 122006311 123891811 126682730 127962103 132750635
1517 132750635 133021936 135501957 137214937 140572395 145020056 145009804 148527927 149640827 153452816
1525.7 153452816 154795027 157432566 160143871 161084404 163690243 165281830 169063072 170489407
1533.4 170489407 173149529 174960175 176821098 179914417 180795746 186514664 184625435 188764877
1541.1 188764877 190587921 192888737 195860653 196382217 200039730 201236038 204123516 206038933
1548.8B06038933K552585K348595J215210K949772J313553M123268Q97941K984124
1556.5B24423981K669067j224995J3530465q569966L906880J377620K615109K109833
1564.2B40837994J699810K940044J340618L229332J892948L417263R66015J846581
1572B58170605K184601J404075L555317J226254J608581Q33550K156753J252728R39674
1580.6B73332138K282600O63300J874371O34937J239586J080436J084042J305618J66397
1589.3B83663425J820202N72338J216145O29444R69162R50604J91726J415501j57280
1598B91271267J026764L34473O01882P65686M87347J101246k27909J403274L05920
1606.7B97069950L55282N34477K98863R36355M68312J126823m79775P42531J488476
$$ plain form
1548.8 206038933 208591518 210940113 212155323 215105095 216418648 220541916 221439857 224423981
1556.5 224423981 227093048 225868053 239398518 230828552 234735432 236113052 238728161 240837994
1564.2 240837994 242537804 245477848 246818466 250047798 251940746 255358009 256324024 258170605
1572 258170605 260355206 261759281 265314598 266540852 268149433 268982983 271139736 272392464 273332138
1580.6 273332138 275614738 276278038 278152409 278787346 280026932 281107368 282191410 283497028 283663425
1589.3 283663425 285483627 286055965 287272110 287901554 288870716 289821320 290013046 291428547 291271267
1598 291271267 292298031 292632504 293234386 294000072 294487419 295588665 295360756 296764030 297069950
1606.7 297069950 297425232 297959709 298258572 299194927 299663239 300790062 300310287 301052818 302541294
1615.4C02541294J305122j470241p9556J875019J83182R02901Q16860J154156p33853
1624C06494884J60847J589565K14444Q08563r38587P87391O48671O01139J313667P43217
1633.7C12423801L604851l75576J127014J580506K71244J809597P99446J864128J197853
1642.4C24302864J665726J638145J863098J960373n31196J753235J148262L216514
1650.1C37017021K300987L314248O943931n968399J957359L41645K448501J044922
1657.8C49400215J703148J533203J088257K586479Q58498J946296J096993K009315
1665.5C62222404J210251J640091L053208r97353J969338J227035J513825J090545
1673.2C72929344K657509K865295j892967K197647R87892K114754J600876J021423
$$ plain form
1615.4 302541294 303846416 302376175 302296619 304171638 304354820 305257721 306074581 307228737 306494884
1624 306494884 306655731 308245296 308459740 309268303 308329716 309117107 309765778 310366917 311680584 312423801
1633.7 312423801 316028652 315653076 316780090 318360596 318631840 320441437 321240883 323105011 324302864
1642.4 324302864 325968590 327606735 329469833 331430206 330899010 332652245 333800507 337017021
1650.1 337017021 339318008 342632256 349576187 343607788 345565147 345906792 348355293 349400215
1657.8 349400215 351103363 352636566 353724823 356311302 357169800 359116096 360213089 362222404
1665.5 362222404 363432655 365072746 368125954 367128601 369097939 370324974 371838799 372929344
1673.2 372929344 375586853 378452148 376559181 378756828 379744720 381859474 383460350 384481773
1680.9C84481773K067261K309456K515793o494446M933624K118759K264786J018105
1688.6C95215111Q31451J180115O65245K389565N56411K865105K580872l098336J776772
1697.3D04962311J594810M227906j968079j244736K969780K564469J783981R1972K031746
1706D17014160j6937J803436J067200J034393N57137P86133K438011J629219J800918
1714.7D28113670p81173K867050K129288l761445J476250J669006K287713Q91189J404762
1723.4D36296310l6392O40030J138611L12805J722412J581116J918526p07589J926384
1732D44792213K749711j179009j441002J137962L277779R83696K523499J302948k240105
1740.7D51907692J741333J285896J481552J40725K302894R45625R05228J486664j144981
$$ plain form
1680.9 384481773 386549034 388858490 391374283 384879837 389813461 391932220 394197006 395215111
1688.6 395215111 396046562 397226677 397891922 400281487 400837898 403703003 406283875 403185539 404962311
1697.3 404962311 406557121 410785027 408816948 407572212 410541992 413106461 414890442 414982414 417014160
1706 417014160 416997223 418800659 419867859 420902252 421459389 422245522 424683533 426312752 428113670
1714.7 428113670 427332497 430199547 432328835 428567390 430043640 431712646 434000359 434891548 436296310
1723.4 436296310 436259918 436899948 438038559 438351364 440073776 441654892 443573418 442865829 444792213
1732 444792213 447541924 446362915 444921913 446059875 449337654 450321350 452844849 454147797 451907692
1740.7 451907692 453649025 454934921 456416473 456557198 458860092 459805717 460710945 462197609 461052628
1749.4D61052628K743835M33235Q76122J228866R80721J314316J244049P29828n01061
1758.1D70102539J966400J243973K278290P9460r97391K165489P31392J501694J084785
1766.8D80156631J726189r01260J044731L236122O98319J650886k468185J912803J619988
1775.4D88676224K12326J174202K18429J919976O40030N01556N18036J254844J111718
1784.1D96227341l39089J50299M2763Q77037p19604K10876j121445j688385j497688
1792.8D92142105k816543J851692j69411r57489k75116P11136L51906j060448K137680
1801.5D91915512Q77P36275O52504j25084j86805q93250p14340j668167n00870k576675
1811.1D86639977j715775j430512j538085l56408j475601K40784r54819j79138k70500
$$ plain form
1749.4 461052628 463796463 464229698 465105820 466334686 467315407 468629723 469873772 470603600 470102539
1758.1 470102539 472068939 473312912 475591202 475670662 474673271 476838760 477570152 479071846 480156631
1766.8 480156631 481882820 480981560 482026291 485262413 485960732 487611618 485143433 487056236 488676224
1775.4 488676224 488888550 490062752 490281181 492201157 492841187 493342743 493860779 495115623 496227341
1784.1 496227341 495888252 496038551 496081314 496958351 496238747 496449623 495328178 493639793 492142105
1792.8 492142105 489325562 491177254 491007843 490050354 489775238 490486374 490838280 489777832 491915512
1801.5 491915512 491916389 492652664 493305168 493180084 492993279 492100029 491385689 489717522 489216652 486639977
1811.1 486639977 484924202 483493690 481955605 481599197 480123596 480364380 479409561 479230423 478959923
1819.8D78959923r18083M13322m91028J380768J292305J081009J546097K543373L077507
1828.5D88885193K642860K513733K068405L955422K631454L208657L291168K612839
1836.2E11809731K639389J128501L047410J961174K487144K305107K508888L184967
1843.9E31072311k363739K259827K232704K059822J351281J364707K199593O95458
1851.6E40871964J254310L89710J508178J378060J584243J856003O31600J262512K28195
1860.3E50964775J268578Q25843J461564J612663J304016K175217L0975J654854N874
1869E61304359m56123J583519J632881J744957Q16040J487198P8583P48901Q13599
1877.7E69753914J005325J792183N61371J214447N11703J157609L72238M80117J224213
$$ plain form
1819.8 478959923 478041840 478455162 477964134 479344902 480637207 481718216 483264313 485807686 488885193
1828.5 488885193 491528053 494041786 496110191 500065613 502697067 505905724 509196892 511809731
1836.2 511809731 514449120 515577621 518625031 520586205 523073349 525378456 527887344 531072311
1843.9 531072311 528708572 530968399 533201103 535260925 536612206 537976913 540176506 540871964
1851.6 540871964 542126274 542515984 544024162 545402222 546986465 548842468 549474068 550736580 550964775
1860.3 550964775 552233353 553059196 554520760 556133423 557437439 559612656 559643631 561298485 561304359
1869 561304359 560848236 562431755 564064636 565809593 566625633 568112831 568191414 568940315 569753914
1877.7 569753914 570759239 572551422 573112793 574327240 574838943 575996552 576368790 576848907 578073120
1886.3E78073120Q50372K255059P58323n0735N27687J363716O46210Q34541J411095
1895E86669388K441J962891J052589O59752N50537N34172J178322N91889J444320N60265
1904.7E95206566J215553J121674J123123Q69141J3198P97081L84980J735801P63359
1913.3F03230476J184311Q31871K49520K228813m93355L13530J304970J644020J918907
1922F12413063q9989m84962O56853J679954Q05016J490287P48940K87743N84793L76243
1931.7F18467941J150055K77443J509857J055336J014138R05342M15687J126023k12479
1940.3F25709343J668510Q80738l26348J482201J256943P20863j52397O87790M59099
1949F32386742J137123Q97255P89528J195983N61333J013222p0229O88553P12509R74465
$$ plain form
1886.3 578073120 578923492 581178551 581936874 581886139 582413826 583777542 584423752 585258293 586669388
1895 586669388 586671829 588634720 589687309 590347061 590897598 591431770 592610092 593201981 594646301 595206566
1904.7 595206566 596422119 597543793 598666916 599536057 599549255 600346336 600731316 602467117 603230476
1913.3 603230476 604414787 605246658 605496178 607724991 607231636 607545166 608850136 610494156 612413063
1922 612413063 612323074 611838112 612494965 614174919 614979935 616470222 617219162 617506905 618091698 618467941
1931.7 618467941 619617996 619895439 621405296 622460632 623474770 624380112 624795799 625921822 625709343
1940.3 625709343 627377853 628258591 627932243 629414444 630671387 631392250 631239853 631927643 632386742
1949 632386742 633523865 634421120 635210648 636406631 636967964 637981186 637910957 638599510 639312019 640286484
1958.7F40286484J036911N01861J389313K77634P41119J35880N71518J469268P13883
1967.3F47123871P37305K99682O63376j92413N21927M56848N26123J157303M54330
1976F51748352J087570K85645R78164N95627P03583J227799N92575J312027L66973
1984.7F58898315R00040L43247O08520R01642K29797J659546J242294N66941k67258
1993.4F65083084O53992L66287K82669J144714O61164J356888N29098J048050K72141
2002.1F71398087p7363O23398J96915J371155P81555J120453P59048N21088K29416
2010.7F76923752L3645J070710K23312R45816J105576J248016J27487J61286P77587
2019.4F82617187j81274J467896Q05587R99909N45273j21308L95890p8278J038132
$$ plain form
1958.7 640286484 641323395 641825256 643214569 643492203 644233322 644369202 644940720 646409988 647123871
1967.3 647123871 647861176 648160858 648824234 648631821 649153748 649610596 650136719 651294022 651748352
1976 651748352 652835922 653121567 654099731 654695358 655398941 656626740 657219315 658531342 658898315
1984.7 658898315 659798355 660141602 660750122 661651764 661881561 663541107 664783401 665350342 665083084
1993.4 665083084 665737076 666103363 666386032 667530746 668191910 669548798 670077896 671125946 671398087
2002.1 671398087 671320724 671944122 672141037 673512192 674293747 675414200 676173248 676694336 676923752
2010.7 676923752 676957397 678028107 678251419 679197235 680302811 681550827 681678314 681839600 682617187
2019.4 682617187 682435913 683903809 684709396 685709305 686254578 686133270 686529160 686450882 687489014
2028.1F87489014N08041J194763Q91037P29294R03168m6997M65393m2954R67636P77054
2037.7F93835449P66449P49436M66461K46124o07376J121216N07965J020508J153793
2046.4F99260025P12509R89151J8006N68389l04870P33185P03811Q46939J308899j07803
2056.1G04728241O53152k1133N44815O29730Q89206P65763J06887J046601J66015N36347
2065.7G10045624K746O64215Q99048M89655J062927J57166P49435J08566L42255q9035
2075.4G14432602K98233J279297O68487J431961J5030K70386j2741M6692Q24509M60510
2085G19714966J242828M10614Q62961O8436J8310M63715M17175J142426K36663Q22373
2094.6G25400467L56369N57175J28631J1826O59179L66669J413422K76718O43921R3002
$$ plain form
2028.1 687489014 687997055 689191818 690082855 690812149 691715317 691668320 692133713 692090759 693058395 693835449
2037.7 693835449 694601898 695351334 695817795 696063919 695456543 696577759 697085724 698106232 699260025
2046.4 699260025 699972534 700961685 700979691 701548080 701243210 701976395 702680206 703527145 704836044 704728241
2056.1 704728241 705381393 705360260 705905075 706534805 707424011 708189774 708296661 709343262 709509277 710045624
2065.7 710045624 710048370 710712585 711611633 712101288 713164215 713321381 714070816 714179382 714521637 714432602
2075.4 714432602 714730835 716010132 716678619 718110580 718125610 718395996 718383255 718429947 719254456 719714966
2085 719714966 720957794 721368408 722231369 722299805 722318115 722781830 723199005 724341431 724578094 725400467
2094.6 725400467 725756836 726314011 726442642 726454468 727113647 727480316 728893738 729170456 729814377 729907379
2104.3G29907379j27487L41186j3809J204834K34909J117554O75354K5024L19367K26135
2113.9G33910446O40946n42832R90753R20411M90417R2239j73263O89621j67618K58026
2123.6G37109146j13830R59396P18918R537J50909k81754Q13752o6834P01294K75574
2133.2G40276108k2888J39312m72870O34079l26843L43628P9346K54288M14123k19726
2142.9G41098557M31213o63071j16806m35257K41089N89371N1422L25088k98004M42658
2152.5G41666260l30429j86539j19171N36880R37043J68151N38178l85666N14069N1651
2162.1G43390427L75290N78689k5787O72378k91061R44595K58484L8910J26419J3657
2171.8G46082001J226577L36457Q94470L60794O25305J83487j76773N86166L13263
$$ plain form
2104.3 729907379 729779892 730121078 730107269 731312103 731547012 732664566 733339920 733364944 733684311 733910446
2113.9 733910446 734551392 734008560 734999313 735919724 736410141 736502380 736329117 737018738 736851120 737109146
2123.6 737109146 736995316 737954712 738673630 738683167 738834076 738552322 739366074 739299240 740000534 740276108
2133.2 740276108 740253220 740392532 739919662 740553741 740226898 740570526 740649872 740904160 741318283 741098557
2142.9 741098557 741529770 740866699 740749893 740314636 740555725 741145096 741196518 741521606 741223602 741666260
2152.5 741666260 741335831 741149292 741030121 741567001 742504044 742672195 743210373 742824707 743338776 743390427
2162.1 743390427 743765717 744344406 744318619 744990997 744699936 745644531 745903015 745941925 746068344 746082001
2171.8 746082001 747308578 747645035 748539505 748900299 749525604 749709091 749532318 750118484 750431747
2180.5G50431747J425629K49710M88587M36706R1248L52859K57721J295014L09372
2189.1G55338593O48040n4779M0970M71878k1210O96335K42386R44672J09176K50702
2198.8G58666763N47943M63334L35769m19311Q72039m5166N29023N31006K29949K00196
2208.4G61911545o99692P76978K94189O91757M03366K34452L48434P3319M49295o76041
2218.1G63807602N80444K55814P71026R04160l3722O50787j67694L75290l32489N81360
2227.7G67392578Q45032J65710K55127n16586N98831o60934n5695L62473K5940M87136
2237.4G68899612L9978Q40073m72870m5166j96609l16391O28128M03290M79660n74723
2247G69684982m7531l84445M27628N01174n03234K37350J80130R54132j10245n4321
$$ plain form
2180.5 750431747 751857376 752107086 752595673 753032379 753123627 753476486 753734207 755029221 755338593
2189.1 755338593 755986633 755931854 755972824 756444702 756423492 757119827 757362213 758306885 758416061 758666763
2198.8 758666763 759214706 759678040 760013809 759594498 760466537 760421371 760950394 761481400 761711349 761911545
2208.4 761911545 761211853 761988831 762283020 762974777 763378143 763612595 763961029 764034348 764483643 763807602
2218.1 763807602 764388046 764643860 765414886 766319046 766285324 766936111 766768417 767143707 766811218 767392578
2227.7 767392578 768237610 768403320 768658447 768141861 768740692 768079758 768024063 768386536 768412476 768899612
2237.4 768899612 768939590 769779663 769306793 769261627 769065018 768748627 769376755 769780045 770259705 769684982
2247 769684982 769637451 769253006 769680634 770181808 769678574 769915924 770096054 771050186 770939941 770885620
2256.7G70885620j82495k02179N13840J38702J085816R8037L05405j92184k89383M02908
2266.3G72564087N1269Q48237N4397O83289P5988l27453L7613K4643N64956q3618Q30078
2276.9G75323486M1809J76850M35638K899P9651m66919N90439O5537O33850K61917
2286.5G77145157j8234L69949o60935J71814J47019Q95920J71737R0790K92053n61905
2296.2G78043365k16598p52487P03735P8430N13840P60956m68064k79006j073380K94418
2305.8G77605209m89883L76434O53687k94190N36118j192780l57895m25109L81317
2314.5G76792908P38907L38134K73514n22766L35007j264420j42288k97318M84314
2323.2G76735992R60007k89230M10843k115250P7286l7232L61176N69992k59476R32694
$$ plain form
2256.7 770885620 770703125 770500946 771014786 771153488 772239304 772337341 772642746 772450562 772161179 772564087
2266.3 772564087 772615356 773463593 773517990 774201279 774277267 773949814 773987427 774012070 774577026 774493408 775323486
2276.9 775323486 775365295 775542145 775977783 775980682 776060333 775593414 776183853 776249390 776883240 777145157
2286.5 777145157 777126923 777496872 776835937 777007751 777154770 778050690 778222427 778313217 778605270 778043365
2296.2 778043365 777826767 777074280 777778015 777856445 778370285 779131241 778663177 778384171 777310791 777605209
2305.8 777605209 777115326 777491760 778145447 777851257 778387375 777194595 776836700 776411591 776792908
2314.5 776792908 777531815 777869949 778143463 777620697 777955704 776691284 776548996 776251678 776735992
2323.2 776735992 777695999 777406769 777817612 775702362 775779648 775742416 776103592 776673584 776414108 777346802
2332.8G77346802j795502M05960r7961j17951j81198R85489K273636j231918P4386
2341.5G77661743r37271O53763p80792j344605J138382j30234Q22144J063843J666946
2350.2G79813919n13000r76181J38397j00174j03455j799927J730347j773224k289123
2358.9G74127579q64945J407929K104339k173385J565246l95736K425232J414871j749573
2367.6G77861557o28357q89435J612778L53012Q46329K89993M3411n39322o23016R98917
2377.2G79325867j374M20914L53317P57294J1444m18243j19705n66483M49371q6441
2386.8G80125961M40750K85492K1363J52282m41970K09732o13404j80206l29819J33362
2396.5G79803543Q08868k25982p0725m78286N3024m3411J12152p2708l44315Q8196
$$ plain form
2332.8 777346802 775551300 775957260 775859299 775741348 775560150 776545639 778819275 777587357 777661743
2341.5 777661743 776724472 777378235 776597443 775252838 776391220 776260986 777083130 778146973 779813919
2350.2 779813919 779300919 778324738 778463135 778362961 778259506 776459579 778189926 776416702 774127579
2358.9 774127579 773262634 774670563 776774902 774601517 776166763 775771027 778196259 779611130 777861557
2367.6 777861557 777233200 776343765 777956543 778309555 779155884 779445877 779489288 778949966 778326950 779325867
2377.2 779325867 779324493 779745407 780098724 780856018 780867462 780449219 780329514 779763031 780212402 780125961
2386.8 780125961 780566711 780852203 780873566 781025848 780583878 780793610 780180206 780000000 779670181 779803543
2396.5 779803543 780612411 780386429 780315704 779837418 779890442 779847031 779959183 779886475 779542160 779630356
2406.1G79630356n40848p7667m06342K13623n4092l51563N84107J57776q0261r11255
2415.8G78163834k55967O5918N49241M44488j17722M00773p00760l74222m10767j1368
2425.4G77753448j08032k93655N69610k0599J67160q27789k25449j73416m38309P04804
2435.1G77107773o2561j89896l20892N09872n69763r23157p7819n20020N47104k42310
2444.7G75258331j65481l53928n42297j58844k55890L23791l43628L57361k90298r42841
2454.3G72886276p25860m56467k899p01370O3400j48468K9144o84585j114350m43649
2464G68701172r74045O2637r1400k26440p98874p35626n28183j207428m69895q87680
2473.6G62844238k19269n88455q72421o66885j598587j387024j598816j053162r32312
$$ plain form
2406.1 779630356 779089508 779011841 778605499 778819122 778765030 778413467 778997574 779155350 779075089 778163834
2415.8 778163834 777907867 777973785 778523026 778967514 778849792 779250565 778549805 778175583 777764816 777753448
2425.4 777753448 777645416 777351761 777921371 777900772 778067932 777240143 777014694 776841278 776402969 777107773
2435.1 777107773 777045212 776855316 776534424 777044296 776474533 775551376 775473557 774953537 775500641 775258331
2444.7 775258331 775092850 774738922 774196625 774037781 773781891 774105682 773762054 774119415 773829117 772886276
2454.3 772886276 772160416 771703949 771701050 770999680 771063080 770914612 770943756 770259171 769144821 768701172
2464 768701172 767727127 767789764 767698364 767471924 766673050 765937424 765409241 764201813 763731918 762844238
2473.6 762844238 762624969 762036514 761164093 760497208 758898621 757511597 755912781 754859619 753927307
2482.3G53927307q43048j101761j165848j830215k745361j408539j884842j767883
2490G41179810j880188j977387k073669l174210k688980l023605k407532k731629k901077
2498.7G18321533k888946l755799l476181m203872l785859l985061l900681l827591
2506.4F88497543m251861m162750n441590n529938n734939n483399o077728o277466
2514.1F45537872n254821n632287n165405m897461l423118k495308j803818p59735
2521.9F16105919n82390M69170L13644N97839O08216J130943J419640R84802J765480
2530.5F22813263J385536J347771P46879J200447J468850J185684K346496J864777
2538.2F34359703J455727J186866J504441J247787J105614J523743J078415J377792
$$ plain form
2482.3 753927307 753084259 751982498 750816650 748986435 746241074 744832535 742947693 741179810
2490 741179810 739299622 737322235 735248566 732074356 729385376 726361771 723954239 721222610 718321533
2498.7 718321533 715432587 711676788 708200607 703996735 700210876 696225815 692325134 688497543
2506.4 688497543 684245682 680082932 674641342 669111404 663376465 657893066 651815338 645537872
2514.1 645537872 640283051 634650764 629485359 624587898 621164780 618669472 616865654 616105919
2521.9 616105919 615523529 615992699 616306343 616904182 617512398 618643341 620062981 621047783 622813263
2530.5 622813263 624198799 625546570 626293449 627493896 628962746 630148430 632494926 634359703
2538.2 634359703 635815430 637002296 638506737 639754524 640860138 642383881 643462296 644840088
2546F44840088J116943J194687P71408J248474J546707R13392J572113J875610K940750
2554.6F58020172K853317L075638L366089L359985L547211K815170L606568L298187
2562.4F83942337L277741K656555J833801J603546P97196J503219N51758M67148N19714
2571F97153015L41873L72086n17807J80740K15760O91604R27811J120071R23615L69262
2580.7G01778030N98832M27246J252441O51932R95941J383209J171036J415329R53064
2589.4G10627060K085113J710816K308426L052521K801361L013839K287140K352906
2597.1G30239182J726379K025223J720581J412735J312637J97220K84119n69001p50808
2605.7G37598267j102066q73337k40326m12064n68847j439209j369172k180252k009582
$$ plain form
2546 644840088 645957031 647151718 647923126 649171600 650718307 651631699 653203812 655079422 658020172
2554.6 658020172 660873489 663949127 667315216 670675201 674222412 677037582 680644150 683942337
2562.4 683942337 687220078 689876633 691710434 693313980 694111176 695614395 696166153 696633301 697153015
2571 697153015 697494888 697866974 697349167 697529907 697745667 698437271 699365082 700485153 701408768 701778030
2580.7 701778030 702376862 702804108 704056549 704708481 705704422 707087631 708258667 709673996 710627060
2589.4 710627060 712712173 714422989 716731415 719783936 722585297 725599136 727886276 730239182
2597.1 730239182 731965561 733990784 735711365 737124100 738436737 738633957 738918076 738349075 737598267
2605.7 737598267 736496201 735622864 735382538 734970474 734401627 732962418 731593246 729412994 727403412
2614.4G27403412j773453j834335j041031j425705j517487k425766k497253k213821
2622.1G12674561j776810j380081j689682r08432o69022M8294L72925Q99506J401214
2630.8G08972473J586456K056809J597900J984253J806946K063370K010727J689453
2638.5G23768387J782760J656571K266083J577148J760254J498947J052704R85794
2646.3G36348648J308212K609864J635971J529617R90143N17654O89163N49241J487045
2654.9G47665558J203155J315613R21250R15985J111297P93686Q22067O21872R54361
2663.6G56324844Q53882J784821J007766K78321L55682l42712M88662M64631J024780
2672.3G62240677M92630K7008r92j35269O81610l31116L09296M43497P9422k58179
$$ plain form
2614.4 727403412 725629959 723795624 722754593 721328888 719811401 717385635 714888382 712674561
2622.1 712674561 710897751 709517670 707827988 706919556 706250534 706298828 706671753 707571259 708972473
2630.8 708972473 710558929 712615738 714213638 716197891 718004837 720068207 722078934 723768387
2638.5 723768387 725551147 727207718 729473801 731050949 732811203 734310150 735362854 736348648
2646.3 736348648 737656860 740266724 741902695 743432312 744422455 744940109 745629272 746178513 747665558
2654.9 747665558 748868713 750184326 751105576 752021561 753132858 753926544 754748611 755370483 756324844
2663.6 756324844 757178726 758963547 759971313 760249634 760605316 760262604 760751266 761215897 762240677
2672.3 762240677 762733307 762760315 762759323 762624054 763305664 762974548 763283844 763727341 763806763 763548584
2681.9G63548584r07364k06985k73896L35923N3024L39737K63977m29764j99585m96597
2691.6G62027054P0495n08194m92477q8272N99441M31214n44205K59628n15289k62680
2701.2G60976715K26059J67847j57090l37753L60260n63965j07650j12763p8277L22341
2710.9G60695724j82342j94626k49939O8741n78079R689K7390k52915J58158k30866
2720.5G59270935n3482p19223l0365K05307L26996N8441j040039k28806k65503K57416
2730.2G57781677j98745n59845J12152J21536K90298l50418k06833j36108m6005m13361
2739.8G56394348k13470k07978o33926M02298k2812J90277k56805n54047j03989k06680
2749.4G54787216O6376o33774k16751o38199O0501L75901o32172j95618n18951K15149
$$ plain form
2681.9 763548584 762641220 762434235 762160339 762496262 762549286 762889023 763153000 762723236 762523651 762027054
2691.6 762027054 762097549 761589355 761096878 761008606 761608047 762039261 761495056 761754684 761239395 760976715
2701.2 760976715 761202774 761370621 761213531 760875778 761236038 760672073 760564423 760451660 760373383 760695724
2710.9 760695724 760513382 760318756 760068817 760137558 759559479 759569168 759596558 759343643 759501801 759270935
2720.5 759270935 759217453 758498230 758467865 758673172 759000168 759058609 758018570 757789764 757524261 757781677
2730.2 757781677 757582932 757023087 757135239 757256775 757547073 757196655 756989822 756853714 756807709 756394348
2739.8 756394348 756180878 755972900 755338974 755741272 755718460 755908737 755651932 755097885 754993896 754787216
2749.4 754787216 754853592 754219818 754003067 753364868 753425369 753801270 753169098 752973480 752454529 752669678
2759.1G52669678m73252k56729K99454k67410K11258l99094j16577n90286n44739q6899
2768.7G50445404J26419K26822l69644P6980m35257M8981j20392k01797K5635n51987
2778.4G49271164P400m97055M2649k03553l18603l5553l58734J07727m83170j72500
2788G47359772q12836m65012K77100j85776K3804n99442j40380k15683k75116r7123
2797.7G44869308k30102l62473m37164j7624q75473o46972l90320j87378k09503m97666
2807.3G41014633L1967J77231L09220j311646j557617j294708p01905O29502M4098
2816G37340775k65275q14819m3945n97305r32618K21405J60218P26242m89807m95530
2825.6G34809341m93393j065292n24979o58264l56369n11779p6676l97568n92651j098251
$$ plain form
2759.1 752669678 752196426 751939697 752239151 751971741 752182999 751783905 751667328 751077042 750532303 750445404
2768.7 750445404 750571823 750798645 750429001 750505981 750070724 750119705 749999313 749797516 749823151 749271164
2778.4 749271164 749278564 748781509 748824158 748620605 748302002 748266449 747907715 748015442 747532272 747359772
2788 747359772 746546936 746081924 746359024 746173248 746197052 745597610 745457230 745241547 744966431 744869308
2797.7 744869308 744639206 744276733 743839569 743821945 742946472 742299500 741909180 741721802 741512299 741014633
2807.3 741014633 741046600 741223831 741533051 740221405 738663788 737369080 736667175 737296677 737340775
2816 737340775 737075500 736260681 736216736 735619431 734686813 734908218 735068436 735794678 735304871 734809341
2825.6 734809341 734315948 733250656 732725677 732067413 731711044 731199265 731122589 730725021 730132370 729034119
2835.3G29034119j187134%q75168j287537j544952r05228j276931j995240j224365
2843.9G18737564j713409j420594j163864r31091k075272k303390j333161j818466
2851.7G05978317j988983k614212j719894j785813j889267j533813k129746k083892
2859.4F90232697k557602k333069k404175j497803j855316k586899j488724j608886
2867.1F73900223j514359j810913j404571j328202o00662k82974j745987j690674j738968
2875.8F61782913r40399j032944o04705n20096j153107j63879j048813p94220n48935
2884.4F54975815n48783l41949m66461J1520l80401n59235j251450k46582k31704l21198
2894.1F50639572M96750o36673o9809j7319L59879P5607k25372J164322K011108K414932
$$ plain form
2835.3 729034119 727846985 727846985 726971817 725684280 724139328 723234100 721957169 719961929 718737564
2843.9 718737564 717024155 715603561 714439697 713508606 711433334 709129944 707796783 705978317
2851.7 705978317 703989334 701375122 699655228 697869415 695980148 694446335 692316589 690232697
2859.4 690232697 687675095 685342026 682937851 681440048 679584732 676997833 675509109 673900223
2867.1 673900223 672385864 670574951 669170380 667842178 667241516 666958542 665212555 663521881 661782913
2875.8 661782913 660842514 659809570 659204865 658684769 657531662 657367783 656318970 655524750 654975815
2884.4 654975815 654427032 654085083 653618622 653630142 653249741 652690506 651439056 651192474 650960770 650639572
2894.1 650639572 651136322 650499649 650429840 650412521 650772400 650848007 650622635 651786957 653798065 656212997
2903.7F56212997J114274J701507J983948J770706K163391K003403K332458J886444
2911.4F71169128K482987J525268M71802K79389R28039J417389L8986O20117M883M03443
2921.1F79341431O40869m2877L40957K4491N74722J51825P88956L29055K38953L56674
2930.7F82745056n95779M05731j88446J72577l05r4529K88773J64108P40662o7749
2940.4F83570099O46362O51322M91485J38550k48261L89939k22931j068j95160N05600
2950F85725937K46429j25198J82114l29590N57251K3727Q02002J005173K41318J76315
2959.7F88505478j00556M52347m48990l34167l53699l34091m39835q51821o25916j198120
2969.3F84270630n84030r12323q00400o23856o46972o65665j395035m91333q41522
$$ plain form
2903.7 656212997 657327271 659028778 661012726 662783432 664946823 666950226 669282684 671169128
2911.4 671169128 673652115 675177383 675649185 675928574 676856613 678274002 678312988 678933105 678937988 679341431
2921.1 679341431 679982300 679939423 680280380 680304871 680879593 681031418 681820374 682149429 682388382 682745056
2930.7 682745056 682149277 682555008 682366562 682539139 682538834 682444305 682733078 682897186 683637848 683570099
2940.4 683570099 684216461 684867783 685359268 685497818 685249557 685639496 685416565 685415497 685220337 685725937
2950 685725937 685972366 685847168 686029282 685699692 686256943 686280670 687082672 688087845 688329163 688505478
2959.7 688505478 688404922 688857269 688408279 688074112 687720413 687386322 686946487 686094666 685468750 684270630
2969.3 684270630 683686600 682774277 681973877 681350021 680703049 680037384 678642349 678151016 677309494
2978F77309494j074295j086578l92304j02234j278610p15866p18536p48368j175995
2986.7F70016708o64825J84555M19235R38645J95312J11466n78614j37939O5536j85470
2996.3F70364609O67343K73895N24826L8910K9297j80969l49808n7068n81055Q8120
3006F70818100n10025p02210m72335m06037n05142p87582n56794j178588p67823j108322
3015.6F63823242j076584r39178r22012q3237n17197m46930k86712R69467J290741
3024.3F61811600P17468J368637K310333L064499K676697L621368L357621K979355
3032F81907578L550186L712005L606186J556168J523819J337738J027679R38645N67321
3040.7F99727325R12476P9041M52575Q2550O7444m7073n10636n1117m61959K1515n6992
$$ plain form
2978 677309494 676235199 675148621 674756317 674654083 673375473 672659607 671941071 671192703 670016708
2986.7 670016708 669351883 669536438 669955673 670894318 671089630 671201096 670622482 670484543 670550079 670364609
2996.3 670364609 671031952 671305847 671830673 671869583 671898880 671717911 671368103 671311035 670729980 670818100
3006 670818100 670308075 669605865 669133530 668727493 668222351 667434769 666877975 665699387 664931564 663823242
3015.6 663823242 662746658 661807480 660885468 660802231 660285034 659838104 659551392 660520859 661811600
3024.3 661811600 662529068 663897705 666208038 669272537 671949234 675570602 678928223 681907578
3032 681907578 685457764 689169769 692775955 694332123 695855942 697193680 698221359 699160004 699727325
3040.7 699727325 700639801 700718842 701171417 701253967 701321411 701274338 700763702 700712585 700250626 700272141 700215149
3051.3G00215149N7144o13708l13111M17099j32065R8267r57413k61459n92423p47833
3060.9F97169647K85340j55716L2272o65665M60282M27780p56760o77185l16925N9967
3070.6F95863037r37347m74778n39016p5226L47214l17459k39106m46014j97067p07627
3080.2F92276611L7308J602n08423l59649m26712L60946m12826l69721p81250k75116
3089.9F89542770K49329j089401o83670m91791K80685j0833k45667j94778k12860J08184
3099.5F87251968j359176q10471m15649k93503m72107o32706J77613o75660l09982
3108.2F82460327K10877L69796k58178o09284j87988n18112j30768o72379n54123k43606
3117.8F79866562m90265n63431j58462k11029j313172n11398l38287k03858o7139o23703
$$ plain form
3051.3 700215149 700272293 699658585 699345474 699762573 699630508 699728775 698771362 698509903 697917480 697169647
3060.9 697169647 697454987 697299271 697331543 696665878 697126160 697553940 696797180 696119995 695803070 695863037
3070.6 695863037 694925690 694450912 693911896 693836670 694183884 693866425 693627319 693181305 692984238 692276611
3080.2 692276611 692313919 692315521 691807098 691447449 691020737 691381683 690968857 690599136 689817886 689542770
3089.9 689542770 689792099 688702698 688019028 687527237 687807922 687797089 687551422 687356644 687143784 687251968
3099.5 687251968 685892792 685082321 684666672 684373169 683901062 683268356 683445969 682770309 682460327
3108.2 682460327 682671204 683041000 682782822 682173538 681985550 681467438 681336670 680664291 680110168 679866562
3117.8 679866562 679376297 678812866 678654404 678443375 677130203 676618805 676280518 676076660 676009521 675385818
3127.5F75385818n55191m56924n18112r46961N5237m31442p51953J72424J66168K3346
3137.1F72142410q40912o03866j166077p16934l5934m38385p4540p99942n24597l66440
3146.8F66574783J2131l61328m37164L59573r58176q99505n50232n45426j211242p26242
3156.4F61257172L50341m48608m08173p32956m78591p79953m70734J17721q12988p21359
3166F56871872p26166l17077m78440l49655q49304j202011o69251q02612O9427q46710
3175.7F50700073j58081M22974q65174p65075r63211l37143o41098m52805n75638j235733
3185.3F45129089q64334m92325J02845q66166r80834n90439O6452l24173j115418m43306
3195F39621391r08203k41775n88265r33380o18210r10797p38563r22623J85928j00403
$$ plain form
3127.5 675385818 674830627 674373703 673855591 672908630 672963867 672532425 671780472 671952896 672119064 672142410
3137.1 672142410 671301498 670697632 669531555 668814621 668778687 668340302 668265762 667465820 666941223 666574783
3146.8 666574783 666586914 666225586 665788422 666147995 665189819 664290314 663740082 663194656 661983414 661257172
3156.4 661257172 661607513 661158905 660750732 660017776 659539185 658759232 658288498 658406219 657593231 656871872
3166 656871872 656145706 655828629 655350189 655000534 654151230 652949219 652279968 651477356 651546783 650700073
3175.7 650700073 650541992 650964966 650099792 649334717 648371506 648034363 647393265 646940460 646364822 645129089
3185.3 645129089 644264755 643772430 643875275 643009109 642028275 641437836 641504288 641180115 640064697 639621391
3195 639621391 638713188 638471413 637883148 636949768 636331558 635420761 634682198 633759575 633945503 633845100
3204.6F33845100n65834q34579j210823n39894p50199q35952p02553K32544k33307
3213.3F28404503j075707r37805p39250m62074r81751o13632q91914o4125J03645j076012
3222.9F21665878p68890j123810q85658o00815m7951n57022q68950n24368r16824P476
3232.6F15379066m10842n20859r94110j070519n87654j078720o9122k57645m07181
3241.3F09982414j074486n57594Q79975l50266p98111n58548k61688p29752m02298
3249.9F06129646k03972p13462k80075m66309L2997m00238o46858m28925n69153n91087
3259.6F01862564n89142J73493m23851p20368r25369n94254j78527m50554K49328l73954
3269.2E98029366o23208n95474j16882L16620p80449j053314o94580o26412j025848
$$ plain form
3204.6 633845100 633279266 632444687 631233864 630693970 629943771 629107819 628405266 628637810 628404503
3213.3 628404503 627328796 626390991 625651741 625189667 624207916 623594284 622702370 622638245 622741890 621665878
3222.9 621665878 620896988 619773178 618887520 618286705 618238754 617681732 616812782 616288414 615371590 615379066
3232.6 615379066 614968224 614447365 613453255 612382736 611795082 610716362 610647240 610389595 609982414
3241.3 609982414 608907928 608350334 609230309 608880043 608081932 607523384 607261696 606531944 606129646
3249.9 606129646 605925674 605212212 604932137 604465828 604498825 604098587 603451729 603022804 602453651 601862564
3259.6 601862564 601273422 601446915 601023064 600302696 599377327 598783073 598604546 598153992 598403320 598029366
3269.2 598029366 597406158 596810684 596693802 597010422 596229973 595176659 594482079 593855667 592829819
3277.9E92829819m07028n18151n70373N7373m56353n60607n68886l52249r72634r05227
3287.5E87575684o04172m80881J98288m04739l84865j014786r58023p60765j135407
3296.2E82030334n08308m57535l39851j096497q04748o78444q68759l54691o19125
3304.9E76302376m22135j287345j055146m36020n86700j061287j392708r40742j393242
3313.6E67727051l82538o42281j202545o55784q49648m61464p30247r28460j516456
3322.3E60357628r12056m55704r06219p74880j704445j029052o80199j333122j045761
3330.9E51516190r03359j044083o30493o78940j088142m70428j305275r96704q10395
3339.6E43588371j509018j030121j540374j497994j760750r72099n46074j372833r26094
$$ plain form
3277.9 592829819 592422791 591904640 591334267 591391640 590935287 590374680 589805794 589453545 588480911 587575684
3287.5 587575684 586971512 586490631 586688919 586284180 585899315 584884529 583926506 583165741 582030334
3296.2 582030334 581522026 581064491 580724640 579628143 578823395 578144951 577276192 576921501 576302376
3304.9 576302376 575880241 574592896 573537750 573101730 572515030 571453743 570061035 569120293 567727051
3313.6 567727051 567344513 566702232 565499687 564843903 563994255 563532791 562802544 561874084 560357628
3322.3 560357628 559445572 558989868 558083649 557308769 555604324 554575272 553895073 552561951 551516190
3330.9 551516190 550612831 549568748 548938255 548259315 547171173 546700745 545395470 544398766 543588371
3339.6 543588371 542079353 541049232 539508858 538010864 536250114 535278015 534731941 533359108 532433014
3348.3E32433014p39212r27925j740914j107521n78193r05648j376342j540947o82450
3357E22833862q88862n20172j155281j550217j298294j300354r32198j395416o13785
3365.7E13179283r16710j204986j629944j764260p21359q81157n35011j579514j429863
3374.3E02516479r66415j092491o34461j244888o17142j026191r55048r61914j239281
3383D93778648n62210j096420o39954m14123o96488j101455o60591l23830o43806o65970
3392.7D86973801j323395p37953o51360n43632r76487j047706m09279q91647l73688
3401.3D80018654q27217n01213l51258m89006o5345p87468p38869p52792J35612j99509
3411D75441589p34214r08318j180496p2174m76647j21002k48527K34184L79715j034699
$$ plain form
3348.3 532433014 531693802 530765877 529024963 527917442 527339249 526433601 525057259 523516312 522833862
3357 522833862 521945000 521424828 520269547 518719330 517421036 516120682 515188484 513793068 513179283
3365.7 513179283 512262573 511057587 509427643 507663383 506942024 506060867 505525856 503946342 502516479
3374.3 502516479 501550064 500457573 499823112 498578224 497961082 496934891 495979843 495017929 493778648
3383 493778648 493216438 492120018 491480064 491065941 490369453 489267998 488607407 488283577 487639771 486973801
3392.7 486973801 485650406 484912453 484261093 483717461 482740974 481693268 481283989 480392342 480018654
3401.3 480018654 479191437 478690224 478338966 477849960 477784615 476997147 476258278 475505486 475641098 475441589
3411 475441589 474707375 473799057 472618561 472546387 472069740 471948738 471700211 471934395 472314110 471279411
3420.6D71279411j91345m72298k86789J06087R8839j79024j46827O12869k11983O142
3430.3D70615082j72310m5586J83373O4392O01845l03688m09356J5717M98810n6305
3439.9D70991974j06392P74841K22702K45362K09045R62067O38694j033554k02064
3448.6D72702675P43255L20626J60217R15146L79143N96046J086235N02510O3820p3624
3458.2D77396049J088982J270523P23572o0501l78952N67665J096458J105347L88031
3466.9D83197174K07672M20647L17840l78608J47361J274758Q45795P92388M58985
3475.6D87284012M14848N47028O56852N44739L18108J109772L77807J26953R16062
3484.3D92296181N37605k01759P00569J251411R3308M24194J55411K48489P97386J105767
$$ plain form
3420.6 471279411 471088066 470615768 470328979 470435066 470533905 470354881 470208054 470820923 470608940 470615082
3430.3 470615082 470442772 470397186 470580559 470644951 471246796 470943108 470533752 470549469 471048279 470991974
3439.9 470991974 470885582 471660423 471883125 472128487 472337532 473299599 473938293 472904739 472702675
3448.6 472702675 473445930 473766556 473926773 474841919 475221062 475817108 476903343 477405853 477469673 477396049
3458.2 477396049 478485031 479755554 480479126 480418625 480039673 480607338 481703796 482809143 483197174
3466.9 483197174 483404846 483825493 484143333 483764725 483912086 485186844 486032639 486825027 487284012
3475.6 487284012 487698860 488245888 488902740 489447479 489765587 490875359 491253166 491380119 492296181
3484.3 492296181 492833786 492632027 493332596 494584007 494677315 495101509 495256920 495505409 496302795 497408562
3493.9D97408562J182365N8060J92489j93290J67160Q40721R56955J542396N46914
3502.6E02702332l38479o34155M42734Q96950N25779J427880N57976o48041L08723
3511.3E05241699O78139M33121O13403L70445O38542N40047P7667N63012K75039J078301
3520.9E10509415J391372L65792m88587l46451J102829R41391L40310l25547j65977
3529.6E13324547J032524N92842J77879L46375N50690R64622N89981n06782M4250R8419
3539.2E17215347o790R08051Q19893P52944Q54760M14161m24842n4856n42717R1820
3548.9E20027771J607437J212273P60574j460304k30713K21672K95372K018013l50914
3557.6E24101181N14183P19223l65562K29339Q78792Q77457k14196L986474O12068
$$ plain form
3493.9 497408562 498590927 498648987 498841476 498648186 498815346 499656067 500613022 502155418 502702332
3502.6 502702332 502363853 501729698 502172432 503069382 503595161 505023041 505581017 504932976 505241699
3511.3 505241699 505919838 506352959 506966362 507336807 507975349 508515396 508593063 509156075 509431114 510509415
3520.9 510509415 511900787 512266579 511777992 511431541 512534370 513475761 513816071 513490524 513324547
3529.6 513324547 514357071 514949913 515127792 515474167 516024857 516989479 517579460 517072678 517116928 517215347
3539.2 517215347 517208557 518116608 518936501 519689445 520544205 520958366 520533524 520478668 519935951 520027771
3548.9 520027771 521635208 522847481 523608055 522147751 521917038 522138710 522434082 524452095 524101181
3557.6 524101181 524615364 525334587 524969025 525198364 526077156 526954613 526740417 530726891 531338959
3566.2E31338959l104782k63901j466484L018837J058197L31001J054802R03206Q12073
3574.9E33681908l95356J051903l69224J408271J231652o829J541291J093178J367073
3583.6E40603867K20298L292427J265793k640342R89952j599808K131882K423858K688256
3592.3E49376183Q46252m42429K842484p38754J784210K177582j1788K145462O50711
3601E58629913J63880J371879J433602Q54454K474899K070618r25293K771225j062775
3609.6E67782402j032028O471443J189346l248481L309707n94063K781792M059677
3617.4E80719795m41818J634254q97140J85814J462517J214904J454201J509056J476288
3626E88317871R27200N525170L41301q687096K396698K968178M692230R84497j947937
$$ plain form
3566.2 531338959 528234177 527970276 526503792 529522629 530580826 530911827 531966629 532869835 533681908
3574.9 533681908 533286552 534338455 533969231 535377502 536609154 536602325 538143616 539236794 540603867
3583.6 540603867 540824165 544116592 545382385 542742043 543731995 542132187 544264069 546687927 549376183
3592.3 549376183 550222435 549780006 552622490 551883736 553667946 555845528 555833740 557979202 558629913
3601 558629913 558793793 560165672 561599274 562453728 564928627 566999245 566073952 568845177 567782402
3609.6 567782402 566750374 573221817 574411163 571162682 574472389 573878326 576660118 580719795
3617.4 580719795 580277977 581912231 581015091 581200905 582663422 583878326 585332527 586841583 588317871
3626 588317871 589245071 594770241 595111542 586424446 588821144 591789322 596481552 597466049 595518112
3634.7E95518112J314240K446098J644363m87785J67389J309853K295532N05409m2190
3643.4F04671021J235351K347946M968033p22999l413582K285461o3629l140717j034774
3652.1F07132111M180107K284202K441597L609963o598587R6969L703003l1700j21307
3660.8F16696358p0801J114464N53245j32217R91325K33689K512283M76265k706795
3669.4F19667816j094780j0030060L11356N061188M363785n765381l0095444J517296
3677.1E83935776J1395912J0630798L072548K026444K838363R52454J983299J203118
3684.9F18038712R40017L910141P616616l765030l406945Q150368m141617o52160M998703
3693.5F31688805J374321J833534J062164M89960J304321O90918J965141L263779m318886
$$ plain form
3634.7 595518112 596832352 599278450 600922813 600435028 600602417 601912270 604207802 604713211 604671021
3643.4 604671021 605906372 608254318 613222351 612499352 609085770 611371231 611307602 608166885 607132111
3652.1 607132111 611312218 613596420 616038017 619647980 613049393 613146362 616849365 616817665 616696358
3660.8 616696358 616625557 617740021 618293266 618161049 619152374 619386063 621898346 622374611 619667816
3669.4 619667816 618573036 608542976 608854332 613915520 618279305 612513924 582418480 583935776
3677.1 583935776 595331688 605962486 609035034 611061478 613899841 614852295 616835594 618038712
3684.9 618038712 618978729 622888870 630505486 626740456 623333511 631483879 627342262 626690102 631688805
3693.5 631688805 633063126 634896660 635958824 636448784 637753105 638444023 640409164 643672943 639354057
3702.2F39354057k859497L965187Q30460J51672K07520K115783L446122o347428L485947
3710.9F44349823L568268j3623581L186531M665489o2408K63595J518860N30396k842484
3719.6F41554489O95801N260620k404480m000702L335419J248093R02862k928314o73828
3728.3F42989960L513794J588440M812240k139740o921005P091675J333999p889022
3736F44380341M04434J912918N82886J886367K753525m021606R71451J1381607q087464
3744.7F52164459j6553268R042282N486450N292587n547104q681945J1626663l602829
3752.4F49227295q337936M487152L450317K143326m299698J749878N588455o544495
3760.1F47464294k930755K628631L59497O91758L722763j802674m889373K180709M767304
$$ plain form
3702.2 639354057 636494560 640459747 641290207 641441879 641649399 643765182 647211304 640863876 644349823
3710.9 644349823 647918091 634294510 637481041 642146530 642084122 642347717 643866577 644396973 641554489
3719.6 641554489 642250290 647510910 645106430 641105728 644441147 645689240 646592102 643663788 642989960
3728.3 642989960 646503754 648092194 652904434 650764694 643843689 650935364 652269363 644380341
3736 644380341 644784775 646697693 647280579 649166946 651920471 647898865 648870316 660251923 652164459
3744.7 652164459 635611191 644653473 650139923 655432510 649885406 641203461 652830124 649227295
3752.4 649227295 640889359 645376511 648826828 650970154 646670456 648420334 654008789 647464294
3760.1 647464294 644533539 647162170 647521667 648213425 651936188 650133514 645244141 647424850 652192154
3768.8F52192154K004318q216324l50189K806015j81122M74701m09546J25275L79333
3777.4F48824615K845078O561q028106K077102K103119L74680K077942k122422j438141
3786.1F46720428J71967L03345J92260l19213M64477N9204P9727o29501J003494L308106
3795.8F51354294k819443m269028J254578L770676O540832m238205j0357361K671357
3803.5F43907700R47113L396377N659714p795715m763108L333130J269913q7280L10745
3812.2F46178589j74561J407166N665588q46100j2742195L643227N501861M601365
3819.9F53234940K807693j6676941k37198N014267J138230K034225o4087l717041J84555
3828.6F43718643J837006K746048J157608o766434J371002O773072m268113j360626
$$ plain form
3768.8 652192154 654196472 645980148 645629959 648435974 648254852 648729553 648320007 648445282 648824615
3777.4 648824615 651669693 651676254 643648148 645725250 647828369 648203049 650280991 648158569 646720428
3786.1 646720428 646892395 647195740 647388000 647068787 647533264 647592468 647672195 647042694 648046188 651354294
3795.8 651354294 648534851 644265823 645520401 649291077 655831909 651593704 641236343 643907700
3803.5 643907700 644854813 648251190 653910904 646115189 641352081 644685211 645955124 645867844 646178589
3812.2 646178589 646004028 647411194 653076782 652230682 639488487 643131714 648633575 653234940
3819.9 653234940 656042633 639365692 639128494 644142761 645280991 647315216 647251129 643534088 643718643
3828.6 643718643 645555649 648301697 649459305 642692871 644063873 650836945 646568832 645208206
3836.3F45208206P607117q289337m048233P544937n430451j531372O004029k052918
3844F45011978m035644K504119J103364n7526J798477q81348J176072M527511k555694
3852.7F48591309J876525j7333488R75838J0552520n48629k362900J030273J746369
3860.4F44527817K763977m714356j94473N328903m624710m578438L028222N337219
3868.1F46874161O921539p263336j1372833L132896N794106M160385q078003p96852
3875.8F39372063L476066p93152J926117M687577n015564o980400M580803J555557
3883.5F42809067K073745M945145j2042961k18658L458519M64630L703842k11716o633224
3892.2F38348389M71878L067856j566773M85840Q51211J630326K448196r056434M510078
$$ plain form
3836.3 645208206 652815323 644525986 640477753 648022690 642592239 641060867 647064896 645011978
3844 645011978 640976334 643480453 644583817 644526291 646324768 645443420 646619492 651147003 648591309
3852.7 648591309 650467834 633134346 634110184 644662704 644114075 641751175 642781448 644527817
3860.4 644527817 647291794 642577438 642382965 647711868 643087158 638508720 641536942 646874161
3868.1 646874161 653795700 646532364 635159531 638292427 644086533 648246918 640168915 639372063
3875.8 639372063 642848129 642054977 643981094 648668671 643653107 636672707 641253510 642809067
3883.5 642809067 644882812 649827957 637784996 637566338 641024857 641489487 645193329 644981613 638348389
3892.2 638348389 638820267 641888123 640321350 640807190 641658401 643288727 645736923 636680489 641190567
3900.9F41190567L378906m531097M186706l936920j627922l62663m70963J718903j91841
3909.6F39353676L42903k28310N93911j55106r40399J321564K104644l018264l778725
3918.2F35595894L666344K3841k984237J703033J799545J753273k059402k860413J054650
3926.9F37692528J389389M75616j541328p3128K344551j289940k148132N10635k43187
3935.6F37117004m23355O38695Q37364j66168p97806J350250R89724m297791j198082
3944.3F34049835J946869J044502J641083j504745m59519O10123k454720O37017J26037
3953F35636482o08063L97263N09911K67906j055679N50193k49443N56793Q38128j684571
3962.6F35158920k51655J10931P74117O64749m86298j069984j026573k90299M65965
$$ plain form
3900.9 641190567 644569473 640038376 644225082 640288162 638660240 638297577 637826614 639545517 639353676
3909.6 639353676 639696579 639468269 640062180 639907074 638966675 640288239 642392883 639374619 635595894
3918.2 635595894 639262238 639286079 636301842 638004875 639804420 641557693 639498291 636637878 637692528
3926.9 637692528 639081917 639557533 638016205 637943077 640287628 638997688 636849556 637360191 637117004
3935.6 637117004 636693649 637332344 638169708 638003540 637205734 638555984 639545708 635247917 634049835
3944.3 634049835 635996704 637041206 638682289 637177544 636718025 637328148 634873428 635510445 635636482
3953 635636482 635028419 635425682 635935593 636203499 635147820 635698013 635448570 636005363 636843491 635158920
3962.6 635158920 634907265 635018196 635792313 636457062 635970764 634900780 633874207 633583908 634049873
3971.3F34049873Q04024o41403L11546M61235L00331J08948j128006J74599j02272
3980F34338875n78613l71666N25207Q21076N09567J04713j421242k33802l67966q2245
3989.6F33243904N18456j39809K14996l52287N25818j67656m35867L27682J0605Q2817
3999.2F33828659k04506
4000.2F33624153
$$ plain form
3971.3 634049873 634853897 634212494 634524040 634985275 635285606 635394554 634266548 634441147 634338875
3980 634338875 633760262 633388596 633913803 634734879 635244446 635349159 633927917 633694115 633326149 633243904
3989.6 633243904 633762360 633622551 633837547 633485260 634011078 633843422 633407555 633735237 633745842 633828659
3999.2 633828659 633624153
4000.2 633624153
##END=$$ End of the data block
