##TITLE=$$ Begin of the data block
##JCAMP-DX=5.00 $$ ACD/SpecManager v 10.08
##SPECTROMETER/DATA SYSTEM=Varian
##DATE=07 Jan 2013 16:42:08
##DATA TYPE=INFRARED SPECTRUM
##DATA CLASS=XYDATA
##ORIGIN=
##OWNER=
##NPOINTS=3735
##FIRSTX=399.26403809
##LASTX=4000.35498047
##MAXX=4000.35498047
##MINX=399.26403809
##MAXY=75.01592255
##MINY=0.10068312
##XFACTOR=1.0000000000
##YFACTOR=0.000000100000000
##FIRSTY=2.07508755
##DELTAX=0.96440572
##XUNITS=1/CM
##YUNITS=TRANSMITTANCE
##XYDATA=(X++(Y..Y))
$$ plain form
399.3 20750875 6998865 11869440 13365871 6535351 2559135 8578334 21241860 18536800
407 18536800 16277375 13734202 13773683 18417066 19763632 17352386 10600011 14334737 19165351
415.7 19165351 22246816 21342797 13424135 10655640 12793556 22694850 28254373 33589528 36285655
424.3 36285655 34729104 32020309 30680647 34426119 38433042 40130067 35902116 36743283 39922981
433 39922981 38903944 39868720 42528644 45795622 40990057 40327520 43305306 42437859 41941018
441.7 41941018 39266708 40084057 38344164 39044275 43031230 43008151 41360898 37803385 39159348
450.4 39159348 42668753 43719234 44200406 46572199 47724867 45676680 42857900 43196931 51289420
459.1 51289420 52632561 50025425 50168715 51404152 52659526 52036791 54056602 57145262 58965087
$$ packed form
399.3B0750875j3752010M870575J496431o830520l976216O019199J2663526k705060
407A8536800k259425k543173L9481M643383J346566k411246o752375L734726M830614
415.7A9165351L081465r04019p918662k768495K137916R901294N559523N335155K696127
424.3C6285655j556551k708795j339662L745472M006923J697025m227951Q41167L179698
433C9922981j019037R64776K659924L266978m805565o62537K977786q67447m96841
441.7D1941018k674310Q17349j739893P00111L986955k3079j647253l557513J355963
450.4C9159348L509405J050481M81172K371793J152668k048187k818780L39031Q092489
459.1E1289420J343141k607136J43290J235437J255374o22735K019811L088660J819825
$$ plain form
467.7 58965087 58473320 59215131 64831939 69098997 74304318 79918556 83158531 88883352 93543386
476.4 93543386 97726097 102865248 104176121 104929686 108319693 114882488 121501894 125168705 128982935
485.1 128982935 132219105 135127163 138758011 140899239 142140522 142557487 142676792 145843105 148010654
493.8 148010654 149814281 151890612 153575401 157277269 159694052 161415939 163546600 168554459
501.5 168554459 173021431 172539520 175063019 176614952 179248810 183726196 186170273 188717766 191368465
510.2 191368465 196224079 199645576 201387653 201574802 204092636 208404770 208436165 210258827 212166309
518.9 212166309 213147087 215028667 220189552 224278984 223700829 225700436 225719872 224804993 228438931
527.5 228438931 233779545 236825466 238423252 243489265 247497711 250226803 253745670 258304844
$$ packed form
467.7E8965087m91767P41811N616808M267058N205321N614238L239975N724821M660034
476.4I3543386M182711N139151J310873P53565L390007O562795O619406L666811L814230
485.1A28982935L236170K908058L630848K141228J241283M16965J19305L166313K167549
493.8A48010654J803627K076331J684789L701868K416783J721887K130661N007859
501.5A68554459M466972m81911K523499J551933K633858M477386K444077K547493K650699
510.2A91368465M855614L421497J742077J87149K517834M312134L1395J822662J907482
518.9B12166309R80778J881580N160885M089432n78155J999607J9436r14879L633938
527.5B28438931N340614L045921J597786N066013M008446K729092L518867M559174
$$ plain form
535.2 258304844 262651367 268268204 274769249 280425797 288094730 293835278 298850765 302824955
543 302824955 307519779 312475891 315987587 322843819 328556938 335525665 341039276 344247284 345339279
551.6 345339279 347149315 352634277 354316521 358643875 364318428 371715813 378160896 381828346
559.4 381828346 386560249 388479691 392503738 393659172 396791382 401615715 406404228 413426933
567.1 413426933 417233238 422649117 423435593 424088669 424889832 427549133 432024307 434198952 439457245
575.8 439457245 440768166 445601006 449965630 452324867 453823013 451198044 451443672 451863441 456590195
584.4 456590195 458318977 461828156 466994362 467127914 467465096 464471512 463344612 462293472 465201874
593.1 465201874 468075943 471338577 475835190 476359177 480233765 478448753 477434959 477189713 475621262
$$ packed form
535.2B58304844M346523N616837O501045N656548P668933N740548N015487L974190
543C02824955M694824M956112L511696O856232N713119O968727N513611L208008J091995
551.6C45339279J810036N484962J682244M327354N674553P397385O445083L667450
559.4C81828346M731903J919442M024047J155434L132210M824333M788513P022705
567.1D13426933L806305N415879P86476O53076Q01163K659301M475174K174645N258293
575.8D39457245J310921M832840M364624K359237J498146k624969K45628M19769M726754
584.4D56590195J728782L509179N166206J33552L37182k993584j126900j051140K908402
593.1D65201874K874069L262634M496613N23987L874588j785012j013794k45246j568451
$$ plain form
601.8 475621262 477787666 479715347 483971405 484813652 486942825 486794052 484573288 482467194 479447708
610.5 479447708 480189056 478961105 482099228 484334984 484869194 485386047 483516693 482035217 477706604
619.2 477706604 475488281 472200661 472091141 473630142 474991379 476031265 472166748 469758682 464060173
627.8 464060173 459602432 455628471 451588936 448916092 445691071 445505524 442279663 438992424 433440247
636.5 433440247 428137741 423523560 417562599 414196167 410189095 409114113 406701469 404533691
644.2 404533691 401719208 397432365 394940605 390330162 387957764 384537125 383117332 383137283 383487129
652.9 383487129 385153236 383496056 382761040 380190201 377921257 375135765 372244949 370222435 367598305
661.6 367598305 367329178 363843651 358405457 351133881 345759087 341173439 326004181 325719070 328166733
$$ packed form
601.8D75621262K166404J927681M256058Q42247K129173j48773k220764k106094l019486
610.5D79447708P41348j227951L138123K235756N34210N16853j869354j481476m328613
619.2D77706604k218323l287620j09520J539001J361237J039886l864517k408066n698509
627.8D64060173m457741l973961m039535k672844l225021j85547l225861l287239n552177
636.5D33440247n302506m614181n960961l366432m007072j074982k412644k167778
644.2D04533691k814483m286843k491760m610443k372398l420639j419793J9951L49846
652.9C83487129J666107j657180p35016k570839k268944k785492k890816k022514k624130
661.6C67598305k69127l485527n438194p271576n374794m585648j5169258k85111K447663
$$ plain form
670.3 328166733 332849159 336575584 341641083 346716919 350558815 352913857 353395119 356479874 357525063
678.9 357525063 359270592 361144485 363978310 367159042 367539978 368537712 367343559 366856651 364826775
687.6 364826775 364069290 365590591 366211510 367691574 366696854 367469177 368117638 368222504 367654648
696.3 367654648 366287766 365936279 364827194 366089439 365517807 363800430 361153412 357935791 353727341
705 353727341 345851135 339223824 331418381 322496681 310580215 295312939 279411163 268219318
712.7 268219318 267572613 271975842 277035675 278360519 276677113 272964725 265866776 255715389
720.4 255715389 242011242 227248096 208905621 189352379 168839722 147491341 127784948
727.2 127784948 112441483 107474489 116201773 139554768 173661823 214567890 259710464 304561119
$$ packed form
670.3C28166733M682426L726425N065499N075836L841896K355042M81262L084755J045189
678.9C57525063J745529J873893K833825L180732L80936R97734j194153m86908k029876
687.6C64826775p57485J521301O20919J480064r94720P72323O48461J04866n67856
696.3C67654648j366882l51487j109085J262245n71632j717377k647018l217621m208450
705C53727341p876206o627311p805443q921700j1916466j5267276j5901776j1191845
712.7B68219318o46705M403229N059833J324844j683406l712388p097949j0151387
720.4B55715389j3704147j4763146j8342475j9553242k0512657k1348381j9706393
727.2A27784948j5343465m966994Q727284K3352995L4107055M0906067M5142574M4850655
$$ plain form
734.9 304561119 348538895 387029572 419933968 446819725 469514771 488296547 500490227
741.6 500490227 510811615 515973587 519425125 519664841 518958473 519084358 518852005 521575279 522811737
750.3 522811737 524468727 522644920 518582420 514298096 510685158 507912521 504297028 505040436 505195618
759 505195618 505702019 503881683 500223503 496796646 492091331 490130844 486450119 484901390 483765640
767.7 483765640 482956429 483328552 482649574 482040062 478163719 475862236 471783905 467934761 466654549
776.4 466654549 466697884 467665787 465970802 465528488 463306503 461464844 458092117 455005646 453701401
785 453701401 450996780 451486969 450161934 451399803 451601067 448459549 445609093 441405411 438862114
793.7 438862114 434925041 434144630 433587646 432415695 431391106 429327393 428588142 425114670 421848145
$$ packed form
734.9C04561119M3977776L8490677L2904396K6885757K2695046J8781776J2193680
741.6E00490227J0321388N161972L451538K39716p06368J25885k32353K723274J236458
750.3E22811737J656990j823807m062500m284324l612938k772637l615493P43408J55182
759E05195618N06401j820336l658180l426857m705315j960487l680725j548729j135750
767.7D83765640q09211L72123o78978o09512l876343k301483m078331l849144j280212
776.4D66654549M3335R67903j694985m42314k221985j841659l372727l086471j304245
785D53701401k704621M90189j325035J237869K01264l141518k850456m203682k543297
793.7D38862114l937073p80411n56984j171951j024589k063713p39251l473472l266525
$$ plain form
802.4 421848145 417090416 413965187 412052231 410527191 410428772 408522606 407571754 403368759 399420586
811.1 399420586 394290009 389231071 386546783 383307037 382461205 379266930 376897888 372989883 368521538
819.7 368521538 365518684 360742798 356968803 352067909 349978752 348237686 346068764 344072418
827.5 344072418 341534767 338760452 333468399 330363846 326480637 322997971 320242348 317532959
835.2 317532959 315173893 311368427 309001446 304836044 300647850 295270805 289714489 284874802
842.9 284874802 279311695 274795418 268027802 261336842 253239384 246727581 241326485 232672768
850.6 232672768 219809380 207437057 214686565 229441242 230372334 223082466 214280357 206254711
858.3 206254711 197990932 189706364 181520157 173314743 164188271 155071325 146554089 137273512
$$ packed form
802.4D21848145m757729l125229j912956j525040r8419j906166r50852m202995l948173
811.1C99420586n130577n058938k684288l239746q45832l194275k369042l908005m468345
819.7C68521538l002854m775886l773995m900894k089157j741066k168922j996346
827.5C44072418k537651k774315n292053l104553l883209l482666k755623k709389
835.2C17532959k359066l805466k366981m165402m188194n377045n556316m839687
842.9B84874802n563107m516277o767616o690960q097458o511803n401096q653717
850.6B32672768j2863388j2372323P249508J4754677R31092p289868q802109q025646
858.3B06254711q263779q284568q186207q205414r126472r116946q517236r280577
$$ plain form
866 137273512 127246466 116416321 105151997 92442160 79216366 66824245 56636958 48752737
873.8 48752737 42315774 37513134 33690155 30296726 27670605 26337960 26432245 27791629 29791098
882.4 29791098 32816830 38909552 49059300 61730227 75078211 87926569 100592585 112670670
890.2 112670670 124507923 135120697 144481573 153025951 160413914 167655621 172588940 177046432
897.9 177046432 180919895 183576488 185996990 187612419 188642941 189746075 192140064 193315868
905.6 193315868 195189953 197211094 197912693 198993416 199358807 199320049 198209763 198513184 199091244
914.3 199091244 199562263 200392246 199715099 199585648 199223385 198804398 197539806 197256203 197403297 195981903
923.9 195981903 195229607 194363956 194040642 192263908 190488377 188852005 186385460 184746323 181640816
$$ packed form
866A37273512j0027046j0830145j1264324j2709837j3225794j2392121j0187287p884221
873.8D8752737o436963m802640l822979l393429k626121j332645R4285J359384J999469
882.4B9791098L025732O092722J0149748J2670927J3347984J2848358J2666016J2078085
890.2A12670670J1837253J0612774R360876Q544378P387963P241707M933319M457492
897.9A77046432L873463K656593K420502J615429J030522J103134K393989J175804
905.6A93315868J874085K021141P01599J080723L65391l8758j110286L03421N78060
914.3A99091244M71019Q29983o77147j29451l62263m18987j264592k83603J47094j421394
923.9A95981903p52296q65651l23314j776734j775531j636372k466545j639137l105507
$$ plain form
932.6 181640816 179029636 177154636 175851994 173666744 170303249 167304878 163312302 160435467
940.3 160435467 157844925 155195475 152270718 148924265 146281061 143190660 139995699 136640825
948 136640825 134203434 131897640 128931160 126303997 123955040 122185583 120714436 119658976 118293877
956.7 118293877 117307243 116288109 114281778 113244944 112904596 112391825 111962671 111835213 110944214
965.4 110944214 109626455 108819647 108197441 107530298 106310301 105697660 105117931 104193039 103308363
974.1 103308363 102208500 100955362 99142990 98099337 97267294 96174974 94938154 93258228 91665754
982.7 91665754 90222349 89579239 88470793 86779022 85549831 85031147 84583044 82836275 81399384
991.4 81399384 80456200 79446225 78874373 77983065 76977797 76323924 75586419 74612813 73697233 73034830
$$ packed form
932.6A81640816k611180j875000j302642k185250l363495k998371l992576k876835
940.3A60435467k590542k649450k924757l346453k643204l090401l194961l354874
948A36640825k437391k305794k966480k627163k348957j769457j471147j055460j365099
956.7A18293877r86634j019134k006331j036834l40348n12771m29154j27458q90999
965.4A10944214j317759q06808o22206o67143j219997o12641n79729r24892q84676
974.1A03308363j099863j253138j812372j043653q32043j092320j236820j679926j592474
982.7I1665754j443405o43110j108446j691771j229191n18684m48103j746769j436891
991.4H1399384r43184j009975n71852q91308j005268o53873p37505r73606r15580o62403
$$ plain form
1001.1 73034830 72887993 72780957 72085543 70527740 69355431 69032764 67852526 67340899 67584805
1009.7 67584805 67077756 66649671 66221318 65723438 65457864 65678859 65691118 65836091 66975660 68321671
1019.4 68321671 69492211 70541859 72153206 73627872 74965105 76566525 78314614 80857677
1027.1 80857677 82806196 84237881 85629768 87317276 88819895 89790173 91145277 92094202 93455877
1035.8 93455877 94348984 94580622 95141544 95676231 96107502 96363487 97263145 97911797 98787937 99420242
1045.4 99420242 99935760 101892262 103429832 104249535 104855490 106282310 108601589 110593624 111833267
1054.1 111833267 113357353 114969835 115739059 117351665 118447943 119479380 120839539 121948681
1061.8 121948681 123311720 124022226 124795876 125669003 127658024 128915377 128813152 129261112 130343571
$$ packed form
1001.1G3034830j46837j07036o95414j557803j172309l22667j180238n11627K43906
1009.7F7584805n07049m28085m28353m97880k65574K20995J2259J44973J139569J346011
1019.4F8321671J170540J049648J611347J474666J337233J601420J748089K543063
1027.1H0857677J948519J431685J391887J687508J502619R70278J355104R48925J361675
1035.8I3455877Q93107K31638N60922N34687M31271K55985Q99658O48652Q76140O32305
1045.4I9420242N15518J956502J537570Q19703O05955J426820K319279J992035J239643
1054.1A11833267J524086J612482P69224J612606J096278J031437J360159J109142
1061.8A21948681J363039P10506P73650Q73127J989021J257353j02225M47960J082459
$$ plain form
1070.5 130343571 131352692 132035923 133928413 134202290 134564276 135805855 136543598 137597237 137176447
1079.2 137176447 137087955 136971750 137855968 138630257 138985147 139771204 139084358 139455309 139794941 140762625
1088.8 140762625 141140070 141523829 143296127 144050970 144658689 143843765 144360046 145069246 145196991
1097.5 145196991 144688768 143412075 144524221 145606089 148123379 149872942 151098604 153241234
1105.2 153241234 154397612 155500307 154750729 155019302 155449114 155999498 156406384 156311588 157499533
1113.9 157499533 157800446 158876514 158718023 157849607 157594042 158095446 158879080 158402996 159182663
1122.6 159182663 159651012 160193996 159945412 159749613 159953947 159596319 160003757 158847427 158787565 159063377
1132.2 159063377 159497309 160143948 160013981 160219669 159315271 159337044 158636112 158385105 158465700 157932854
$$ packed form
1070.5A30343571J009121O83231J892490K73877L61986J241579P37743J053639m20790
1079.2A37176447q8492j16205Q84218P74289L54890P86057o86846L70951L39632R67684
1088.8A40762625L77445L83759J772298P54843O07719q14924N16281P09200J27745
1097.5A45196991n08223j276693J112146J081868K517290J749563J225662K142630
1105.2A53241234J156378J102695p49578K68573M29812N50384M06886r4796J187945
1113.9A57499533L00913J076068j58491q68416k55565N01404P83634m76084P79667
1122.6A59182663M68349N42984k48584j95799K04334l57628M07438j156330n9862K75812
1132.2A59063377M33932O46639j29967K05688r04398K1773p00932k51007Q0595n32846
$$ plain form
1141.9 157932854 158378716 158219109 158345861 157181911 156525021 156078539 155931063 156934557 156357584
1150.5 156357584 156123419 156116104 156500502 156124887 155812082 155336533 154353218 154844036 154415150 154403086
1160.2 154403086 153912458 153337288 152793732 152022581 152224150 151428633 150963955 149924994 149486971
1168.9 149486971 149277658 148667622 148523445 147684908 147597513 147256241 147490139 146708384 145313578 145111847
1178.5 145111847 144813881 144734926 143814058 143915501 143719301 142702665 141727257 141473713 142149334 141124563
1188.1 141124563 140635700 140242634 140283041 140439587 139787645 139518557 138848534 138989229 138933258 138896694
1197.8 138896694 138471746 137971096 137553892 136665545 136679640 136084948 135907393 135318193 134549751 133892908
1207.4 133892908 133199778 133206606 132165499 132158470 131834841 130969257 130254679 129568052 129399509 128055763
$$ packed form
1141.9A57932854M45862j59607J26752j163950o56890m46482j47476J003494n76973
1150.5A56357584k34165p315L84398l75615l12805m75549r83315M90818m28886j2064
1160.2A54403086m90628n75170n43556p71151K01569p95517m64678j038961m38023
1168.9A49486971k09313o10036j44177q38537q7395l41272K33898p81755j394806k01731
1178.5A45111847k97966p8955r20868J01443j96200j016636r75408k53544O75621j024771
1188.1A41124563m88863l93066M0407J56546o51942k69088o70023J40695n5971l6564
1197.8A38896694m24948n00650m17204q88347J4095n94692j77555n89200p68442o56843
1207.4A33892908o93130O828j041107p029l23629q65584p14578o86627j68543j343746
$$ plain form
1217.1 128055763 127172194 126436710 125947695 125151510 124418135 124007349 122829313 122506285 121701164
1225.8 121701164 120993042 119959087 119416990 119667454 118927622 118678370 118169012 117865400 117169781
1234.4 117169781 116695824 116321812 115440016 115422668 114787645 114228649 113395662 112750502 112170153 111531229
1244.1 111531229 111366415 110612803 110411749 109771786 109120255 108305063 107684298 107556810 106586857 105938425
1253.7 105938425 105160561 104774942 104013109 103160095 102671862 102113724 101797495 100884743 100845289 100261450
1263.4 100261450 99197636 98332644 97468395 96977472 96102047 95919895 95311613 94599648 93657331
1272 93657331 92793999 92414484 91556835 91137657 90130730 89547205 89050064 88293715 87519655 86676970
1281.7 86676970 86353254 85067348 84370623 83801298 83025541 82141895 81074905 80791712 80046463
$$ packed form
1217.1A28055763q83569p35484m89015p96185p33375m10786j178036l23028q05121
1225.8A21701164p08122j033955n42097K50464p39832k49252n09358l03612o95619
1234.4A17169781m73957l74012q81796j7348o35023n58996q32987o45160n80349o38924
1244.1A11531229j64814p53612k01054o39963o51531q15192o20765j27488r69953o48432
1253.7A05938425p77864l85619p61833q53014m88233n58138l16229r12752l9454n83839
1263.4A00261450j063814q64992q64249m90923q75425j82152o08282p11965r42317
1272I3657331q63332l79515q57649m19178j006927n83525m97141p56349p74060q42685
1281.7H6676970l23716j285906o96725n69325p75757q83646j066990k83193p45249
$$ plain form
1290.4 80046463 79418492 78435845 77823610 77228274 76362128 75879145 74855790 74474239 73839650 73496952
1300 73496952 73170629 72237835 71306033 70269017 69926815 69097748 68490710 67886024 67146754 66413360
1309.7 66413360 65504403 65231838 64462714 63993554 63435960 62633963 61663938 60873380 60542974 59338703
1319.3 59338703 58619323 57991500 57434473 56422620 55520182 55403132 54798350 54563704 53721128 52714524
1328.9 52714524 51743293 50961308 50689707 49973292 49331417 48357611 47535114 46630406 46060257 45581994
1338.6 45581994 44803095 44513898 43850684 43427281 42522330 42119336 41543546 40282059 39888000 39246197
1348.2 39246197 38900168 38310406 37514601 36528244 35544205 35298152 34770789 34191904 33035235 32207468
1357.9 32207468 31965609 31502998 30536995 29335721 28926196 27930849 27489703 27208803 26538422 25767443
$$ packed form
1290.4H0046463o27971r82647o12235n95336q66146m82983j023355l81551o34589l42698
1300G3496952l26323r32794r31802j037016l42202q29067o07038o04686p39270p33394
1309.7F6413360r08957k72565p69124m69160n57594q01997r70025p90558l30406j204271
1319.3E9338703p19380o27823n57027j011853r02438j17050o04782k34646q42576j006604
1328.9E2714524r71231p81985k71601p16415o41875r73806q22497r04708n70149m78263
1338.6D5581994p78899k89197o63214m23403r04951m02994n75790j261487l94059o41803
1348.2C9246197l46029n89762p95805r86357r84039k46053n27363n78885j156669q27767
1357.9C2207468k41859m62611r66003j201274m09525r95347m41146k80900o70381p70979
$$ plain form
1367.5 25767443 24910197 24582992 24000349 23365862 22608285 22105875 21734846 20905519 20428457 20114641
1377.2 20114641 19851521 19061093 18451289 17593484 16700542 16485704 16154320 15897074 15411446 14848413
1386.8 14848413 13807024 13202963 12896291 12080936 11627465 11284976 11217873 11019657 10033519 9317366
1396.4 9317366 8992451 8904914 8139697 7876954 7736083 7356467 6956416 6510100 6545364 6419682
1406.1 6419682 6017126 5542907 5473123 5288594 4582955 4324704 4387403 4603714 4260103 3623405
1415.7 3623405 3541718 3116355 2280402 2167943 2760366 2840505 2782931 2463515 2124280 2067675 1788129
1426.3 1788129 1897453 2184713 1837942 1024917 1006831 1524288 1638836 1490907 1454655 1521998
1436 1521998 1583638 1763294 1830843 1528437 1444428 1561490 1647564 1662105 1642922 1795066 1965981
$$ packed form
1367.5B5767443q57246l27205n82643o34487p57577n02410l71029q29327m77062l13816
1377.2B0114641k63120p90428o09804q57805q92942k14838l31384k57246m85628n63033
1386.8A4848413j041389o04061l06672q15355m53471l42489o7103j98216r86138p16153
1396.4I317366l24915q7537p65217k62743j40871l79616m00051m46316L5264j25682
1406.1F419682m02556m74219o9784j84529p05639k58251O2699K16311l43611o36698
1415.7C623405q1687m25363q35953j12459N92423Q0139n7574l19416l39235n6605k79546
1426.3A788129J09324K87260l46771q13025j8086N17457J14548j47929l6252O7343
1436A521998O1640J79656O7549l02406q4009J17062Q6074J4541j9183J52144J70915
$$ plain form
1446.6 1965981 2321186 2280109 2000078 2162457 2601315 2604175 2210816 2135551 1867749 1463215 1326711
1457.2 1326711 1869418 2345091 2376535 2508436 2443617 2477967 2672700 3180707 3242526 3089554 3624439
1467.8 3624439 3806531 3713159 3848330 4046000 4412846 4607471 4533099 4175014 4311751 4664122
1477.5 4664122 4792491 4876883 5025255 5362795 5406882 5494847 5356232 5378553 5464255 5632640 6161513
1488.1 6161513 5985590 6496815 6636566 6692514 7070761 7302448 7485569 7306299 8160226 8562037
1497.7 8562037 8797433 8973721 9081772 9642068 10075436 10609745 10873148 11439556 11317904 11937836
1507.3 11937836 14105817 14019132 14343598 14856148 15296577 15505332 16442360 17224350 17617831 19065710
1517 19065710 19215409 19928275 20262284 20795035 22905748 23954642 23966656 23482563 24850359 25623331
$$ packed form
1446.6A965981L55205m1077k80031J62379M38858K860l93359p5265k67802m04534j36504
1457.2A326711N42707M75673L1444J31901o4819L4350J94733N08007O1819j52972N34885
1467.8C624439J82092r3372J35171J97670L66846J94625p4372l58085J36737L52371
1477.5D664122J28369Q4392J48372L37540M4087Q7965j38615K2321Q5702J68385N28873
1488.1F161513j75923N11225J39751N5948L78247K31687J83121j79270Q53927M01811
1497.7H562037K35396J76288J08051N60296M33368N34309K63403N66408j21652O19932
1507.3A1937836K167981q6685L24466N12550M40429K08755R37028P81990L93481J447879
1517A9065710J49699P12866L34009N32751K110713J048894J2014m84093J367796P72972
$$ plain form
1526.6 25623331 26506147 27795372 28746011 29499421 29652610 30714560 31579614 33133805 33564374
1535.3 33564374 34154563 35229907 35692873 37992630 36781011 38198006 40212984 42069120 42520676
1544 42520676 42796946 44800034 45585384 46986060 47786984 48763680 49996672 50809922 52005038
1552.7 52005038 52624450 54354205 54781003 55889254 56502023 56334381 61334782 59450750 61713257
1561.4 61713257 62832580 64334188 65287900 66472745 68091912 69170637 70950146 71319542 73516078
1570 73516078 75132599 76049328 77101631 78080673 79251094 78848157 81154633 82840815 84207544
1578.7 84207544 84994450 85665569 86809978 87374887 88563623 89095755 90192747 90870152 91212721
1587.4 91212721 92178411 92716513 93618927 93991508 95068836 95994644 96649256 97303305 97784891 98798580
$$ packed form
1526.6B5623331Q82816J289225R50639P53410J53189J061950Q65054J554191M30569
1535.3C3564374N90189J075344M62966K299757j211619J416995K014978J856136M51556
1544D2520676K76270K003088P85350J400676Q00924R76696J232992Q13250J195116
1552.7E2005038O19412J729755M26798J108251O12769j67642N000401j884032K262507
1561.4F1713257J119323J501608R53712J184845J619167J078725J779509L69396K196536
1570G3516078J616521R16729J052303R79042J170421m02937K306476J686182J366729
1578.7H4207544P86906O71119J144409N64909J188736N32132J096992O77405L42569
1587.4I1212721R65690N38102R02414L72581J077328R25808O54612O54049M81586J013689
$$ plain form
1597 98798580 99192228 99760475 100038967 100697174 101370430 102072716 102889328 103021297 103739414 103825178
1606.7 103825178 104405394 105094757 105464411 106123714 106576347 107473030 107806997 108482637 109125156 109099188
1616.3 109099188 108557358 109774246 111439953 112203865 112817154 113129053 113720846 113668919 114650116
1625 114650116 115994844 116216297 116486855 116649837 117828751 118363028 118930235 119935350 120383816
1633.7 120383816 121623020 119908352 121186171 122409678 123785324 125711823 126556177 127590303
1641.4 127590303 128265934 129283609 130181599 131243448 131699247 131226425 132872152 134271593 136678801
1650.1 136678801 138121347 139377995 139765215 137087069 141239920 142970924 144698191 145473232 146630259
1658.8 146630259 147861586 148988323 150574389 150843477 151900911 153341074 155238314 156392803
$$ packed form
1597I8798580L93648N68247K78492O58207O73256P02286Q16612J31969P18117Q5764
1606.7A03825178N80216O89363L69654O59303M52633Q96683L33967O75640O42519k5968
1616.3A09099188n41830J216888J665707P63912O13289L11899N91793n1927R81197
1625A14650116J344728K21453K70558J62982J178914N34277N67207J005115M48466
1633.7A20383816J239204j714668J277819J223507J375646J926499Q44354J034126
1641.4A27590303O75631J017675Q97990J061849M55799m72822J645727J399441K407208
1650.1A36678801J442546J256648L87220k678146M152851J731004J727267P75041J157027
1658.8A46630259J231327J126737J586066K69088J057434J440163J897240J154489
$$ plain form
1666.5 156392803 157462387 158349848 157249165 159683027 160925655 162090950 163525047 165466614
1674.2 165466614 166396694 165816860 168227711 169793110 171632595 172286549 172750778 174724636 176285152
1682.9 176285152 175827770 171829681 177349148 180027523 181862965 182791653 184181366 185760441 186629333
1691.5 186629333 188168774 188677406 190282784 190662098 188561840 191574192 193712292 196832409 196393681
1700.2 196393681 195465565 198121452 200304184 201505890 201973228 203107071 202941799 205310364 207548313
1708.9 207548313 208901615 209613552 211088791 212969131 213600368 213906593 213677158 215962029 217067051
1717.6 217067051 216134853 218521366 220429993 222327194 223141880 224271393 224915524 226156845 227505856
1726.3 227505856 228314095 229779816 230706825 231364594 231799564 233867683 234857960 231635437 231576347
$$ packed form
1666.5A56392803J069584Q87461j100683K433862J242628J165295J434097J941567
1674.2A65466614R30080n79834K410851J565399J839485O53954M64229J973858J560516
1682.9A76285152m57382l998089N519467K678375J835442R28688J389713J579075Q68892
1691.5A86629333J539441N08632J605378L79314k100258L012352K138100L120117m38728
1700.2A96393681r28116K655887K182732J201706M67338J133843j65272K368565K237949
1708.9B07548313J353302P11937J475239J880340O31237L06225k29435K284871J105022
1717.6B17067051r32198K386513J908627J897201Q14686J129513O44131J241321J349011
1726.3B27505856Q08239J465721R27009O57769M34970K068119R90277l222523n9090
$$ plain form
1734.9 231576347 235315208 238568916 239615326 241647778 241631584 241421013 244358368 245218220 245545616
1743.6 245545616 246358719 248709354 249820004 250507050 251745853 251997814 254437828 254184227 255138493
1752.3 255138493 257696381 259123898 260416431 261605110 262063198 263424320 265692348 266987457
1760 266987457 268355446 267358875 268492432 270664215 271350136 272963982 274372959 275978508 275249004
1768.7 275249004 277331982 280212269 279325771 277916279 277778816 281637211 283071003 283887215 286164455
1777.4 286164455 287062492 288580570 288519821 288776913 289800014 291298218 292254047 291754017 292205505
1786 292205505 292738228 293329563 292733917 292388687 290435753 288244209 284721909 282232800 283913498
1794.7 283913498 283373375 283135548 283482704 283820553 283163433 282287903 284082355 283849239 284474316
$$ packed form
1734.9B31576347L738861L253708J046410K032452j6194k10571K937355Q59852L27396
1743.6B45545616Q13103K350635J110650O87046J238803K51961K440014k53601R54266
1752.3B55138493K557888J427517J292533J188679M58088J361122K268028J295109
1760B66987457J367989r96571J133557K171783O85921J613846J408977J605549p29504
1768.7B75249004K082978K880287q86498j409492j37463L858395J433792Q16212K277240
1777.4B86164455Q98037J518078o0749K57092J023101J498204R55829n00030M51488
1786B92205505N32723N91335n95646l45230j952934k191544l522300k489109J680698
1794.7B83913498n40123k37827L47156L37849o57120q75530J794452k33116O25077
$$ plain form
1803.4 284474316 285041103 285228367 285115013 283833103 282543907 281256161 280388584 276820927 274824047
1812.1 274824047 273416004 271823807 271136780 270002136 270114651 269179840 269182739 269190369 268791370 268689003
1821.7 268689003 268090191 269389400 270187626 271179695 273578205 277217617 280913353 283575916 287196159
1830.4 287196159 291824551 297393856 301225471 305249462 309166203 312751541 316541481 319407082
1838.1 319407082 323480873 326113243 329178619 331410904 333412361 335755196 335328293 340161095
1845.8 340161095 343681946 345929947 347729378 349912643 352685204 353829498 355350838 356770592
1853.6 356770592 359151306 361013069 363064957 365315399 366454849 368462067 369614029 371145668
1861.3 371145668 372258949 373583908 374995384 376304321 378301735 379326134 381725082 382293396
$$ packed form
1803.4B84474316N66787J87264j13354j281910j289196j287746q67577l567657j996880
1812.1B74824047j408043j592197o87027j134644J12515r34811K899P630l98999j02367
1821.7B68689003n98812J299209P98226R92069K398510L639412L695736K662563L620243
1830.4B87196159M628392N569305L831615M023991L916741L585338L789940K865601
1838.1C19407082M073791K632370L065376K232285K001457K342835m26903M832802
1845.8C40161095L520851K248001J799431K183265K772561J144294J521340J419754
1853.6C56770592K380714J861763K051888K250442J139450K007218J151962J531639
1861.3C71145668J113281J324959J411476J308937J997414J024399K398948N68314
$$ plain form
1869 382293396 382588959 384662361 386999741 389017487 389925194 391731071 392895966 394519882 396139374
1877.7 396139374 397933540 399430809 399871063 401142311 401601105 403138809 404342346 405717506 407722168
1886.3 407722168 409016762 411258774 412019539 412139740 413509941 415384178 416388817 417862549 419539948
1895 419539948 420324593 422787209 424092178 425582199 426779861 427523880 428827934 429895439 431792450
1903.7 431792450 432563705 434216309 435728836 436918678 438477478 439447479 440654411 441601257 443686409
1912.4 443686409 444518051 446041679 447758179 449094658 451345444 450183182 451436768 453849258
1920.1 453849258 455475197 456472282 455891800 457377396 459855309 462272415 463479881 464790230 465975151
1928.8 465975151 467015305 468022957 468865471 470424805 471094704 472899094 474636269 476172447 477277908
$$ packed form
1869C82293396K95563K073402K337380K017746R07707J805877J164895J623916J619492
1877.7C96139374J794166J497269M40254J271248M58794J537704J203537J375160K004662
1886.3D07722168J294594K242012P60765J20201J370201J874237J004639J473732J677399
1895D19539948P84645K462616J304969J490021J197662P44019J304054J067505J897011
1903.7D31792450P71255J652604J512527J189842J558800R70001J206932R46846K085152
1912.4D43686409Q31642J523628J716500J336479K250786j162262J253586K412490
1920.1D53849258J625939R97085n80482J485596K477913K417106J207466J310349J184921
1928.8D65975151J040154J007652Q42514J559334O69899J804390J737175J536178J105461
$$ plain form
1937.5 477277908 477864342 479378281 480108147 481951218 481730232 481208649 484150581 486268082 487603645
1946.1 487603645 488741112 490679588 491873131 492593956 493241730 494453773 495828133 496682739 498720322
1954.8 498720322 500203362 501687660 502575836 503670006 504894524 505023575 505943756 506876373 508533020
1963.5 508533020 509934464 511588249 513132896 513472061 514404907 515468788 516631203 516905708 517475014
1972.2 517475014 518070717 518958244 520290070 521423149 523251343 524280434 525666237 526458549 527392998
1980.8 527392998 528701286 529886742 532001724 533272934 535233536 536553307 537498131 538155174 538890038
1989.5 538890038 541016541 541454735 541438522 542587280 545115395 546809921 547884827 549348259 549900589
1998.2 549900589 550950165 551393051 552457237 553310623 554786797 557062378 558074875 559429169 560265617
$$ packed form
1937.5D77277908N86434J513939P29866J843071k20986n21583K941932K117501J335563
1946.1D87603645J137467J938476J193543P20825O47774J212043J374360Q54606K037583
1954.8D98720322J483040J484298Q88176J094170J224518J29051R20181R32617J656647
1963.5E08533020J401444J653785J544647L39165R32846J063881J162415K74505N69306
1972.2E17475014N95703Q87527J331826J133079J828194J029091J385803P92312R34449
1980.8E27392998J308288J185456K114982J271210J960602J319771R44824O57043P34864
1989.5E38890038K126503M38194j6213J148758K528115J694526J074906J463432N52330
1998.2E49900589J049576M42886J064186Q53386J476174K275581J012497J354294Q36448
$$ plain form
2006.9 560265617 561553459 561819344 562074356 563203697 564085922 565702553 566568604 568093758 569666252
2015.6 569666252 570915298 571278229 571821175 573143501 573597908 574865074 575690117 577135773 578703957
2024.2 578703957 580182610 581597214 582068748 583152351 583317261 584280434 585289001 586381111 587862549
2032.9 587862549 588994293 590830917 591805115 593088036 593446922 593801956 594544334 595121040 596071777
2041.6 596071777 596899338 599198990 600542183 601912842 602839165 603232994 604003105 604168663 605470161
2050.3 605470161 605814018 606844788 608329506 609927826 611619911 612298851 613586235 613787308 614333229
2059 614333229 614372482 615118332 616674042 617378235 619196434 620296021 621629677 622445946 623079720
2067.6 623079720 623605537 623769608 624610786 625055771 626589966 628286705 630282059 631231689 631463737
$$ packed form
2006.9E60265617J287842K65885K55012J129341Q82225J616631Q66051J525154J572494
2015.6E69666252J249046L62931N42946J322326M54407J267166Q25043J445656J568184
2024.2E78703957J478653J414604M71534J083603J64910R63173J008567J092110J481438
2032.9E87862549J131744J836624R74198J282921L58886L55034P42378N76706R50737
2041.6E96071777Q27561K299652J343193J370659R26323L93829P70111J65558J301498
2050.3F05470161L43857J030770J484718J598320J692085O78940J287384K01073N45921
2059F14333229L9253P45850J555710P04193J818199J099587J333656Q16269O33774
2067.6F23079720N25817J64071Q41178M44985J534195J696739J995354R49630K32048
$$ plain form
2076.3 631463737 631980438 631909752 632529144 632799110 634167824 635539246 637047653 638557053 639402618
2085 639402618 640593033 640497055 641247330 641691589 642220383 642992477 643971024 645901566 646736832 648203125
2094.6 648203125 648984604 649715729 649917450 649975281 650881958 650983963 652265015 653331833 654880676
2103.3 654880676 656200409 657009430 657632370 657604446 658237457 658230362 659215012 659820328 660867233 662314987
2113 662314987 663034821 664305115 664551163 665278854 665122833 665301819 665625076 665807114 667289352 668042221
2122.6 668042221 669324036 669722137 670269852 670703659 670620804 670729294 670560150 671534119 671822357 672738266
2132.3 672738266 673339844 673907013 674561081 673970871 673810425 673231964 673286057 672682495 672623901 672880096
2141.9 672880096 672877274 673723679 673717117 673909760 672797089 672497711 672493591 671871567 671956558 671919785 673258972
$$ packed form
2076.3F31463737N16701p0686O19392K69966J368714J371422J508407J509400Q45565
2085F39402618J190415r5978P50275M44259N28794P72094R78547J930542Q35266J466293
2094.6F48203125P81479P31125K01721N7831R06677J02005J281052J066818J548843
2103.3F54880676J319733Q09021O22940k7924O33011p095R84650O05316J046905J447754
2113F62314987P19834J270294K46048P27691j56021J78986L23257J82038J482238P52869
2122.6F68042221J281815L98101N47715M33807q2855J08490j69144R73969K88238R15909
2132.3F72738266O01578N67169O54068n90210j60446n78461N4093o03562n8594K56195
2141.9F72880096k822Q46405o562J92643j112671k99378m120o22024Q4991l6773J339187
$$ plain form
2152.5 673258972 673794098 674773254 675405731 675182419 675032730 674274673 674816208 675194778 676158676 676990128
2162.1 676990128 678295593 679303665 679009857 679433823 679087982 679538879 679800262 680462189 681484451
2170.8 681484451 682236557 683898315 684994202 686349335 686859665 687451630 687701111 688087158 689184265
2179.5 689184265 689957428 691725235 692897339 694608917 695543289 696241531 697062531 697114639 697657928
2188.2 697657928 697333603 698685074 699974442 701120529 702422028 703085480 704310074 704246445 704604874
2196.9 704604874 704534836 704725418 705270386 706184006 707882538 708704300 709943924 709962692 710094604 709958191
2206.5 709958191 710041885 710858536 710982742 712153931 713003616 714584503 715382233 715840912 716340485
2215.2 716340485 716037445 716588821 716424408 717263107 717854843 718832550 720460815 721524582 722522888
$$ packed form
2152.5F73258972N35126R79156O32477k23312j49689p58057N41535L78570R63898Q31452
2162.1F76990128J305465J008072k93808M23966l45841M50897K61383O61927J022262
2170.8F81484451P52106J661758J095887J355133N10330N91965K49481L86047J097107
2179.5F89184265P73163J767807J172104J711578R34372O98242Q21000N2108N43289
2188.2F97657928l24325J351471J289368J146087J301499O63452J224594o3629L58429
2196.9G04604874p0038J90582N44968R13620J698532Q21762J239624J8768J31912j36413
2206.5G09958191Q3694Q16651J24206J171189Q49685J580887P97730M58679M99573
2215.2G16340485l03040N51376j64413Q38699N91736R77707J628265J063767R98306
$$ plain form
2223.9 722522888 722340393 722673721 722031631 721974411 722441101 722872314 724046097 724594116 725856705
2232.5 725856705 726008606 726138382 726011276 725632706 725206909 724335480 725186005 725863495 726845551 727268219
2242.2 727268219 727402115 726936493 726009598 726086121 725361786 725561218 725633926 726425552 727403107 727838821
2251.8 727838821 728742599 728595810 728566132 727675247 727412415 727458572 728091736 729276962 729892883 731558151
2261.5 731558151 731949539 732459946 732589188 732437973 732341614 731974182 732657928 732911453 734256973 735040207
2271.1 735040207 736193695 737371063 737364731 737251053 736126251 736405334 736461411 737521515 738935623
2279.8 738935623 739396057 740151520 740406647 741137238 740500183 740201111 739718857 739533997 740240021 740759811
2289.4 740759811 742448883 742903595 743886337 743823090 743260269 743026657 742022400 742340088 741714630
$$ packed form
2223.9G22522888j82495L33328o42090n7220M66690M31213J173783N48019J262589
2232.5G25856705J51901J29776j27106l78570m25797q71429Q50525O77490R82056M22668
2242.2G27268219J33896m65622r26895P6523p24335J99432P2708P91626R77555M35714
2251.8G27838821R03778j46789k9678q90885k62832M6157O33164J185226O15921J665268
2261.5G31558151L91388N10407J29242j51215r6359l67432O83746K53525J345520P83234
2271.1G35040207J153488J177368o332j13678j124802K79083N6077J060104J414108
2279.8G38935623M60434P55463K55127P30591o37055k99072m82254j84860P06024N19790
2289.4G40759811J689072M54712R82742o3247n62821k33612j004257L17688o25458
$$ plain form
2298.1 741714630 742424850 743381805 744328461 744684143 743460007 742840271 741108475 740618820 739838257
2306.8 739838257 739798126 740547180 740896149 741955261 741731567 742397156 741616745 740942917 740347137 739426727
2316.4 739426727 739680328 739002838 740013885 740462112 740970840 740738220 740216064 739050522 736930847
2325.1 736930847 737406158 737328949 738907166 738359299 737591476 738712311 738765030 738559341 736743622
2333.8 736743622 737576675 737237091 736778641 736350174 736751633 738365555 737822418 739416656 738815308
2342.5 738815308 738372345 737638245 737007828 737147141 736881485 739252090 741746063 744089050 743328400
2351.2 743328400 741686401 740780716 739826736 738826752 736829910 739190521 738519745 739998169 742134247
2359.8 742134247 742337418 742017746 738947906 739999466 738878784 741017303 742445221 741239624 741304245
$$ packed form
2298.1G41714630P10220R56955R46656L55682j224136o19736j731796m89655p80563
2306.8G39838257m0131P49054L48969J059112k23694O65589p80411o73828n95780r20410
2316.4G39426727K53601o77490J011047M48227N08728k32620n22156j165542k119675
2325.1G36930847M75311p7209J578217n47867p67823J120835N2719k05689j815719
2333.8G36743622Q33053l39584m58450m28467M01459J613922n43137J594238o01348
2342.5G38815308m42963p34100o30417J39313k65656K370605K493973K342987p60650
2351.2G43328400j641999r05685r53980r99984j996842K360611o70776J478424K136078
2359.8G42134247K03171l19672l069840J051560j120682K138519J427918j205597O4621
$$ plain form
2368.5 741304245 742298889 744740982 743936005 744027100 743616638 744028015 743952103 743385315 745037766 745904388
2378.2 745904388 747523880 748044357 748509750 748643036 747913208 747408524 746528549 747035370 747443390
2386.8 747443390 748443604 749248734 749617157 750159225 749587250 748958817 747874069 747329788 746647873
2395.5 746647873 746837234 747469254 747784576 748709564 748473892 748489227 747685242 746920853 746104889 745083237
2405.2 745083237 745489807 745755692 746536713 746598434 747032242 747320328 746732559 746157913 745181351 744889679
2414.8 744889679 744134216 744492645 745061340 745540924 746387100 746454773 746075668 744471436 743708649 742930603
2424.5 742930603 742719574 743011475 743473129 744645157 744449234 744983215 744518204 743344193 742574081
2433.1 742574081 741628571 741510544 741312103 741573257 741649475 742410583 742584686 742100906 741452103 739512482
$$ packed form
2368.5G41304245R94644K442093q04977R1095m10462M11377p5912n66788J652451Q66622
2378.2G45904388J619492N20477M65393J33286p29828n04684q79975N06821M08020
2386.8G47443390J000214Q05130L68423N42068n71975o28433j084748n44281o81915
2395.5G46647873J89361O32020L15322R24988k35672J5335q03985p64389q15964j021652
2405.2G45083237M06570K65885P81021O1721M33808K88086n87769n74646r76562k91672
2414.8G44889679p55463L58429N68695M79584Q46176O7673l79105j604232p62787p78046
2424.5G42930603k11029K91901M61654J172028j95923N33981m65011j174011p70112
2433.1G42574081r45510j18027j98441K61154P6218P61108J74103m83780o48803j939621
$$ plain form
2442.8 739512482 738339615 737717972 738015976 738114319 738202057 738188934 737755051 737576675 736349411 735652771
2452.4 735652771 734381256 733246765 732617035 732080536 732070770 731815567 732303772 731486130 730436554
2461.1 730436554 729123230 727460785 726215973 724958115 724880676 724247665 724138870 723438873 722049179
2469.8 722049179 720444412 718255844 716819611 714396057 712786636 711255188 709866180 708719711
2477.5 708719711 706938553 705624466 703083496 700206299 696592178 693726883 691406937 688540421
2485.2 688540421 686023941 682960587 680593948 677185516 673344116 669186020 664171371 659122238
2492.9 659122238 653613510 648754196 643494644 638742981 633554955 627592812 621566467 614869690
2500.6 614869690 608676796 601754112 594529839 587333145 580535355 573510437 565732193 557944794
$$ packed form
2442.8G39512482j172867o21643K98004R8343Q7738j3123m33883j78376j227264o96640
2452.4G35652771j271515j134491o29730n36499r766k55203M88205q17642j049576
2461.1G30436554j313324j662445j244812j257858p7439o33011j08795o99997j389694
2469.8G22049179j604767k188568j436233k423554j609421j531448j389008j146469
2477.5G08719711j781158j314087k540970k877197l614121k865295k319946k866516
2485.2F88540421k516480l063354k366639l408432l841400m158096n014649n049133
2492.9F59122238n508728m859314n259552m751663n188026n962143o026345o696777
2500.6F14869690o192894o922684p224273p196694o797790p024918p778244p787399
$$ plain form
2508.3 557944794 549678802 541182556 531107445 521018677 510962639 500646591 491254044 482263832
2516.1 482263832 474598808 467625809 462243118 457905273 454692688 453191223 452172852 452434959
2523.8 452434959 452673264 453566933 455401535 457565498 459722519 461477470 463455811 465005493 466902084
2532.5 466902084 468589211 470773239 473397598 475635338 478202095 481002121 484379234 486509171
2540.2 486509171 488392563 490817604 493100433 495078621 496697464 498828316 500663567 503013649
2547.9 503013649 504934158 506557388 508315849 510035820 512692795 515476875 519828415 525050430
2555.6 525050430 530672302 536289673 541896973 548182602 553719482 559140434 563743744 568643265
2563.3 568643265 573470383 577507935 581221581 584082146 586574440 587492943 588597908 589011459 588627853
$$ packed form
2508.3E57944794q265992q496246j0075111j0088768j0056038j0316048r392547q990212
2516.1D82263832p665024o972999n382691m337845l212585j501465j018371K62107
2523.8D52434959K38305Q93669J834602K163963K157021J754951J978341J549682J896591
2532.5D66902084J687127K184028K624359K237740K566757K800026L377113K129937
2540.2D86509171J883392K425041K282829J978188J618843K130852J835251K350082
2547.9E03013649J920509J623230J758461J719971K656975K784080M351540N222015
2555.6E25050430N621872N617371N607300O285629N536880N420952M603310M899521
2563.3E68643265M827118M037552L713646K860565K492294R18503J104965M13551l83606
$$ plain form
2572 588627853 588454514 588174133 589303055 590059090 591177597 592313957 593472672 595103912 596398544
2580.7 596398544 598089905 599212151 600626984 602022934 604303436 607079124 609354973 612160835
2588.4 612160835 614869652 618095589 621093559 625166168 630062943 635032196 640690689 645951157
2596.1 645951157 650991821 655271912 659262466 662152939 664545898 666065674 666619415 667403717 666997223
2604.8 666997223 667073898 666478729 665132523 663408279 661194382 659391327 656844101 654525375 651363907
2613.5 651363907 648246155 645473022 642734604 640050201 636088905 632059975 627388992 623226547
2621.2 623226547 619298172 615552025 612560158 609773941 608200302 607008247 607096672 607858582 609513435
2629.9 609513435 612228699 615292320 618782158 621836052 625979805 629997978 633885345 637520638
$$ packed form
2572E88627853j73339k80381J128922P56035J118507J136360J158715J631240J294632
2580.7E96398544J691361J122246J414833J395950K280502K775688K275849K805862
2588.4F12160835K708817L225937K997970M072609M896775M969253N658493N260468
2596.1F45951157N040664M280091L990554K890473K392959J519776N53741P84302m06494
2604.8F66997223P6675n95169j346206j724244k213897j803055k547226k318726l161468
2613.5F51363907l117752k773133k738418k684403l961296m028930m670983m162445
2621.2F23226547l928375l746147k991867k786217j573639j192055Q8425P61910J654853
2629.9F09513435K715264L063621L489838L053894M143753M018173L887367L635293
$$ plain form
2637.6 637520638 641147995 645396500 648503265 651503601 654233856 657915573 661572342 664802094
2645.3 664802094 668204651 670680313 673473434 675639343 678172989 680489731 682486038 684600983
2653 684600983 686609726 689720535 692246857 694631424 696356201 698170242 699819336 701107788 703613281
2661.7 703613281 705372696 707281113 709324036 711466904 713314514 714792099 716120529 716810150
2669.4 716810150 717875900 718434448 719737701 720596542 721295624 722419510 722733612 723363113 723314362
2678.1 723314362 723611603 723191299 722750015 722740250 722451859 723041306 723132095 723867416 723686295 723058167
2687.7 723058167 722800293 722192307 722141724 721660156 721801987 721876755 722491989 722772903 721962967 721606216
2697.4 721606216 721349564 721503601 720829620 720515518 720559616 720966797 721492233 720920029 720627975 720436249
$$ packed form
2637.6F37520638L627357M248505L106765L000336K730255L681717L656769L229752
2645.3F64802094L402557K475662K793121K165909K533646K316742J996307K114945
2653F84600983K008743L110809K526322K384567J724777J814041J649094J288452K505493
2661.7G03613281J759415J908417K042923K142868J847610J477585J328430O89621
2669.4G16810150J065750N58548J303253Q58841O99082J123886L14102O29501m8751
2678.1G23314362K97241m20304m41284r765k88391N89447R0789P35321j81121o28128
2687.7G23058167k57874o07986n0583m81568J41831P4768O15234K80914q09936l56751
2697.4G21606216k56652J54037o73981l14102M4098M07181N25436n72204k92054j91726
$$ plain form
2707 720436249 720729294 720282745 719728241 719239273 718616562 718947525 719101105 719352722 719170074 719872131
2716.6 719872131 719890671 718726654 718249054 717784576 718250275 717965622 717732162 717831039 717766113 717761230
2726.3 717761230 717282181 716945648 715970001 715608902 715164337 715102386 715276031 715113144 715645218 715261536
2735.9 715261536 714890366 713929291 713249283 712850800 712311707 712648849 712486572 712712097 712624588 712827225
2745.6 712827225 712940826 712493896 711922073 710935593 710785446 710184555 709835510 709342804 709039383 709180222
2755.2 709180222 708870239 708655701 707695160 707414398 706834259 706564789 706735458 706688004 707047195 706419296
2764.9 706419296 706416550 705894928 705057373 704479675 703877716 703716583 703392563 703968201 704081650 704136047
2774.5 704136047 703484879 702691498 702565384 701689529 701108093 700009766 699800491 699881058 699552994 699452057
$$ packed form
2707G20436249K93045m46549n54504m88968o22711L30963J53580K51617j82648P02057
2716.6G19872131J8540j164017m77600m64478M65699k84653k33460R8877o4926m883
2726.3G17761230m79049l36533r75647l61099m44565o1951J73645j62887N32074l83682
2735.9G15261536l71170r61075o80008l98483n39093L37142j62277K25525q7509K02637
2745.6G12827225J13601m46930n71823r86480j50147o00891l49045m92706l03421J40839
2755.2G09180222l09983k14538r60541k80762n80139k69470J70669m7454L59191o27899
2764.9G06419296k746n21622q37555n77698o01959j61133l24020N75638J13449N4397
2774.5G04136047o51168p93381j26114q75855n81436j098327k09275Q0567l28064j00937
$$ plain form
2784.2 699452057 699217148 699073486 698268204 698329163 697937927 697042236 696244812 695518951 695631027 695586014
2793.8 695586014 695622864 694712067 694134521 693636246 692805710 692030716 691177673 691362991 690604248 690037308
2803.4 690037308 689534683 689227600 689007645 687698669 687085037 686177368 685523987 684408417 683538132
2812.1 683538132 682879410 681393585 680730209 679712753 679003296 678038483 677488327 677221603 676449814
2820.8 676449814 676600342 676516037 676575317 676180344 675593185 674684372 673476791 672517776 671286011 670488281
2830.4 670488281 669385910 668742828 667580566 666019135 664628906 663251572 662391357 660149841 657683411
2839.1 657683411 655053940 653058777 651436234 648907013 646494446 643858719 641995850 639362373
2846.8 639362373 635975876 632471733 628838844 625643425 622342377 619687309 616677437 613319092
$$ packed form
2784.2F99452057k34909j43662q05282O0959l91236q95691p97424p25861J12076m5013
2793.8F95586014L6850r10797n77546m98275q30536p74994q53043J85318p58743n66940
2803.4F90037308n02625l07083k19955j308976o13632r07669o53381j115570q70285
2812.1F83538132o58722j485825o63376j017456p09457r64813n50156k66724p71789
2820.8F76449814J50528q4305N9280l94973n87159r08813j207581r59015j231765p97730
2830.4F70488281j102371o43082j162262j561431j390229j377334q60215k241516k466430
2839.1F57683411k629471j995163j622543k529221k412567k635727j862869k633477
2846.8F39362373l386497l504143l632889l195419l301048k655068l009872l358345
$$ plain form
2854.6 613319092 608914986 604507141 600532455 595928955 591902733 587643013 583855972 580027657
2862.3 580027657 576217804 572524223 568763504 565718307 562467308 559699898 556738777 554012108
2870 554012108 551355247 548921013 547518234 545784950 543813744 541165733 539008179 536940880 535080528
2878.7 535080528 533937645 532623291 531723785 530732079 530155144 528843994 527647896 527032394 526036263
2887.3 526036263 525445480 524474869 524009056 523274040 522873268 522434349 521528625 521807556 521405563 520990982
2897 520990982 520819511 521071510 521954536 523240700 525140572 527310448 530224800 532811966 535946579
2905.7 535946579 538994598 542419205 546767426 550246391 553900375 557183304 560860748 564351692
2913.4 564351692 566719055 568556175 570122604 572083015 573274574 573924217 573914757 574561005 575833054
$$ packed form
2854.6F13319092m404106m407845l974686m603500m026222m259720l787041l828315
2862.3E80027657l809853l693581l760719l045197l250999k767410k961121k726669
2870E54012108k656861k434234j402779j733284j971206k648011k157554k067299j860352
2878.7E35080528j142883j314354q99506r91706n76935j311150j196098o15502r96131
2887.3E26036263n90783r70611m65813p35016m00772m38919r05724K78931m01993m14581
2897E20990982j71471K51999Q83026J286164J899872K169876K914352K587166L134613
2905.7E35946579L048019L424607M348221L478965L653984L282929L677444L490944
2913.4E64351692K367363J837120J566429J960411J191559O49643r460O46248J272049
$$ plain form
2922.1 575833054 576414108 577027702 577796555 578160210 577633553 578246460 578952255 579403267 579658279 579421921
2931.7 579421921 579809303 579775696 580270081 580205498 579996376 580178375 580418434 581320381 581797180 582873726
2941.3 582873726 583314400 583708267 584267731 584368477 584869804 584534073 584150124 583964691 584382172 584605331
2951 584605331 585278206 586306267 586083832 586389656 586722603 587768936 589089165 590148392 590794296
2959.7 590794296 590989799 591947784 592008629 591164513 589454880 588498650 587641678 585625420 584120712
2968.3 584120712 582640762 581710777 580415268 578884430 577475777 576087646 574337196 571952057
2976.1 571952057 570481911 568733788 567274132 566139679 564939651 563729248 562065887 560555916
2983.8 560555916 559063873 558546410 557851601 557054062 556452332 556006966 556369781 556412201 556762390 557146950
$$ packed form
2922.1E75833054N81054O13594P68853L63655n26657O12907P05795M51012K55012k36358
2931.7E79421921L87382l3607M94385o4583k09122J81999K40059R01947M76799J076546
2941.3E82873726M40674L93867N59464J00746N01327l35731l83949j85433M17481K23159
2951E84605331O72875J028061k22435L05824L32947J046333J320229J059227O45904
2959.7E90794296J95503R57985O0845q44116j709633r56230q56972k016258j504708
2968.3E84120712j479950r29985j295509j530838j408653j388131j750450k385139
2976.1E71952057j470146j748123j459656j134453j200028j210403j663361j509971
2983.8E60555916j492043n17463o94809p97539o01730m45366L62815M2420L50189L84560
$$ plain form
2993.4 557146950 557581444 557352295 557226524 557841110 557980957 558720398 559043503 559038010 559022369 559572105
3003.1 559572105 559883728 558886337 558234367 557587280 557155113 555987358 554839630 553748131 552368965
3011.7 552368965 551213303 549178505 547780190 545800552 543667564 541523781 539286957 538517990
3019.5 538517990 538220215 538696060 539184265 540679893 542499580 544172821 546598015 549482918 554405212
3028.1 554405212 559883575 566035500 572683487 579478989 586362038 592421112 598354759 602726555
3035.9 602726555 606262245 609106178 611851578 614255180 615616989 616969452 617464981 618255043 618304482
3044.5 618304482 617775650 617139091 616779480 617485580 617644691 617926712 617614784 617498169 617266998 616755371
3054.2 616755371 616648140 616004906 615561523 614633064 614700127 614824982 614467812 614351845 613796005 613375015
$$ packed form
2993.4E57146950M34494k29149j25771O14586J39847P39441L23105n493j5641N49736
3003.1E59572105L11623r97391o51970o47087m32167j167755j147728j091499j379166
3011.7E52368965j155662k034798j398315j979638k132988k143783k236824p68967
3019.5E38517990k97775M75845M88205J495628J819687J673241K425194K884903M922294
3028.1E54405212N478363O151925O647987O795502O883049O059074N933647M371796
3035.9F02726555L535690K843933K745400K403602J361809J352463M95529P90062M9439
3044.5F18304482n28832o36559l59611P06100J59111K82021l11928j16615k31171n11627
3054.2F16755371j07231o43234m43383r28459O7063J24855l57170j15967n55840m20990
$$ plain form
3063.8 613375015 612432251 612770424 613039551 612667351 612417984 611874046 611718750 610844917 610127029 609380341
3073.5 609380341 609174500 609154930 608950272 608890686 608018951 607720947 607365532 607396088 606905136 606039391
3083.1 606039391 605712624 605030823 604864693 604095917 603617439 602983932 602669106 602662315 601794968 601613350
3092.7 601613350 600801277 600206108 599366531 598538055 598683472 598617973 598726692 598014145 597062874 596304398
3102.4 596304398 595656471 594635391 594253197 594678535 594386444 594161987 593577728 593171883 592311974
3111.1 592311974 591793633 591533394 590521088 590095482 588959770 588405724 588055458 587439270 587216644
3119.8 587216644 587101479 586905212 585270081 584370842 584254112 583865967 582936859 582322693 582327499 581863518
3129.4 581863518 581713905 580658302 579785461 578971519 578126602 577993469 577404404 577344856 577263184 576983376
$$ packed form
3063.8F13375015r42764L38173K69127l72200k49367n43938j55296q73833p17888p46688
3073.5F09380341k05841j9570k04658n9586q71735k98004l55415L0556m90952q65745
3083.1F06039391l26767o81801j66130p68776m78478o33507l14826o791q67347j81618
3092.7F01613350q12073n95169q39577q28476J45417o5499J08719p12547r51271p58476
3102.4E96304398o47927j021080l82194M25338k92091k24457n84259m05845q59909
3111.1E92311974n18341k60239j012306m25606j135712n54046l50266o16188k22626
3119.8E87216644j15165j96267j635131q99239j16730l88145r29108o14166M806m63981
3129.4E81863518j49613j055603q72841q13942q44917j33133n89065n9548q1672k79808
$$ plain form
3139 576983376 575686188 574401474 574085426 573595810 572909813 571769257 571496773 571155548 570725822
3147.7 570725822 570050621 569258842 569098549 568553543 568315697 566976280 565704842 565166969 564396172
3156.4 564396172 563809166 563443451 563321075 562245369 561614265 560758591 560005379 559954758 559403000 558506012
3166 558506012 556921806 556606789 556180153 555547829 554918365 553506546 552667274 551791840 551359825 550151863
3175.7 550151863 549452286 549007072 547646866 547234344 546751328 546448097 545399437 544423180 544035301
3184.4 544035301 543391647 542798004 542071571 541642342 540554848 539653358 538932228 538637619 537926559
3193 537926559 536532097 536023026 535000992 534752083 534185944 533186340 532771416 531990395 531402855 530388603
3202.7 530388603 529855766 529137535 528463669 527945557 527290192 527056274 525706100 524480209 523946419
$$ packed form
3139E76983376j297188j284714l16048m89616o85997j140556k72484l41225m29726
3147.7E70725822o75201p91779j60293n45006k37846j339417j271438n37873p70797
3156.4E64396172n87006l65715j22376j075706o31104q55674p53212n0621n51758q96988
3166E58506012j584206l15017m26636o32324o29464j411819q39272q75434m32015j207962
3175.7E50151863o99577m45214j360206m12522m83016l03231j048660r76257l87879
3184.4E44035301o43654n93643p26433m29229j087494r01490p21130k94609p11060
3193E37926559j394462n09071j022034k48909n66139r99604m14924p81021n87540j014252
3202.7E30388603n32837p18231o73866n18112o55365k33918j350174j225891n33790
$$ plain form
3211.4 523946419 523329773 522247391 521526222 521205864 520546379 519945450 519087982 518455505 517143059
3220 517143059 516389084 515975075 515214539 515069389 514307594 513875732 513027916 512102089 511582069 510919914
3229.7 510919914 510251312 509417953 509415131 508696594 507714882 506572723 505548325 505064964 504324799 504170265
3239.3 504170265 503424873 503256111 502950134 502152443 501998634 501307678 500924377 500583382 500207253 499393425
3249 499393425 498730850 498245430 497691841 497733574 497116890 496529541 496009827 495700188 495294724 494849091
3258.6 494849091 494564400 493723907 493209534 492342949 491922874 491682739 491442451 491532173 491185722 491055794
3268.3 491055794 490332146 489503517 488612900 487941399 487274704 486523437 486728477 486205215 485410652 485071754
3277.9 485071754 485055618 484463120 483223114 482334366 481591606 481273994 480799179 480209274 479151230
$$ packed form
3211.4E23946419o16646j082382p21169l20358o59485o00929q57468o32477j312446
3220E17143059p53975m14009p60536j45150p61795m31862q47816r25827n20020o62155
3229.7E10919914o68602q33359k822p18537r81712j142159j024398m83361p40165j54534
3239.3E04170265p45392j68762l05977p97691j53809o90956l83301l40995l76129q13828
3249D99393425o62575m85420n53589M1733o16684n87349n19714l09639m05464m45633
3258.6D94849091k84691q40493n14373q66585m20075k40135k40288Q9722l46451j29928
3268.3D91055794p23648q28629q90617o71501o66695p51267K05040n23262p94563l38898
3277.9D85071754j6136n92498j240006q88748p42760l17612m74815n89905j058044
$$ plain form
3286.6 479151230 478493996 478142471 477540092 477466125 476683731 476273079 475884743 474990807 474231453 473356934
3296.2 473356934 472485733 471365166 470701218 469825020 468924103 468300667 467807159 467166214 466549301
3304.9 466549301 466217880 465233383 464823990 463794250 462512283 461604195 460330276 459614334 458419418
3313.6 458419418 457798119 457094269 456271553 455642929 454363327 453174400 451957474 451728477 450875397
3322.3 450875397 449547234 449164886 448911285 448002739 446189957 445049248 443833008 442703438 441871147
3330.9 441871147 440949326 439898949 438687439 438096962 437485580 436866341 435631142 434597511 433428879
3339.6 433428879 431997185 431482277 430808105 429756889 427783966 426920357 426309624 425085907 424671860
3348.3 424671860 423695679 422798195 421359024 420088539 418915100 417595634 416684418 415428810 414865074
$$ packed form
3286.6D79151230o57234l51525o02379p3967p82394m10652l88336q93936p59354q74519
3296.2D73356934q71201j120567o63948q76198r00917o23436m93508o40945o16913
3304.9D66549301l31421r84497m09393j029740j281967r08088j273919p15942j194916
3313.6D58419418o21299p03850q22716o28624j279602j188927j216926k28997q53080
3322.3D50875397j328163l82348k53601r08546j812782j140709j216240j129570q32291
3330.9D41871147r21821j050377j211510n90477o11382o19239j235199j033631j168632
3339.6D33428879j431694n14908o74172j051216j972923q63609o10733j223717m14047
3348.3D24671860r76181q97484j439171j270485j173439j319466r11216j255608n63736
$$ plain form
3357 414865074 414135818 413585854 412782135 411773834 410756340 409489594 408689079 407325706 406892166
3365.7 406892166 406078758 404554558 403281136 402461205 402319374 400874443 399970016 399168777 397970581
3374.3 397970581 396969109 396072159 395388222 394070892 393826523 393248138 391996040 391189804 390797424
3383 390797424 390434685 388950157 387758369 387171059 387074394 386413956 385457497 385034943 384866524 384468803
3392.7 384468803 382934494 382405739 382194672 381682739 380892525 379949760 379576225 378778725 378427162
3401.3 378427162 378093224 377668610 376811829 376200256 376200485 375633812 375162468 374288330 374100876 374105148
3411 374105148 374103889 373859024 372983589 372755470 372114868 371943588 371393089 370973015 370906487 369975777
3420.6 369975777 369785957 369861641 370331039 370339050 370576591 371035728 371053352 370995712 370669289 370869217
$$ packed form
3357D14865074p29256n49964q03719j008301j017494j266746q00515j363373m33540
3365.7D06892166q13408j524200j273422q19931j41831j444931r04427q01239j198196
3374.3C97970581j001472q96950o83937j317330k44369n78385j252098q06236l92380
3383C90797424l62739j484528j191788n87310r6665o60438r56459m22554j68419l97721
3392.7C84468803j534309n28755k11067n11933p90214r42765l73535p97500l51563
3401.3C78427162l33938m24614q56781o11573K29n66673m71344q74138j87454M272
3411C74105148j259k44865q75435k28119o40602j71280n50499m20074o6528r30710
3420.6C69975777j89820P5684M69398Q011K37541M59137J7624n7640l26423J99928
$$ plain form
3430.3 370869217 370005531 369949913 370472031 370407257 370902138 371072159 371345291 370830765 370904961 370974770
3439.9 370974770 371069641 371849213 371354179 371891861 372598267 372915726 372593460 371428070 371947021 372962151
3449.6 372962151 373519936 373805275 374641342 375226135 375581741 375991974 376190338 376870308 377755814 378593369
3459.2 378593369 378441620 378320580 378769112 379180603 379710464 380629578 381834145 382062721 382235909
3467.9 382235909 382469368 382549667 382841873 383409691 383768921 383925514 384591179 384699135 385531807 386085701
3477.5 386085701 386330528 387325897 387406082 387609749 386923485 386893196 388307686 388960457 389827042 390249176
3487.2 390249176 389305573 389285355 390684471 391023560 391642570 392612381 392806358 393090706 393233414 393677711
3496.8 393677711 393788757 394551048 394860764 394652443 395555038 395573807 395077171 394751740 396034622 397257881
$$ packed form
3430.3C70869217q63686n5618N22118o4774M94881J70021K73132n14526P4196O9809
3439.9C70974770R4871P79572m95034N37682P06406L17459l22266j165390N18951J015130
3449.6C72962151N57785K85339Q36067N84793L55606M10233J98364O79970Q85506Q37555
3459.2C78593369j51749j21040M48532M11491N29861R19114J204567K28576J73188
3467.9C82235909K33459Q0299K92206N67818L59230J56593O65665J07956Q32672N53894
3477.5C86085701K44827R95369Q0185K03667o86264l0289J414490O52771Q66585M22134
3487.2C90249176r43603k0218J399116L39089O19010R69811J93977K84348J42708M44297
3496.8C93677711J11046P62291L09716k08321R02595J8769m96636l25431J282882J223259
$$ plain form
3506.5 397257881 397469597 398072624 397158928 396714211 398145599 399746895 400543327 400461769 399801254
3515.1 399801254 400152779 401343040 401168785 401403465 401512222 401728210 402666206 402366867 401017265
3523.8 401017265 400639915 402532959 403320618 402396889 401563072 401398087 402465630 402837715 403455238
3532.5 403455238 403886032 403725014 404123306 403713722 403166504 403956566 404624786 404206276 404162292 404526482
3542.1 404526482 404409637 404498901 404379120 403856049 403631020 402843437 403376083 404784164 405196381 404631386
3551.8 404631386 402617531 403371582 404451981 404321404 404797058 403651657 404074326 405190659 404807129
3560.5 404807129 404264641 405049133 405547409 404930763 407430840 405753365 403193626 402895393 401913185
3569.1 401913185 405687027 406789055 407108536 407943649 408303070 408888626 409016342 410089188 409195366
$$ packed form
3506.5C97257881K11716O03027r13696m44717J431388J601296P96432q1558o60515
3515.1C99801254L51525J190261j74255K34680J08757K15988R37996k99339j349602
3523.8D01017265l77350J893044P87659r23729q33817j64985J067543L72085O17523
3532.5D03455238M30794j61018L98292m09584n47218P90062O68220m18510m3984L64190
3542.1D04526482j16845Q9264j19781n23071k25029p87583N32646J408081M12217n64995
3551.8D04631386k013855P54051J080399j30577M75654j145401M22669J116333l83530
3560.5D04807129n42488P84492M98276o16646K500077j677475k559739k98233r82208
3569.1D01913185L773842J102028L19481Q35113L59421N85556J27716J072846q93822
$$ plain form
3577.8 409195366 410300179 411105576 411107140 412931442 413720703 414351845 414434700 417202148 416706467 414338722
3587.5 414338722 415199966 413220100 416753960 419723396 421870842 421668930 421223030 423892441 421221046
3596.1 421221046 423186150 426415749 426865921 428855782 428969765 429634590 431403732 433185387 434620132
3604.8 434620132 436639709 437103004 435753784 439682121 438426552 437588997 444283791 444456444 442352867
3613.5 442352867 446093292 444641647 448059044 451669044 450237312 451954727 450508232 451803513
3621.2 451803513 454700203 456443443 458032150 459361458 460453300 461053009 465495872 461414146
3628.9 461414146 453065414 459244690 464965210 470420494 470422516 469091797 471127701 473613243 475151215
3637.6 475151215 474686775 476025200 477646255 479329796 479216080 478977165 481130180 483892403 487175407
$$ packed form
3577.8D09195366J104813Q05397J564J824302P89261O31142Q2855K767448m95681k367745
3587.5D14338722Q61244j979866L533860K969436K147446k01912m45900K669411k671395
3596.1D21221046J965104L229599M50172J989861J13983O64825J769142J781655J434745
3604.8D34620132K019577M63295j349220L928337j255569q37555O694794J72653k103577
3613.5D42352867L740425j451645L417397L610000j431732J717415j446495J295281
3621.2D51803513K896690J743240J588707J329308J091842N99709M442863m081726
3628.9D61414146q348732O179276N720520N455284K022j330719K035904K485542J537972
3637.6D75151215m64440J338425J621055J683541j13716k38915K153015K762223L283004
$$ plain form
3646.3 487175407 482865944 480382652 484769745 485225029 482350044 482006226 488092270 492397881 495659752
3655 495659752 497667007 489752998 491986122 496811371 496870689 496972351 498032875 499628220 499285507
3663.6 499285507 499397736 500696831 500059357 502000580 501651459 497393417 494890709 485515442 487078400
3672.3 487078400 491570320 492285538 476749268 441382866 446840019 461903725 475505257 481078682
3680 481078682 485326042 490068779 492701263 494829941 495409088 497166557 502037354 508076134 499987335
3688.7 499987335 498852997 509225311 507446938 510600395 517481804 520430031 524192848 525901566
3696.4 525901566 526885452 528704872 529974289 532544594 534137268 528206711 527140427 533081055
3704.1 533081055 534624100 534152603 534437752 536740685 538686981 530897331 535104790 537333450 524810867
$$ packed form
3646.3D87175407m309463k483292M387093M55284k874985l43818O086044M305611L261871
3655D95659752K007255p914009K233124M825249N9318J01662J060524J595345l42713
3663.6D99285507J12229J299095o37474J941223l49121m258042k502708r375267J562958
3672.3D87078400M491920P15218j5536270l5366402N457153J5063706J3601532N573425
3680D81078682M247360M742737K632484K128678N79147J757469M870797O038780q088799
3688.7D99987335j134338J0372314j778373L153457O881409K948227L762817J708718
3696.4E25901566R83886J819420J269417K570305J592674n930557j066284N940628
3704.1E33081055J543045m71497K85149K302933J946296p789650M207459K228660j2522583
$$ plain form
3712.8 524810867 530356941 535450935 536378326 537970886 540083885 540204163 536492462 537707024 542717934
3721.5 542717934 537363968 533576851 539117126 540735092 541463585 539027786 539397774 543665733 545277824
3730.2 545277824 550297966 545958633 538442497 546710091 544938126 534958763 537076721 539635735
3737.9 539635735 540514145 543497505 545977173 541751747 545179253 556770020 541453934 527940788
3745.6 527940788 540042267 546123734 552333450 545596352 533180122 544535675 538441620 533010368
3753.3 533010368 541339912 546061172 547417908 541960526 545031052 550214233 541755829 541321983
3761 541321983 546039314 547154274 547748909 550526123 546699753 542072983 545896034 550259819 548732681
3769.7 548732681 539873161 543100586 547407646 547411728 548076248 548062630 549392738 549427948 550741844
$$ packed form
3712.8E24810867N546074N093994R27391J592560K112999J20278l711701J214562N010910
3721.5E42717934n353966l787117N540275J617966P28493k435799L69988M267959J612091
3730.2E45277824N020142m339333p516136Q267594j771965r979363K117958K559014
3737.9E39635735Q78410K983360K479668m225426L427506J1590767j5316086j3513146
3745.6E27940788J2101479O081467O209716o737098j2416230J1355553o094055n431252
3753.3E33010368Q329544M721260J356736n457382L070526N183181q458404m33846
3761E41321983M717331J114960N94635K777214l826370m626770L823051M363785j527138
3769.7E48732681q859520L227425M307060M082O64520j3618J330108L5210J313896
$$ plain form
3778.4 550741844 548633957 540345039 544106865 546497040 547006569 547874222 544477348 544953156 546141396
3787.1 546141396 546372185 547168427 547803574 547945671 547296524 547423439 546965179 547907562 549125328
3795.8 549125328 543941612 541110458 543962822 547839394 551625862 541864090 531912880 538643646
3803.5 538643646 543665237 549262848 554068718 541880417 538264809 544332657 546932602 546540794
3811.2 546540794 546242371 546126518 547000084 550834885 545236435 533469048 540356216 546254044 549766655
3819.9 549766655 547356224 529726524 534326363 541188011 543806229 545973320 544567184 541468124
3827.6 541468124 543020477 544705315 547147179 546319733 537144432 540536346 546967087 540658722
3835.3 540658722 541858711 549625549 537932663 533925285 540784187 536050835 538380852 545957298
$$ packed form
3778.4E50741844k107887q288918L761826K390175N09529Q67653l396874M75808J188240
3787.1E46141396K30789P96242O35147J42097o49147J26915m58260R42383J217766
3795.8E49125328n183716k831154K852364L876572L786468r761772r951210O730766
3803.5E38643646N021591N597611M805870j2188301l615608O067848K599945l91808
3811.2E46540794k98423j15853Q73566L834801n598450j1767387O887168N897828L512611
3819.9E49766655k410431j7629700M599839O861648K618218K167091j406136l099060
3827.6E41468124J552353J684838K441864q27446r175301L391914O430741o308365
3835.3E40658722J199989P766838j1692886m007378O858902m733352K330017P576446
$$ plain form
3843 545957298 542507935 538367386 541826744 543347282 543385849 544523621 542778778 544458237 548417397
3851.7 548417397 540764008 539011459 522947197 528001671 540115662 539231224 538053970 541342545
3859.4 541342545 543713303 545187874 538938141 539087067 543735733 537007523 534047890 539007301
3867.1 539007301 544381142 548685112 538639259 529290428 534726143 541854820 543526726 533820992
3874.8 533820992 535795326 540590706 540604172 543126984 546616058 537864761 531880035 539175949 540692329
3883.5 540692329 541577187 544790611 531108017 533470764 538953438 539925499 543272552 539918823
3891.2 539918823 532620811 535957298 539678154 538256989 538968697 539501648 540628662 540503006 530734215
3899.9 530734215 536831779 538528938 533353424 537971039 533117256 532385254 534159546 536158676
$$ packed form
3843E45957298l449363m140549L459358J520538L8567J137772j744843J679459L959160
3851.7E48417397p653389j752549j6064262N054474J2113991q84438j177254L288575
3859.4E41342545K370758J474571o249733J48926M648666o728210k959633M959411
3867.1E39007301N373841M303970j0045853r348831N435715P128677J671906r705734
3874.8E33820992J974334M795380J3466K522812L489074q751297n984726P295914J516380
3883.5E40692329Q84858L213424j3682594K362747N482674R72061L347053l353729
3891.2E39918823p298012L336487L720856j421165P11708N32951J127014j25656r768791
3899.9E30734215O097564J697159n175514M617615m853783p32002J774292J999130
$$ plain form
3907.6 536158676 538777924 537870407 537767525 537473526 537722588 537245216 537236481 538640671 538461380 533952522
3917.3 533952522 532174492 537865067 536444740 532243271 535294800 536891441 537252998 534233437
3925 534233437 531921425 534394722 536820564 536882095 534084358 534128876 535695457 532578735 531452751
3933.7 531452751 533404655 533609886 534033852 534428444 533885651 533474159 533072243 534488144 533892250
3942.3 533892250 529216309 529497719 531347656 532456207 533889236 532204781 532001572 531759033 529392052
3951 529392052 530917282 531335907 530924683 531599121 531466217 531498985 531066628 531711197 531358070 531302567
3960.7 531302567 531387444 529288940 529544373 530295372 530629845 530670509 530689240 531006966 529638176 528897247
3970.3 528897247 529306107 529511604 528857880 528417091 529320488 530175743 530099792 529916534 529669380 528944244
$$ packed form
3907.6E36158676K619248r07517j02882k93999K49062m77372q735J404190j79291m508858
3917.3E33952522j778030N690575j420327m201469L051529J596641L61557l019561
3925E34233437k312012K473297K425842O1531k797737M4518J566581l116722j125984
3933.7E31452751J951904K05231M23966L94592n42793m11492m01916J415901n95894
3942.3E33892250m675941K81410J849937J108551J433029j684455k03209k42539k366981
3951E29392052J525230M18625m11224O74438j32904L2768m32357O44569l53127n5503
3960.7E31302567Q4877k098504K55433P50999L34473M0664J8731L17726j368790p40929
3970.3E28897247M08860K05497o53724m40789R03397Q55255p5951j83258k47154p25136
$$ plain form
3980 528944244 529365082 529588013 529223366 529474182 529756813 529728279 529087677 528811226 528350372 528344345
3989.6 528344345 528488770 528223305 528586998 528894768 529360580 528918266 528872070 529236069 528532181 528476562
3999.2 528476562 528925896
4000.2 528925896
$$ packed form
3980E28944244M20838K22931l64647K50816K82631k8534o40602k76451m60854o027
3989.6E28344345J44425k65465L63693L07770M65812m42314m6196L63999p03888n5619
3999.2E28476562M49334
4000.2E28925896
##END=$$ End of the data block
