##TITLE=$$ Begin of the data block
##JCAMP-DX=5.00 $$ ACD/SpecManager v 10.08
##SPECTROMETER/DATA SYSTEM=Varian
##DATE=21 Jan 2013 15:37:04
##DATA TYPE=INFRARED SPECTRUM
##DATA CLASS=XYDATA
##ORIGIN=
##OWNER=
##NPOINTS=3735
##FIRSTX=399.26403809
##LASTX=4000.35498047
##MAXX=4000.35498047
##MINX=399.26403809
##MAXY=79.41275024
##MINY=42.95755005
##XFACTOR=1.0000000000
##YFACTOR=0.000000100000000
##FIRSTY=64.04001617
##DELTAX=0.96440572
##XUNITS=1/CM
##YUNITS=TRANSMITTANCE
##XYDATA=(X++(Y..Y))
399.3F40400162K3174896j1844254r067993M614716J810150n554657o921310L194084
407F39805794q58803n967484l024787N29937O262322N532074M754257j90659l655548
415.7F43187103l332061r400177k2320138J659165J9759598M672851k23961l036880
423.4F30965500o64368Q145790L055764n238686l29933M219970n91621p290687l101082
432.1F29170647J93290k67219L327293L677864M224816j446457l611336J239891m486999
440.7F32021790n947113k311898m348068K104568N134888J739960K083511K451096
448.4F32928734k255440j473999M811554M29573o784592l484726l48205L60451o41022
457.1F23542328J11046M774475M60777J36795j81389m137191K041969J519279J092911
$$ y = [640400162, 663575058, 651730804, 642662811, 647277527, 649087677, 643533020, 636611710, 639805794, 638946991, 632979507, 629954720, 630484657, 636746979, 642279053, 647033310, 646842651, 643187103, 639855042, 630454865, 608134727, 609793892, 629553490, 634226341, 634002380, 630965500, 630301132, 638446922, 641502686, 636264000, 635934067, 640154037, 639562416, 632271729, 629170647, 629363937, 629096718, 632424011, 636101875, 640326691, 638880234, 635268898, 636508789, 632021790, 626074677, 623762779, 619414711, 621519279, 626654167, 628394127, 630477638, 632928734, 630673294, 629199295, 634010849, 634440422, 627655830, 624171104, 623822899, 624183350, 623542328, 623653374, 628427849, 628888626, 629025421, 628844032, 624706841, 626748810, 628268089, 629361000]
465.8F29361000K683601l491897L5019p47261j411858J715126M756088M234810n840568
474.5F31294060n145760o997337m717980N591698j335220m344406M887924O135216
482.2F25368195N41458n40200J302414k411308k980843j738624j221466j07842p44285
490.9F17467499K858543L755303n49088r95483m578o51550j781769k207909q14895
499.6F17076073O82602k523957k880478L166275K806473L085518j013260n744324K3232
508.2F14678154N65834k93312r9793r60044J35955J817704L392219j121597m296455
516.9F13818665o80047R33457k10037k519265k224998k233505l73612Q33779O00013
525.6F07944450J857186k5368J395302J373939j578331j069603k207870l084641n24253
$$ y = [629361000, 632044601, 628552704, 628587723, 627840462, 626428604, 628143730, 632899818, 637134628, 631294060, 626148300, 619150963, 614432983, 620024681, 618689461, 614345055, 619232979, 625368195, 625909653, 625369453, 626671867, 624260559, 621279716, 619541092, 618319626, 618211784, 617467499, 620326042, 624081345, 623532257, 622536774, 622532196, 621880646, 620098877, 617890968, 617076073, 617758675, 615234718, 612354240, 615520515, 618326988, 621412506, 620399246, 614654922, 614678154, 615243988, 614950676, 614850883, 613890839, 614026794, 615844498, 619236717, 618115120, 613818665, 613138618, 614072075, 613862038, 611342773, 609117775, 606884270, 606510658, 607344437, 607944450, 609801636, 609776268, 611171570, 612545509, 610967178, 609897575, 607689705, 604605064, 604080811]
534.3F04080811K402992J704788M05998J572571J344032J362496m40445l267327l114051
543F06051865k641564k199325o82755J52130J607018L100014J545372J26304k62451
551.6F06796608j518784j366996j764336j982956j212730j670456j59035J545067J460380
560.3F00126762J847191N00298p37839M55818j283035k634697j57890l35121l42713
569E97438774J623230J425934J937904J738968O09131j268616k260780l77998j209221
577.7E99657326k508545p01447J273690J991005J515884J987953J989555o66542j914482
586.4F02624397l79715j407203k638550p97272m46548R3269O07300L65639J410522
595E99431839J605186J148758n51834o46972K30789j642914j655693q67729l67127
$$ y = [604080811, 606483803, 608188591, 608594589, 610167160, 611511192, 612873688, 612433243, 609165916, 606051865, 603410301, 601210976, 600528221, 600680351, 602287369, 605387383, 606932755, 607059059, 606796608, 605277824, 603910828, 602146492, 600163536, 598950806, 597280350, 597121315, 598666382, 600126762, 601973953, 602474251, 601736412, 602192230, 600909195, 598274498, 598116608, 597781487, 597438774, 599062004, 600487938, 602425842, 604164810, 604773941, 603505325, 601244545, 600866547, 599657326, 597148781, 596447334, 597721024, 599712029, 601227913, 603215866, 605205421, 604538879, 602624397, 602244682, 600837479, 598198929, 597401657, 596955109, 597048378, 597655678, 598021317, 599431839, 601037025, 602185783, 601633949, 600986977, 601217766, 599574852, 597919159, 597051430, 596684303]
603.7E96684303J325188K225265J300622q8158K49863J73721j277847j622353j676712
612.4E97293892j697464o66733J19515N51185J844864K454147K139397J345863m96597
621.1F02888069r18808l87955o51893n18074R3612J082497J326599J264305L351937
629.8F07530289L547439P12815m96l52822j755256j535225q3466P64275P52907J906738
639.4F11487198K265167J249695J649551K143593J549149j735268k437248M98581P10029
648.1F17380447L93944M9706P94105K845650K747879P07817j111870r24682j602822
656.8F21280174k176437j794319j103096k60811L34129R86099J492005J583938J595879
665.4F21937561L132248L990288l852577k320328p94754j374855k76108J350098K889518
$$ y = [596684303, 598009491, 600234756, 601535378, 601447220, 601697083, 601870804, 600592957, 598970604, 597293892, 595596428, 594929695, 595049210, 595600395, 597445259, 599899406, 602038803, 603384666, 602888069, 601969261, 601581306, 600929413, 600411339, 600504951, 601587448, 602914047, 604178352, 607530289, 611077728, 611790543, 611790047, 611437225, 609681969, 608146744, 608063278, 608827553, 609580460, 611487198, 613752365, 615002060, 616651611, 618795204, 620344353, 618609085, 616171837, 616670418, 617380447, 617774391, 617824097, 618618202, 621463852, 624211731, 624919548, 623807678, 622882996, 621280174, 619103737, 617309418, 616206322, 615945511, 616279640, 617265739, 618757744, 620341682, 621937561, 625069809, 629060097, 625207520, 622887192, 622092438, 620717583, 620441475, 621791573, 624681091]
674.1F24681091J993103J777001K226486J758537R16176K51770m94728j212120p93762
682.8F31103554J533050L287850J783676K197876K103271J76316P01065o5995j046524
691.5F41774139j125640m48609M85993Q05130J435318O93512N95550J396637J019592
700.2F46631622M57001J37711n03998j373825j463089p56150M80042J759033J607437
708.8F46975784J315003K159805J367035O08902K12021j492615j060562p25632n52139
717.5F48807602R86481K160797K254028J251221J911697J581268K00196L62396l37753
726.2F59177933k119599j395950J648407J792297P19223J302491K515640J925125N67169
734.9F66132736P05109J13830k56500j208420j259002l07999Q17642K110062J298294
$$ y = [624681091, 626674194, 628451195, 630677681, 632436218, 633352394, 633604164, 633109436, 631897316, 631103554, 632636604, 635924454, 637708130, 639906006, 642009277, 642185593, 642886658, 642820663, 641774139, 640648499, 640199890, 640685883, 641491013, 642926331, 643619843, 644215393, 645612030, 646631622, 647088623, 647226334, 646722336, 645348511, 643885422, 643129272, 643609314, 645368347, 646975784, 648290787, 650450592, 651817627, 652426529, 652638550, 651145935, 650085373, 649359741, 648807602, 649794083, 651954880, 654208908, 655460129, 657371826, 658953094, 659153290, 659515686, 659177933, 657058334, 655662384, 657310791, 659103088, 659822311, 661124802, 663640442, 665565567, 666132736, 666837845, 666951675, 666695175, 665486755, 664227753, 663919754, 664737396, 666847458, 668145752]
743.6F68145752J581573J446381J035156J16120n98831L49349j054611j410522j556397
752.2F68053970l7765J465530O60019J599045J090546J183395N2414j116867l10516
760.9F72639771q20847n6305m39453r03092K88468J876144J643753M33808J868133
769.6F76530380R88846n76782J22223l07999j653671j345368j36795K18048J451340
778.3F75290222K162781J084824Q23288J188125J88065m11911j194687j872559N5237
787F77313385N54276K82058Q97675J358795J534500P64847P73086N98374j41678l45154
796.6F83590164l65600j424561j499481q35571k83509J483841M38080J1444P59583
805.3F81874390l88184k34451j90964m04434j153717j423645k5711J016998J108475
$$ y = [668145752, 669727325, 671173706, 672208862, 672324982, 671726151, 672075500, 671020889, 669610367, 668053970, 668016205, 669481735, 670141754, 671740799, 672831345, 674014740, 674067154, 672950287, 672639771, 671818924, 671762619, 671323166, 670420074, 670708542, 672584686, 674228439, 674662247, 676530380, 677519226, 676942444, 677064667, 676756668, 675102997, 673757629, 673620834, 673838882, 675290222, 677453003, 678537827, 679361115, 680549240, 680737305, 680325394, 679130707, 677258148, 677313385, 677867661, 678149719, 679047394, 680406189, 681940689, 682705536, 683478622, 684076996, 683935318, 683590164, 683224564, 681800003, 680300522, 679464951, 679181442, 680665283, 681103363, 681114807, 681874390, 681486206, 681251755, 681060791, 680656357, 679502640, 678078995, 678053284, 679070282, 680178757]
814F80178757J799164K597122K62756j036758N98297O38046j060410l91082J302185
822.6F84888077Q77380J100311R66645N65643J220398J874237J262360j4649m68368
831.3F92272034n94330J240616J388244R94721J363678J27945O98547J490860K062225
840G01044540M82331j319046n15366p03201o60629N5618P18689K00424m60358m40826
849.6F98402176k09732j02616j10855p07702j544571J2207j078873j570663L86657
858.3F93476028P63K55661k78320n16510k28882l10135l68881m24423m28238j269073
868F89907990q25043p11746M47540L56064o65970J97601j186447j028290k06833j91040
877.6F86093826o15005r75571n8441m48303j64109o91299o43539J21002r37042o65436
$$ y = [680178757, 681977921, 684575043, 684837799, 683801041, 684399338, 685037384, 683976974, 683585892, 684888077, 685765457, 686865768, 687832413, 688398056, 689618454, 691492691, 692755051, 692740402, 692272034, 691677704, 692918320, 694306564, 695301285, 696664963, 696792908, 697491455, 698982315, 701044540, 701526871, 700207825, 699692459, 698989258, 698328629, 698384247, 699102936, 699303360, 698843002, 698402176, 698192444, 698089828, 697978973, 697271271, 695726700, 695738907, 694660034, 693089371, 693476028, 693476791, 693732452, 693454132, 692937622, 692708740, 692398605, 692029724, 691605301, 691177063, 689907990, 689082947, 688371201, 688818741, 689174805, 688508835, 688706436, 687519989, 686491699, 686284866, 686093826, 685478821, 684503250, 684444809, 683996506, 683832397, 683141098, 682497559, 682618561, 681681519, 681016083]
887.3F81016083n85556j722489j776733p30972q23059p85141l8605j41678n24139K2201
896.9F73909912J340408O74439K4261M09317O69022J230850J325379P54089n94406
905.6F79743271K70157J573639O86950J03073O75507P57980n73272j152115j018677
914.3F81066513M7684k42615j219788k49328q8425n11017o74209l90778j118240j207428
923.9F75412369r73129j502839n77087q96378j337967j440124p75223q95614j988984
932.6F65025024q17794j114502j146088j275330j715850q41294j621017k069855k084656
941.3F52338638k186126j539612m45023j219330k753677j718140j111526j859131k364845
949.9F37141228j921540j769409k259521j994438j603547j488037j873779j825409
$$ y = [681016083, 680430527, 678708038, 676931305, 676200333, 675377274, 674592133, 674553528, 674411850, 673887711, 673909912, 675250320, 675924759, 675949020, 676358337, 677027359, 678258209, 679583588, 680337677, 679743271, 680013428, 681587067, 682274017, 682377090, 683052597, 683810577, 683237305, 682085190, 681066513, 681114197, 680871582, 679651794, 679402466, 679314041, 678803024, 678128815, 677738037, 676619797, 675412369, 674439240, 672936401, 672359314, 671462936, 670124969, 668684845, 667909622, 667014008, 665025024, 664207230, 663092728, 661946640, 660671310, 658955460, 658114166, 656493149, 654423294, 652338638, 650152512, 648612900, 648167877, 646948547, 644194870, 642476730, 641365204, 639506073, 637141228, 635219688, 633450279, 631190758, 629196320, 627592773, 626104736, 624230957, 622405548]
957.7F22405548j580238j930695k476311k613182j621513j727409k554131j492042
965.4F06410027q66280j473579j568184j382981q74862j164132k207870k323952k247581
974.1E92300606j975403j537933j947480k573318k713280k525787k269325k127457
981.8E74630623j965828k890129l321762k037659k486496k542686k128907k552681
989.5E54704475j904945j560783j219101j436730j342888j413955j978798k273331
997.2E41573944k857590j796531j308518j608429k291527k187042j108551j645241
1004.9E26770515j550102j540680j671447k191124k796250k632141k323685j845893
1012.6E10219193j715851r94873j865578j503182o23130j381989j449089j832962j203957
$$ y = [622405548, 620825310, 618894615, 616418304, 613805122, 612183609, 610456200, 607902069, 606410027, 605543747, 604070168, 602501984, 601119003, 600244141, 599080009, 596872139, 594548187, 592300606, 590325203, 588787270, 586839790, 584266472, 581553192, 579027405, 576758080, 574630623, 572664795, 569774666, 566452904, 564415245, 561928749, 559386063, 557257156, 554704475, 552799530, 551238747, 550019646, 548582916, 547240028, 545826073, 543847275, 541573944, 538716354, 536919823, 535611305, 534002876, 531711349, 529524307, 528415756, 526770515, 525220413, 523679733, 522008286, 519817162, 517020912, 514388771, 512065086, 510219193, 508503342, 507508469, 505642891, 504139709, 503516579, 502134590, 500685501, 498852539, 497648582]
1021.3D97648582j334114j491851j634713j176948q4152m082K02446j315270j352501
1030D89457397j250839p97958o17867j196174M63638j27144K39411O33430O87599J584625
1039.6D89076118J442185Q38776o44188m84772m76418k79159j036034j015739k21024
1048.3D87199745j145935n56145j114196R5367N0774q29125k05154p80258K62909o91948
1058D82286034p34864m7378L12271M85802O61506J449776N45158J652604P88307K99835
1067.6D87699051N85899p4310M10118P81975K182808P63855R73778J272850J106338
1076.3D95702362J914940N72510J258735R94759Q38203N48325Q85429J352005J63803
1085E04231071J449395J720047J638565J062431O82831M32777p11174l88984k95754
$$ y = [497648582, 496314468, 494822617, 493187904, 492010956, 491926804, 491922722, 492125168, 490809898, 489457397, 488206558, 487408600, 486790733, 485594559, 486058197, 485931053, 486170464, 486803894, 487491493, 489076118, 490518303, 491357079, 490712891, 490228119, 489751701, 489472542, 488436508, 487420769, 487199745, 486053810, 485497665, 484383469, 484478836, 484529610, 483700485, 483495331, 482715073, 482977982, 482286034, 481551170, 481503792, 481816063, 482301865, 482963371, 484413147, 484958305, 486610909, 487399216, 487699051, 488284950, 488210640, 488620758, 489402733, 491585541, 492349396, 493323174, 494596024, 495702362, 497617302, 498189812, 499448547, 500443306, 501281509, 501829834, 502715263, 504067268, 504231071, 505680466, 507400513, 509039078, 510101509, 510784340, 511217117, 510505943, 510116959, 509821205]
1093.6E09821205k99835J7052J509208J414376J093330K94380j120758j70250j066208
1102.3E11492500j019134n64270k4262K70157l61214N25437N82924K034530J625252
1111E14561920J039810R83239k65046M57573Q89244J441575J384735K009086K259026
1119.7E24761162K333793K262154J558571J970901J022606K485886K155495J66778
1127.4E38717346J150017P44171J194000K215996K027397J506768K268371K067795
1135.1E51891861M39453O56204R91440M48380m92211J13983K68021K36931J015739
1143.8E55569801L67318O68678P80449O63070k64091q90846n30892j648712j234093
1152.5E53480682q31527m31366N96695N06897L17688N56030N09109m73365l71666k50893
$$ y = [509821205, 509521370, 509538422, 511047630, 512462006, 513555336, 513849716, 512728958, 512558708, 511492500, 510473366, 509909096, 509884834, 510154991, 509793777, 510319214, 510902138, 512936668, 514561920, 515601730, 516584969, 516319923, 516777496, 517666740, 519108315, 520493050, 522502136, 524761162, 527094955, 529357109, 530915680, 532886581, 533909187, 536395073, 538550568, 538717346, 539867363, 540611534, 541805534, 544021530, 546048927, 547555695, 549824066, 551891861, 552331314, 552987518, 553978958, 554427338, 553935127, 554049110, 554317131, 554554062, 555569801, 555937119, 556605797, 557386246, 558049316, 557785225, 556894379, 556363487, 554714775, 553480682, 552649155, 552217789, 552814484, 553321381, 553639069, 554195099, 554704208, 554230843, 553859177, 553608284]
1162.1E53608284J59569P55310J097450J622276J844635L730202M313812L556214L210907
1170.8E73898659L419456L561974K544021J826783J697616K159386K651787K942047
1178.5E94701729K883186K635231K578354K186890J911926J669273J312676J210289
1186.2F11089554J081810J127090J411667J524162J747399J496811Q12072k60047j328354
1194.9F18702164j450730j699257k099723j972771j232491r34219k51808N18341M2458
1203.6F09621964j30921j32027m89997j017151j584130j408615p73773l8757M41475
1212.3F04488068j4000j85433J16349m20685j75820k06451j787377j566848j136017
1220.9E99111786j707802j170158m99611K975N27916N98221M58145l46489q94851r42269
$$ y = [553608284, 553767853, 554523163, 555620613, 557242889, 559087524, 562817726, 567131538, 570687752, 573898659, 577318115, 580880089, 583424110, 585250893, 586948509, 589107895, 591759682, 594701729, 597584915, 600220146, 602798500, 604985390, 606897316, 608566589, 609879265, 611089554, 612171364, 613298454, 614710121, 616234283, 617981682, 619478493, 620290565, 620030518, 618702164, 617251434, 615552177, 613452454, 611479683, 610247192, 609312973, 609061165, 609579506, 609621964, 609491043, 609359016, 608869019, 607851868, 606267738, 604859123, 604085350, 604046593, 604488068, 604474068, 604288635, 604404984, 603984299, 603808479, 603602028, 601814651, 600247803, 599111786, 597403984, 596233826, 595734215, 595737190, 596265106, 596863327, 597321472, 596974983, 596080132, 595137863]
1230.6E95137863j294899j479912j178093l19633K83699M61044Q25196R76181O10313
1239.3E94021759J39427o15616j431579j329956j328697j467972r71298k88964L93601
1247.9E87120705O34536J067353O51092j87034o75126j304779j175384j519394j696434
1256.6E82915535j252174p35856L39890P22618O32439L2425n56984q95043j381340
1265.3E79821510j591339j502876j064224m75769N54237J174736J419334J108132R86633
1274E80430374Q99353M0703l47595o18630k28080n0240P8239J189156J812477K339897
1283.6E85545654K322541K131385J834336J033668N26047J29700j63498L27720L36800
1292.3E94024353N38635J812859K268829K491799J831474P07245L18489l47901p47985
$$ y = [595137863, 593842964, 592363052, 591184959, 590865326, 591149025, 591610069, 592435265, 593411446, 594021759, 594161186, 593545570, 592113991, 590784035, 589455338, 587987366, 587016068, 586727104, 587120705, 587755241, 588822594, 589473686, 589286652, 588611526, 587306747, 586131363, 584611969, 582915535, 581663361, 580927505, 581267395, 581990013, 582622452, 582654877, 582097893, 581202850, 579821510, 578230171, 576727295, 575663071, 575187302, 575741539, 576916275, 578335609, 579443741, 580430374, 581329727, 581370430, 581022835, 580404205, 580176125, 580125885, 580204124, 581393280, 583205757, 585545654, 587868195, 589999580, 591833916, 592867584, 593393631, 593523331, 593359833, 593687553, 594024353, 594562988, 596375847, 598644676, 601136475, 602967949, 603675194, 603993683, 603645782, 602897797]
1301F02897797j097756j099434n54733j53656N93414J169243R52301M00925J80092
1309.7F03288193m52996j320495j506615j661835j801834j053009j15013M61273Q76236
1318.3E96713905J388970J815758J518783N33638j59073n01594j039849j274643n88760
1327E98407135L76816P62863M31328O00738J612549Q45146p76596j380844j495437
1335.7E99383698j333008j092797j189918n89790J255912K194252J996918J877785
1343.4F02503052J475906L59459p32460l77655q66394j591682j177369n25436M49905
1352.1E99517326P37534R59968J004410N66254M38881p31430j751976j397476j922722
1360.8E97420769k221108j744880j283837P61681J136932N08194M33960n56831j358376
$$ y = [602897797, 601800041, 600700607, 600145874, 599992218, 600585632, 601754875, 602707176, 603108101, 603288193, 602835197, 601514702, 600008087, 598346252, 596544418, 595491409, 595376396, 595837669, 596713905, 598102875, 599918633, 601437416, 601971054, 601811981, 601310387, 600270538, 598995895, 598407135, 598783951, 599546814, 599978142, 600578880, 602191429, 603036575, 602259979, 600879135, 599383698, 598050690, 596957893, 595767975, 595178185, 596434097, 598628349, 600625267, 602503052, 603978958, 604338417, 603605957, 603228302, 602361908, 600770226, 599592857, 599067421, 599517326, 600254860, 601214828, 602219238, 602785492, 603224373, 602492943, 600740967, 599343491, 597420769, 595199661, 593454781, 592170944, 592932625, 594069557, 594577751, 595011711, 594454880, 593096504]
1369.4E93096504j194649j493988j037750j191864q32519L63578J619645K386703J895638
1378.1E93611298J897850J646003J044579q6327o08978j66473J23062J171112J791916
1386.8F00424042K278747K959442K958336J938324J276131O08749L6774j764717k299423
1395.5F08416405R46960N36804M74701O43845J387672J877480Q19664L84560n57442
1404.2F14930649k279549k279091j250229j621551j511574n65948k22969K06031P9422
1412.8F05485191L40309j84021q40415j370049k105026r91059n716514j087113J808052
1421.5E95339355R68132J281510J00937J063995Q48961o63681k08969p94983j947823
1430.2E95987434j019592K48146K52075J176796K597771K252693q07457N65872K285119
$$ y = [593096504, 591901855, 590407867, 589370117, 588178253, 587345734, 587709312, 589328957, 591715660, 593611298, 595509148, 597155151, 598199730, 598113403, 597504425, 597337952, 597461014, 598632126, 600424042, 602702789, 605662231, 608620567, 610558891, 611835022, 612443771, 612480545, 610715828, 608416405, 609363365, 609900169, 610374870, 611018715, 612406387, 614283867, 615103531, 615488091, 614930649, 612651100, 610372009, 609121780, 607500229, 605988655, 605422707, 605199738, 605405769, 605485191, 605825500, 605641479, 604801064, 603431015, 601325989, 600334930, 594618416, 593531303, 595339355, 596307487, 597588997, 597689934, 598753929, 599602890, 598939209, 598730240, 597935257, 595987434, 594967842, 595215988, 595468063, 596644859, 599242630, 601495323, 600687866, 601253738, 603538857]
1438.9F03538857Q3885j076889j229439j328011o79435p09153M36898Q67805N68771
1447.6F00473289o16302R06487J107711q80165r29222n00603P14150J28975J01509
1456.2F00505829m06265J43356M867668K710686K728119Q76083K69432J028328k635727
1464.9F10087509j65787J614609K715798K794113M035301M668655L402634L725815
1472.6F32878647J200905L229866L118057K94647P71027K151031K108002K163467J912003
1481.3F49827652K153549K694550J829986J382447P00454j731414k445908K25372j675491
1490F52961197k711868J081771J096192L27911J47782m68750n841599l30429k240143
1498.7F44022064o755371j996307l319664k750969k080269l82080k79083j0513268
$$ y = [603538857, 603622742, 602545853, 601316414, 599988403, 599308968, 598599815, 599036713, 599904518, 600473289, 599856987, 600763474, 601871185, 600991020, 600061798, 599561195, 600275345, 600404320, 600505829, 600099564, 600242920, 605110588, 607821274, 610549393, 611425476, 611694908, 612723236, 610087509, 609921722, 611536331, 614252129, 617046242, 621081543, 625750198, 629152832, 632878647, 634079552, 637309418, 640427475, 640722122, 641493149, 643644180, 645752182, 647915649, 649827652, 651981201, 654675751, 656505737, 657888184, 658588638, 656857224, 654411316, 654636688, 652961197, 650249329, 651331100, 652427292, 652755203, 652902985, 652434235, 646592636, 646262207, 644022064, 637266693, 635270386, 631950722, 629199753, 627119484, 626737404, 626458321, 615945053]
1506.4F15945053n017280J816101K197380j507912j06735p78046k330513J431885J249847
1515.1F12899780K015534J854210K822570O467514N606728J863747j971970R74388
1522.8F32532501M285736L430786J392746K041169L391723K833176L210525L399125
1530.5F56517487K217102K120742r95102k022476K759476K173157J899109J849365
1538.2F66518860p04651m695969M579697K496490J415482L419495p93381k950058Q79822
1546.9F70165787M5547N9433j630478j192016K786636K208176J180267k875595n60303
1555.6F70187454K996674J430130q275299p746353N70526L184814K235413J187439
1563.3F65770798Q66165j288529o73141J69449j045532k225647q952332m80347k07977
$$ y = [615945053, 610927773, 612743874, 614941254, 613433342, 613326607, 612548561, 610218048, 611649933, 612899780, 614915314, 616769524, 619592094, 626059608, 631666336, 633530083, 631558113, 632532501, 636818237, 640249023, 641641769, 643682938, 647074661, 649907837, 653118362, 656517487, 658734589, 660855331, 659860229, 657837753, 660597229, 662770386, 664669495, 666518860, 665814209, 661118240, 665697937, 668194427, 669609909, 673029404, 672236023, 669285965, 670165787, 670211334, 670270767, 668640289, 667448273, 670234909, 672443085, 673623352, 670747757, 670187454, 673184128, 674614258, 666338959, 658592606, 659163132, 662347946, 664583359, 665770798, 666636963, 665348434, 664675293, 664844742, 663799210, 661573563, 652621231, 652140884, 651932907]
1572F51932907j909485j093826l22800n57556j0693931M26597o04362l258744l684883
1580.6F30233917m920234l728524m475860k762642l044701k348518k069435k123299
1588.4F04760704j446075l238793j755066l178291k132034k193032j753502j96380
1596.1E88867531j280708P84339n48019K33498n48211j396789j510353k897873j052361
1604.7E80651054k114601j036529j229286N1002q7929n8403K136650k31895L17993
1613.4E78398056p94868L41911n75295p110405K302933J079521J501503K32506J580391
1622.1E76956253R11560j714859J867371O49299J182061j788826j112366J192551P14378
1630.8E78857422R01871O06155K893867K925530k464790p57943J949654J011162J202316
$$ y = [651932907, 650023422, 648929596, 648606796, 648049240, 637355309, 637781906, 637177544, 633918800, 630233917, 625313683, 621585159, 617109299, 614346657, 611301956, 608953438, 606884003, 604760704, 603314629, 600075836, 598320770, 595142479, 593010445, 590817413, 589063911, 588867531, 587586823, 588371162, 587823143, 588056641, 587508430, 586111641, 584601288, 581703415, 580651054, 578536453, 577499924, 576270638, 576321640, 576233711, 576175308, 578311958, 578080063, 578398056, 577603188, 577945099, 577369804, 570259399, 572562332, 573641853, 575143356, 575375862, 576956253, 577867813, 576152954, 578020325, 578669624, 579851685, 578062859, 576950493, 578143044, 578857422, 579759293, 580365448, 583259315, 586184845, 583720055, 582962112, 584911766, 585922928, 587125244]
1639.5E87125244K77863k64206J589164P29447K364883K801667j6594O46057n88494
1648.1E94665031J511383J859856K499008K319565p017784n140839O397438M814492
1655.9F01908150L140831K690277K200393K047463J195869J379433L24555j472512
1663.6F13414459K523041K211189J844826L494492L923454Q16498K063293M029427
1671.3F34320679K085571K838783L253441J67236j263275L537369L536758K840577
1679F51317139K507782K469940M461899M504699J395569o708755L621597N024719K466812
1687.7F71061401N31006J928177K119217K605286L220672K811356L837433K854233
1695.4F90968781o499024O66809L080597M000092j233063p377548N479660M363174
$$ y = [587125244, 587403107, 587138901, 588728065, 589457512, 591822395, 594624062, 594607468, 595253525, 594665031, 596176414, 598036270, 600535278, 602854843, 595837059, 590696220, 597093658, 601908150, 605048981, 607739258, 609939651, 611987114, 613182983, 614562416, 614886971, 613414459, 615937500, 618148689, 619993515, 623488007, 627411461, 628227959, 630291252, 634320679, 636406250, 639245033, 642498474, 642665710, 641402435, 644939804, 648476562, 651317139, 653824921, 656294861, 660756760, 665261459, 666657028, 659948273, 663569870, 668594589, 671061401, 671592407, 673520584, 675639801, 678245087, 681465759, 684277115, 688114548, 690968781, 684469757, 685136566, 688217163, 692217255, 690984192, 683606644, 689086304, 693449478]
1703.1F93449478J783219M95071J031494j705704M19083J117706j046447k288132j165772
1711.8F92089996k54974j79291r57794k98080K380447o46210p278671J734695J275711
1720.5F87865829o67648j246109j368713j142426L47672Q70132M56162Q54187J022186
1729.1F86991272j583328j791077J338120J071167l010941n731506K008896K528457
1736.9F81821060J989823K712173K75192r54895L549118K160645j410370m36554J486511
1745.5F91192703J287232Q57315J377182K341614M527969K253570J180497M580154
1753.3G09598236K776489K407151K264709o30035J835708L100815L573303L969422
1761G28895798J613311L022614N346375L364944J733932J991272J269837j280518J913147
$$ y = [693449478, 695232697, 695727768, 696759262, 695053558, 695472641, 696590347, 695543900, 693255768, 692089996, 691835022, 691655731, 690697937, 690399857, 692780304, 692134094, 684855423, 686590118, 687865829, 687198181, 685952072, 684583359, 683440933, 683788605, 684658737, 685114899, 685969086, 686991272, 685407944, 683616867, 684954987, 686026154, 683015213, 677283707, 679292603, 681821060, 683810883, 686523056, 686798248, 685843353, 689392471, 691553116, 690142746, 689706192, 691192703, 692479935, 693337250, 694714432, 697056046, 701584015, 703837585, 705018082, 709598236, 712374725, 714781876, 717046585, 716416550, 718252258, 721353073, 724926376, 728895798, 730509109, 733531723, 738878098, 742243042, 743976974, 745968246, 747238083, 745957565, 747870712]
1769.7G47870712L395539L83758j143799J896744N432053L832626Q72498K040176N60455
1778.3G65140762O35376o52313k093735R45053J642838J523437O37207K282868K766571
1787G72828064J094589K49634P91244n06210j861877l039017l30353L378067J117478
1795.7G73721619K27279K605286K739181Q00019j313324J352081q38394j335144K92663
1804.4G78251266o35986K77786P31965J723480K193832J504212j26801P35855R50775
1813G85606384p16705o57044j247482k91214k21634Q23441K053604J135178J436767
1821.7G87921295M24652J189881Q74481l161392q74405O30035L97263r94950k221145
1830.4G84185715K057190K988052J343231N37873K25753K17820m52042j891098q54950
$$ y = [747870712, 751266251, 751650009, 750506210, 752402954, 757835007, 761667633, 762540131, 764580307, 765140762, 765776138, 765123825, 763030090, 763975143, 765617981, 767141418, 767778625, 770061493, 772828064, 773922653, 774172287, 774963531, 774457321, 772595444, 769556427, 769226074, 772604141, 773721619, 773948898, 776554184, 779293365, 780093384, 778780060, 780132141, 779293747, 777958603, 778251266, 777615280, 777893066, 778625031, 780348511, 782542343, 784046555, 783919754, 784655609, 785606384, 784889679, 784232635, 782985153, 782693939, 782472305, 783295746, 785349350, 786484528, 787921295, 788345947, 789535828, 790410309, 787248917, 786374512, 787004547, 787401810, 786406860, 784185715, 786242905, 789230957, 790574188, 791112061, 791337814, 791555634, 791103592, 789212494, 788357544]
1839.1G88357544q28857K31246Q07572J592712J372299l240966K194290K446594n08575
1847.8G92423859j367569n19791n1117r34524j42594q9340O39038J023102Q39004J324692
1857.4G93144760J90506j34811o01502o33087j126099j089172m7913L88032J164550
1866.1G91255264O05088P58361o77566j214066P66449M87442o5384j152343q38547
1874.8G89924698j09863K86407P3929O80466J553268N87311M17175j35879k54822j248322
1884.4G91774368j492614k1210j33286Q66394Q5068q78525J276551J487579L86276
1893.1G93350601p019p66220j647568k17209l70788m35410Q5984L75518J022110Q26569
1902.7G92216568Q11310M959j1368n3406q88290j171875j191635o54831Q0261J130905
$$ y = [788357544, 787528687, 787759933, 788567505, 790160217, 791532516, 788291550, 790485840, 792932434, 792423859, 791056290, 790536499, 790485382, 789550858, 789408264, 789318924, 789957962, 790981064, 791820068, 793144760, 793335266, 793200455, 792598953, 791965866, 790839767, 789750595, 789702682, 790090714, 791255264, 791860352, 792618713, 791941147, 790727081, 791493530, 791980972, 791915588, 790763245, 789924698, 789814835, 790101242, 790175171, 790855637, 792408905, 792996216, 793413391, 793277512, 793022690, 791774368, 790281754, 790260544, 790127258, 790993652, 791078720, 790200195, 791476746, 792964325, 793350601, 793343582, 792577362, 790929794, 790712585, 790341797, 789906387, 789992371, 790367889, 791389999, 792216568, 793027878, 793032837, 793021469, 792968063, 792079773, 790907898, 789716263, 789061432, 789141693, 790272598]
1912.4G90272598O49033J027832R82818K81983R13238k550506j846695K07138m66232
1921.1G89471207K13546r53979r4147J463013J213150Q04291L69491l15094q47778
1929.7G91323700q19244n90592m21219p27081j19171K85415P10450R85031K50473J40991
1939.4G91018753L1281M58602r64126k623291j53885J59454m98809K02865R84116Q78982
1949G89493942Q90198J17493m49601m23355j074524r84039p05414n5847J64261Q4534
1958.7G87057648O44760P34634M51508J983M5090n77011j010895r51919j146775m32052
1968.3G84816971R308N10864R01108R68475O08978J55411k22015p20444p85675r08585
1978G85334396n86776n64881q6212N81894P70035J070633K25830J4419Q9188j68991
$$ y = [790272598, 790921631, 791949463, 792932281, 793214264, 794127502, 791576996, 789730301, 789937439, 789471207, 789684753, 788730774, 788636627, 790099640, 791312790, 792117081, 792486572, 792171478, 791323700, 790504456, 789913864, 789492645, 788765564, 788646393, 788931808, 789642258, 790627289, 790877762, 791018753, 791050034, 791508636, 790544510, 787921219, 787767334, 787926788, 787427979, 787630844, 788614960, 789493942, 790384140, 790501633, 790052032, 789628677, 788554153, 787570114, 786864700, 786808853, 786973114, 787057648, 787702408, 788437042, 788888550, 788890533, 788935623, 788358612, 787347717, 786395798, 785249023, 784816971, 784826279, 785337143, 786238251, 787206726, 787815704, 787971115, 787749100, 787028656, 786242981, 785334396, 784747620, 784182739, 784096527, 784678421, 785448456, 786519089, 786744919, 786759338, 786848526, 786679535]
1987.6G86679535p36847j167297n26734r58175j322785K58560J358261Q72193P03964
1996.3G85160675O87714p7896n31006j207047o60400n50308q92563k89078L42026R53750
2005.9G82935867L92456K29645N01251J34354m99649p30591o92978j090240p62863
2014.6G80417252j9608L76129j42517K53372R16596N45959K82517o74744o69784n75409
2024.2G80709763p26929p91168o38657L96347L65448M42200M47616M13819m7379n51529
2033.9G80019531j07803n35431o54449r83353p72705O4010N02549N90591L46909P33642
2043.5G79203491R1782j94855l68881o35071o59790j033173k11639J39465L42865K62375
2053.2G76936569N63278Q25882m5776k82669n64270k09045m88053p08008m77447k49481
$$ y = [786679535, 785942688, 784775391, 784248657, 783290482, 781967697, 782226257, 783584518, 784456711, 785160675, 785848389, 785770493, 785239487, 784032440, 783372040, 782821732, 781929169, 781640091, 781982117, 782935867, 783328323, 783557968, 784059219, 784193573, 783693924, 782963333, 782270355, 781180115, 780417252, 780397644, 780773773, 780631256, 780884628, 781801224, 782347183, 782629700, 781954956, 781285172, 780709763, 779982834, 779191666, 778553009, 778949356, 779314804, 779757004, 780204620, 780618439, 780571060, 780019531, 779911728, 779376297, 778721848, 777738495, 776965790, 777029800, 777532349, 778122940, 778469849, 779203491, 779295273, 779100418, 778731537, 778096466, 777436676, 776403503, 776191864, 776331329, 776674194, 776936569, 777499847, 778325729, 778279953, 777997284, 777433014, 777223969, 776735916, 776027908, 775550461, 775300980]
2062.8G75300980P05032K77405J72577N45501O21949m4175n68084k35062n96924m86450
2072.5G75692749m56161K69241M10309P1563N22461K0981J96533J02845l21579k83738
2082.1G76225204n4473l72620o33774K49787l2959L8604L09220J98669M73633J92566
2091.7G76593857k89002q23516o53992m39835R8419K93427j679K12632J67160L14483
2101.4G75471954J40076j7700k24915m58526m59900j59455J17875k94114j40915j32980
2111G73841400L62930P00531K57035j32752o30569m98963p09991j32294R3689K0676
2120.7G73171692J95846k32772M21829J82724J0834J1139k00882k18888n93338J0147
2130.3G72758331j75857J678K19345j38244L0975K4185O2790k66418K02026Q2550m01993
$$ y = [775300980, 776006012, 776283417, 776455994, 777001495, 777623444, 777579269, 777011185, 776776123, 776179199, 775692749, 775236588, 775505829, 775916138, 775987701, 776510162, 776531143, 776727676, 776830521, 776508942, 776225204, 776170731, 775798111, 775164337, 775414124, 775381165, 775419769, 775728989, 775927658, 776401291, 776593857, 776304855, 775481339, 774827347, 774387512, 774485931, 774779358, 774777679, 774990311, 775157471, 775471954, 775612030, 775594330, 775369415, 774910889, 774450989, 774291534, 774409409, 774115295, 773974380, 773841400, 774204330, 774904861, 775161896, 775029144, 774398575, 773899612, 773189621, 773057327, 773151016, 773171692, 773367538, 773134766, 773556595, 773739319, 773750153, 773761292, 773560410, 773341522, 772748184, 772758331, 772582474, 772584152, 772803497, 772665253, 772696228, 772720413, 772783203, 772516785, 772718811, 772801361, 772399368]
2140.9G72399368j06659K15226L35617j69907J82114J83792K36816J72577k27737J36490
2150.6G73357697l69797m10919k02866k06299o7291J64261M62265K32467R9106J16120
2160.2G73174744L31344k74276o15769l39126j76774J96991J90506L53318N9127M17405
2169.9G73317490N64041l01514k08664p2708k51236l84827M578p9880L6164M77676
2179.5G73101120L33557L25852o2180J61209P7973p3777j8921l43780j74942j91803
2189.1G73134308o3858r7885L29284L21503R5978K26440j58004K64358n5389m21296
2198.8G73575439k95333O103M6005r2773O10351N6763o2332J4572L2425O409o66275
2209.4G73231354k92359l08685K85950M23279r1248r7580j9455M89502j14288j74408
$$ y = [772399368, 772292709, 772507935, 772843552, 772673645, 772855759, 773039551, 773276367, 773448944, 773221207, 773357697, 772987900, 772576981, 772374115, 772167816, 772100525, 772264786, 772727051, 772959518, 773058624, 773174744, 773506088, 773231812, 772616043, 772276917, 772100143, 772297134, 772487640, 772840958, 772900085, 773317490, 773881531, 773580017, 773371353, 773298645, 773047409, 772662582, 772667160, 772587280, 772623444, 773101120, 773434677, 773760529, 773698349, 773859558, 773937531, 773863754, 773844833, 773501053, 773326111, 773134308, 773070450, 772972565, 773301849, 773623352, 773719330, 773945770, 773787766, 774052124, 773996735, 773575439, 773280106, 773286209, 773332214, 773239441, 773849792, 773906555, 773844223, 773858795, 773891220, 773897629, 773231354, 772938995, 772630310, 772916260, 773339539, 773248291, 773150711, 773131256, 773620758, 773506470, 773332062]
2219G73332062M577j79748k89612k99301K0142j28861K64740L77731L28064j25732
2228.7G73304062l55835k5406k65427J13831J35345j13525l92227J04065K24609k05765
2238.3G72523727N51300J56861l46527o06995k57568K42538o6604P6217j25351P0496
2248G72218094J75705K20947J74866J20315j23672m40750l6011m75082J08261K43911
2257.6G72186584o2713K63290K25983L52020o16684o9198K97088L8300O7215m98657
2267.3G72183228K3040k6703L91236K16064Q240Q1863l19671J52588l17994j01776
2276.9G72290115l34701j78299O8283m81644M6158m22974m7912K72369O10657N44586
2286.5G72366638k57644J05514l66363J79901L08838J42135P6676l24631M73785L76663
$$ y = [773332062, 773336639, 773156891, 772867279, 772567978, 772588120, 772459259, 772723999, 773101730, 773429794, 773304062, 772948227, 772922821, 772657394, 772771225, 772906570, 772793045, 772400818, 772504883, 772729492, 772523727, 773075027, 773231888, 772885361, 772278366, 772020798, 772263336, 772196732, 772272949, 772147598, 772218094, 772393799, 772614746, 772789612, 772909927, 772786255, 772345505, 772309494, 771834412, 771942673, 772186584, 772123871, 772387161, 772613144, 772965164, 772348480, 772279282, 772576370, 772614670, 772681885, 772183228, 772206268, 772179565, 772570801, 772786865, 772795105, 772876968, 772557297, 772709885, 772391891, 772290115, 771955414, 771777115, 771845398, 771363754, 771409912, 770986938, 770939026, 771211395, 771822052, 772366638, 772108994, 772214508, 771848145, 772028046, 772336884, 772479019, 772555695, 772231064, 772704849, 773081512]
2296.2G73081512N62516K53830n5008k51160l42102K21863l07160M72107O72913O46820
2305.8G74956131N69077j17493M64935N79682P21283p3319L98407K55661r10034Q44955
2315.5G77689285N39704M25872J229401J063385J304245K59323n17654j38397N30395
2324.2G82385559M97131J095353Q18405K7160N04456m49295q4763O1798J42975M01993
2333.8G85400772m22363P57141J57013r8572O46515j3886N68161J88828o09741j025009
2343.4G85548859J05743k94189k402573l349609l395615J102066L976059J967316J951294
2352.1G85209351J205978J96609O34614J259307K471695r57946q34885J206131J084213
2360.8G91475067n81665p69119J710892k62452j823120k023620j482163j360321j406784
$$ y = [773081512, 773644028, 773897858, 773842850, 773591690, 773249588, 773471451, 773164291, 773636398, 774309311, 774956131, 775525208, 775407715, 775872650, 776452332, 777173615, 777100296, 777498703, 777754364, 776844330, 777689285, 778228989, 778654861, 779884262, 780947647, 782251892, 782511215, 781993561, 781855164, 782385559, 782882690, 783978043, 784796448, 784823608, 785328064, 784878769, 784794006, 784855804, 784998779, 785400772, 784978409, 785735550, 785892563, 785793991, 786440506, 786426620, 786994781, 787183609, 786573868, 785548859, 785654602, 785360413, 782957840, 779608231, 776212616, 777314682, 781290741, 783258057, 785209351, 786415329, 786611938, 787246552, 788505859, 790977554, 790019608, 789184723, 790390854, 791475067, 790893402, 790124283, 791835175, 791572723, 789749603, 787725983, 786243820, 784883499, 783476715]
2369.5G83476715j813278l176575j809997j011124j357346j425323o50787n72205j901627
2378.2G69758453j833038j320343r20105j252670j144028o16531p91474j30386J32065
2386.8G61881943K11029P6675n17654l83225j42746l11889p64923m55780P0266J99051
2396.5G59862747j26037p7744K16980r3536J09710l26614n64575k92206k56348m8294
2406.1G58404083l98025l72620j49078L61862L68195k27814k19269k09045l03879q09784
2415.8G56444626n66635j02921j03988k0676j679J38932R4375J90125l52020l75748
2425.4G55344391O8588k41852m17404p20291l36380j50986j55716K10495K35978J20315
2435.1G53957138k32544m0588k61917p60346n41611p6522q5450m77371J0452M98505
$$ y = [783476715, 781663437, 778486862, 776676865, 775665741, 774308395, 772883072, 772232285, 771660080, 769758453, 767925415, 766605072, 765684967, 764432297, 763288269, 762671738, 761880264, 761749878, 761881943, 762092972, 762169647, 761651993, 761268768, 761126022, 760814133, 760049210, 759593430, 759663696, 759862747, 759736710, 759658966, 759875946, 759782410, 759892120, 759565506, 759000931, 758708725, 758452377, 758404083, 758006058, 757633438, 757484360, 757846222, 758214417, 757986603, 757767334, 757558289, 757254410, 756444626, 755877991, 755775070, 755671082, 755650406, 755648727, 755787659, 755882034, 756072159, 755720139, 755344391, 755412979, 755171127, 754753723, 754033432, 753697052, 753546066, 753390350, 753600845, 753836823, 753957138, 753724594, 753684006, 753422089, 752661743, 752120132, 752043610, 751958160, 751480789, 751491241, 751989746]
2444.7G51989746K79999k90299j35879L4027o52161o62002k15073o7062m80347l24936
2454.3G49476013q3313n1040M00772n7907q6899K07901l42179o59484m49906q19397
2464G47534561r24530K50092M71954K16751K25372K26441J14441l64685k40174k96173
2473.6G47214050o02798p90329m79584k24762l56674M35257M64477j35040J19095Q9798
2483.3G45733490l41187n09033p17621p04422k43759P5836J10550p5454K34069J30387
2492.9G43692856l31116m8981j66015n22080n93719l11508l13416m83246k62832P4768
2502.6G40734711K49023J2512K30866R1400k24228o07910r75876k60010o5384j64413
2512.2G39020691p6447O1493j48086q5297K08054m62799k12479j47324n45578n42450
$$ y = [751989746, 752269745, 751979446, 751843567, 751877594, 751225433, 750563431, 750348358, 750281296, 749800949, 749476013, 749392700, 749341660, 749742432, 749684525, 749597626, 749805527, 749463348, 748803864, 748353958, 747534561, 746610031, 746860123, 747332077, 747548828, 747774200, 748000641, 748115082, 747750397, 747510223, 747214050, 746611252, 745820923, 745341339, 745116577, 744759903, 745195160, 745659637, 745524597, 745643692, 745733490, 745392303, 744883270, 744165649, 743461227, 743217468, 743293304, 743403854, 743328400, 743562469, 743692856, 743361740, 743312759, 743146744, 742624664, 742030945, 741719437, 741406021, 740922775, 740659943, 740734711, 740983734, 740996246, 741227112, 741318512, 741094284, 740486374, 739510498, 739250488, 739185104, 739020691, 738944244, 739005737, 738857651, 738772354, 738980408, 738517609, 738305130, 738157806, 737612228, 737069778]
2521.9G37069778j89590L3874m35256L70025M09851k06375r5291K7008J38702m59594
2531.5G36663132o50482p42188l17612j07803j87759J19476k61841L10288N62744J09863
2541.1G35497818l34778m98810l14712p93991m43116j35421k31934k50702J81122P02744
2550.8G33378220J60217J84326Q8272o90231r73129m87595m49219o53457K1133M31747
2560.4G31010284N00718K5253j51825K10037K39487l71704j151886p00302k27127M730
2570.1G29387665k10343j21231N56336J96609N646J8005l5247n22919o02570q5220
2579.7G28586731l61939k47879j45568j15357m3945l8147K5406l46451k83356P3319
2589.4G27102814k0829n17578n84488l13797j05743j11237j07650K47726R0561k34604
$$ y = [737069778, 736880188, 736914062, 736478806, 736848831, 737258682, 737052307, 736957016, 736984024, 737122726, 736663132, 736012650, 735270462, 734952850, 734845047, 734657288, 734776764, 734514923, 734825211, 735387955, 735497818, 735163040, 734664230, 734349518, 733555527, 733112411, 732976990, 732745056, 732494354, 732675476, 733378220, 733538437, 733722763, 733811035, 733120804, 732147675, 731660080, 731210861, 730557404, 730578537, 731010284, 731511002, 731536255, 731384430, 731594467, 731833954, 731462250, 730310364, 729610062, 729382935, 729387665, 729177322, 729056091, 729612427, 729809036, 729814682, 729832687, 729797440, 729274521, 728671951, 728586731, 728224792, 727976913, 727831345, 727715988, 727672043, 727633896, 727659302, 727312851, 727029495, 727102814, 727081985, 726564407, 725979919, 725666122, 725560379, 725449142, 725341492, 725589218, 725679779, 725445175]
2599G25445175m18396j59988k68479p15561m76455n16358l70559O8512O50024L95279
2608.6G23633194k41318j95846k14386N3634o59790r46197m12903k39868K89078J44271
2618.3G21209869j21612j45340L02734J92032n65948n52750n35049l85285n45578m62417
2627.9G18390656j25733K17590L42865l07846j29776J1750k89688k65809k10723q95615
2637.6G16737671j087570K73514K31323k30942K66647L04566j70670n43976k18277
2646.3G15562286k77099p19300o79092m36935k19803K05765K09884j46179O5918J51672
2655.9G13717117K4185l23486m15268n24521r34372n46493l07160k11334Q4534K29874
2665.5G10793076J95999J5487R8725j16654o70929n51834P0877m55246r04617J5335
$$ y = [725445175, 725026779, 724866791, 724598312, 723882751, 723406296, 722889938, 722519379, 722587891, 723237915, 723633194, 723391876, 723196030, 722981644, 723035278, 722375488, 721429291, 721016388, 720776520, 721065598, 721209869, 721088257, 720942917, 721245651, 721437683, 720871735, 720318985, 719783936, 719398651, 718853073, 718390656, 718264923, 718482513, 718825378, 718517532, 718387756, 718399506, 718109818, 717844009, 717633286, 716737671, 715650101, 715923615, 716154938, 715923996, 716190643, 716495209, 716324539, 715780563, 715562286, 715285187, 714565887, 713886795, 713449860, 713230057, 713435822, 713645706, 713499527, 713565445, 713717117, 713741302, 713417816, 713002548, 712478027, 711543655, 710997162, 710690002, 710478668, 710563202, 710793076, 710989075, 711004562, 711103287, 710986633, 710315704, 709763870, 709834747, 709379501, 708474884, 708490219]
2675.2G08490219K73666j21917N3863L25394J54114l43628q63800n07508o04934j112442
2684.8G05743027o1951J82495m07562j07575J94016j0376j34811j92032o63681o16837
2694.5G03924713m94842l22724m07791n88760N0354L49426M37241k11564n32608j55258
2704.1G02048187l49731m12903n16663m97284o56738k86407j01090l53851L26309M14124
2713.8F99613953O5231l20969m55703o19126o18286j59836l80783k84881k64511k15378
2723.4F96359711K40860M19540J03912k68478k96020o83747m71496m35868n42679l71475
2733F94054260k89459L47290M95682O22482P2022l61710r6512m54941l76892l99246
2742.7F93612976k98080l03040l15704J02768K89230N01938M80118K44217p30362r96857
$$ y = [708490219, 708763885, 708641968, 708695831, 709021225, 709175339, 708831711, 707967911, 707460403, 706855469, 705743027, 705681076, 705863571, 705456009, 705348434, 705542450, 705532074, 705397263, 705205231, 704541550, 703924713, 703429871, 703107147, 702699356, 702110596, 702160950, 702510376, 702947617, 702736053, 702203445, 702048187, 701698456, 701285553, 700768890, 700271606, 699614868, 699328461, 699227371, 698873520, 699199829, 699613953, 699679184, 699358215, 698902512, 698283386, 697665100, 697505264, 697124481, 696839600, 696575089, 696359711, 696600571, 697020111, 697124023, 696855545, 696559525, 695875778, 695404282, 694968414, 694425735, 694054260, 693764801, 694112091, 694607773, 695230255, 695302277, 694940567, 694844055, 694389114, 694012222, 693612976, 693314896, 693011856, 692696152, 692798920, 693088150, 693590088, 694070206, 694314423, 693584061, 692587204]
2752.3F92587204m88358n58776n77469m21143J79749K24914J55487O7215k41318J31302
2762F91058807K33078k11563r88617q09936j31836k82746l27224R6893K23770j59683
2771.6F88700943J00784J79901q0490k16217q87375j051330n97077k83508j91421k15683
2781.3F85458527q2550L00827J53579P9956j04293p55539k65122o11648r27277j74713
2790.9F83071747m77905n34974k58102K06223K28576n08652o65130m15650m74548q56552
2800.5F79315033n93414o09818o79779m43649m99344J13525p4463n43747N8365l46756
2810.2F75695953j207580j180878j191635p86896l52249o27136p25479p90634m66843
2818.9F68366623m68445p39975l62396p31964j245423j253280j346207j164169p11441
$$ y = [692587204, 692098846, 691540070, 690962601, 690541458, 690721207, 690946121, 691101608, 691168823, 690927505, 691058807, 691291885, 691080322, 690091705, 689281769, 689149933, 688867187, 688539963, 688636856, 688860626, 688700943, 688801727, 688981628, 688901138, 688684921, 687797546, 686746216, 686149139, 685865631, 685674210, 685458527, 685375977, 685676804, 685830383, 685910339, 685806046, 685050507, 684785385, 684173737, 683246460, 683071747, 682593842, 682058868, 681800766, 682006989, 682235565, 681726913, 681061783, 680646133, 680171585, 679315033, 678721619, 678111801, 677432022, 676988373, 676489029, 676602554, 676528091, 675984344, 676042709, 675695953, 674488373, 673307495, 672115860, 671328964, 670976715, 670349579, 669624100, 668833466, 668366623, 667898178, 667158203, 666795807, 666063843, 664818420, 663565140, 662218933, 661054764, 660343323]
2827.6F60343323q71430r02786k96097m89731q97979r33609r07898j324616j627884
2836.2F52091293j280136j178589j150665j135864n07889o12793j306686j009369j072693
2844.9F42836609q69980j048737j799697j896096j428337j117592j125564m69437m55284
2853.6F32625885m54521m12178q69789p77779n78117n15480j137047j027413o42624
2862.3F26210937k69317L6049q83637p26204p53936j128273q83294j039276r17511
2870.9F19645538p04689m92744r83658p81593N9433k84691m85611n23758o35872q67004
2880.6F13945351j079750p28112j17645m0932m43649m55398n32799m79851j88942j77536
2890.2F09700737l65219m96903o20918q98018o05240j05781k6856k10533p53402r36127
$$ y = [660343323, 659471893, 658569107, 658273010, 657783279, 656885300, 655951691, 655043793, 653719177, 652091293, 650811157, 649632568, 648481903, 647346039, 646838150, 646225357, 644918671, 643909302, 642836609, 641966629, 640917892, 639118195, 637222099, 635793762, 634676170, 633550606, 633081169, 632625885, 632171364, 631759186, 630889397, 630111618, 629533501, 629018021, 627880974, 626853561, 626210937, 625941620, 625977669, 625094032, 624367828, 623613892, 622485619, 621602325, 620563049, 619645538, 618940849, 618448105, 617464447, 616682854, 616742287, 616457596, 615971985, 615448227, 614812355, 613945351, 612865601, 612137489, 612019844, 611978912, 611535263, 611079865, 610547066, 610067215, 609878273, 609700737, 609335518, 608838615, 608217697, 607319679, 606714439, 606608658, 606581802, 606371269, 605617867, 604681740]
2899.9F04681740n1422Q0108n95321k19994k65427o80694o70319l28560Q3619j95351
2909.5F01838379j1597R4490j69143l73688l65830j69715n08461m77028r17244j333619
2919.2E97606544m35714L16543J74370J54343O42166J01852j3656M85649L0784j76239
2928.8E98886642j74789m04816j03759N54618M13514O17637R55544K49481R0790N87806
2938.5F01672668P84798K97470P5722N44777R01451R18083J050148J388436J187782
2947.1F08821335J113243R15489P05757R04198R08356O60057k6284L83606J188813
2955.8F15574570P99942M83932J017990J169625M56543L42941N72052R93919J004601
2964.5F22416115M73900L62396M45061P69577R99336J308288J056405Q21228J197509
$$ y = [604681740, 604630318, 604710426, 604115105, 603895111, 603629684, 602948990, 602278671, 601950111, 602033730, 601838379, 601826782, 601921272, 601752129, 601378441, 601012611, 600842896, 600334435, 599857407, 598940163, 597606544, 597170830, 597487373, 597661743, 597816086, 598458252, 598560104, 598546448, 599032097, 599062881, 598886642, 598711853, 598307037, 598203278, 598757896, 599171410, 599789047, 600744591, 600994072, 601084862, 601672668, 602457466, 602754936, 602830658, 603375435, 604276886, 605194969, 606245117, 607633553, 608821335, 609934578, 610850067, 611555824, 612460022, 613368378, 614028435, 614002151, 614385757, 615574570, 616374512, 616858444, 617876434, 619046059, 619502602, 619845543, 620417595, 621411514, 622416115, 622890015, 623252411, 623697472, 624467049, 625466385, 626774673, 627831078, 628652306, 629849815]
2973.2F29849815J253128J033516L68958N64079Q94547R09309J312370J096802N64118
2981.8F37846642M35066O54526O0119K62795R37461L68195K61383K30332N54504O58646
2991.5F42269669J22909J13144K96173N03464J25122o0043J7624k47040m20304m57611
3001.1F42263107j21460L05405L22723k3803J28708K32086k40860r7809J92795j29471
3010.8F42831421l51181n50995l93372M13590J71280l02506j89819l96194k70386j32447
3020.4F40829391m99801q90007l35388J39198l31764n03464l69301j91955j31760j97487
3030.1F37517662n54275l74032O5880k38876l68538p78694j069718p91893l35388k91557
3039.7F32780571l51219j79825l69072q6250n52521q68492o41937p60804j68647l65296
$$ y = [629849815, 631102943, 632136459, 632505417, 633069496, 633964043, 634873352, 636185722, 637282524, 637846642, 638281708, 638936234, 638996353, 639259148, 640196609, 640564804, 640826187, 641056519, 641611023, 642269669, 642392578, 642505722, 642801895, 643305359, 643430481, 643370438, 643388062, 643141022, 642720718, 642263107, 642141647, 642447052, 642769775, 642745972, 642874680, 643106766, 642865906, 642768097, 642960892, 642831421, 642480240, 641929245, 641535873, 641949463, 642120743, 641818237, 641628418, 641232224, 640961838, 640829391, 640329590, 639439583, 639104195, 639243393, 638911629, 638408165, 638038864, 637846909, 637715149, 637517662, 636963387, 636589355, 636655235, 636416359, 636047821, 635269127, 634199409, 633407516, 633072128, 632780571, 632429352, 632249527, 631880455, 631794205, 631241684, 630373192, 629731255, 628970451, 628801804, 628436508]
3049.4F28436508m01497j81541k07787m83474j205979p79686p53822j069870p32727
3058F22620125k79350m89731p02210M730J2780j80016m58183m56848q25157j247330
3067.7F17998810l81508o46172p86018m04510k63100k06719o51130m36631l63044o13671
3077.3F13246307n90591m96903o10771n37605j99356l15285o75583p90901k80990m92516
3087F08255806p87315n54543m51469m29116j076660q26416o22711o57005k27051n70946
3096.6F02052574k38800K05193p8698p80067j203194o38313n50613j253167q62159
3105.3E96652756K81067q6899p75223p37190l24326n44090j072350j91917l10707j211815
3114.9E91679306j181068o95382l72276o56509p46765o88858k05841l83492j069946
$$ y = [628436508, 628035011, 627853470, 627645683, 627162209, 625956230, 625176544, 624422722, 623352852, 622620125, 622340775, 621851044, 621148834, 621153564, 621166344, 620986328, 620528145, 620071297, 619246140, 617998810, 617617302, 616971130, 616185112, 615780602, 615517502, 615310783, 614659653, 614223022, 613859978, 613246307, 612655716, 612158813, 611548042, 611010437, 610811081, 610495796, 609820213, 609029312, 608748322, 608255806, 607468491, 606913948, 606462479, 606033363, 604956703, 604130287, 603507576, 602850571, 602623520, 602052574, 601813774, 602018967, 601940269, 601160202, 599957008, 599318695, 598768082, 597514915, 596652756, 596933823, 596846924, 596071701, 595334511, 595010185, 594466095, 593393745, 593201828, 592891121, 591679306, 590498238, 589802856, 589430580, 588774071, 588027306, 587338448, 587132607, 586749115, 585679169]
3123.6E85679169p00913p41539r24988n33676l68309o87790p92427l74946j43318o92254
3133.3E79719009r61990o07223n17426j97868p76787j187515q13828j079140p34672
3141.9E72842560o67725n93986k37351n06058m59022l80478o36215q30116o08063p67822
3151.6E67155724p29142o25686j306496j105499n81284l93524n54314r98420p15485
3160.3E60145874n09148o83021o21147r51004j102906m17099l36685p17583o64825
3168.9E54142456m14391o87484n36042k09350j659546j697884o01387n98983l58315
3177.6E47379074l81927m96331p30629n69496m67491p34558q14819j332817r97124
3186.3E40853882o40602o85616n24444m57344n51720q40340p72590n58968l34015r24072
$$ y = [585679169, 584978256, 584236717, 583311729, 582778053, 582409744, 581721954, 580929527, 580554581, 580411263, 579719009, 578757019, 578149796, 577632370, 577434502, 576657715, 575470200, 574656372, 573577232, 572842560, 572174835, 571580849, 571343498, 570837440, 570378418, 569997940, 569361725, 568531609, 567923546, 567155724, 566426582, 565800896, 564494400, 563388901, 562807617, 562414093, 561859779, 560861359, 560145874, 559636726, 558953705, 558332558, 557381554, 556278648, 555861549, 555524864, 554807281, 554142456, 553728065, 553040581, 552504539, 552295189, 550635643, 548937759, 548336372, 547737389, 547379074, 546997147, 546500816, 545770187, 545200691, 544733200, 543998642, 543183823, 541851006, 540853882, 540213280, 539527664, 539003220, 538545876, 537994156, 537153816, 536381226, 535822258, 535488243, 534564171]
3195.9E34564171r60045p92961j047287j71394m97895r71031q31184n90783m71305
3204.6E28230286j062470m77028l10821p41806j068535j001282l35350o24008p15599
3213.3E21893387m50096l929m23470j332359p11365l36647r02138r72290n54237p51076
3222.9E15455780q09059m54941l83415m51775o22215l73268o65779j109429o58226
3231.6E09927673m08210n49813n34591p46460r70765m11949j75438m40292q78410q63152
3241.3E03948593n73311p99560n54695m66347j78375k26250q94547j076011j029663
3249.9D98149834j71891j46560n92995m43954o98548n65452m30260p33032o47316o10886
3259.6D93108940j224670l50266L27988o94733o72874m68025m17290m45290k92702
$$ y = [534564171, 533604126, 532811165, 531763878, 531592484, 531094589, 530123558, 529292374, 528701591, 528230286, 527167816, 526690788, 526379967, 525638161, 524569626, 523568344, 523232994, 522608986, 521893387, 521443291, 521439362, 521015892, 519683533, 518972168, 518635521, 517733383, 516761093, 516206856, 515455780, 514646721, 514191780, 513808365, 513356590, 512734375, 512361107, 511695328, 510585899, 509927673, 509519463, 508969650, 508435059, 507688599, 506717834, 506305885, 506130447, 505690155, 504811745, 503948593, 503375282, 502575722, 502021027, 501554680, 501376305, 501150055, 500255508, 499179497, 498149834, 497977943, 497831383, 497238388, 496794434, 496095886, 495530434, 495100174, 494367142, 493719826, 493108940, 491884270, 491534004, 491861992, 491167259, 490494385, 490026360, 489609070, 489163780, 488871078]
3268.3D88871078k59780o22864m39606r31320q57010n55267m49295k09008o04629k92778
3277.9D83649521n40619n51147M6234p22466j142349o02722j04981J17836j59797n64156
3287.5D79425354n42259n18608j79024k65465p63511l05291j04561l53927o65131o38428
3297.2D75089149n91087m05083J1521n47028o98128p33070j97792N04036o37169q70438
3306.8D70924911l05938n21469l81165j91803o89926q71506m04739k05078n54886r90181
3316.5D65808220n51758k95677o04553p40090o15921k91557l83644m29154l53050l01056
3326.1D61241760j080818j283417k31170l29323j15433r5215r14688j061401p25441
3334.8D55404854j79596k46582l36914n78575q77304m08097j82152m97932k57874j65176
$$ y = [488871078, 488611298, 487988434, 487548828, 486617508, 485760498, 485205231, 484755936, 484546928, 483942299, 483649521, 483108902, 482557755, 482603989, 481881523, 480739174, 480136452, 480031471, 480149307, 479989510, 479425354, 478883095, 478364487, 478185463, 477919998, 477156487, 476851196, 476746635, 476392708, 475727577, 475089149, 474498062, 474092979, 474104500, 473557472, 472859344, 472126274, 471928482, 472432518, 471795349, 470924911, 470618973, 470097504, 469716339, 469524536, 468834610, 467963104, 467558365, 467353287, 466798401, 465808220, 465256462, 464960785, 464356232, 463616142, 463000221, 462708664, 462325020, 461895866, 461542816, 461241760, 460160942, 458877525, 458646355, 458317032, 458201599, 458106384, 457191696, 456130295, 455404854, 455225258, 454978676, 454641762, 454063187, 453185883, 452777786, 452595634, 452097702, 451839828, 451674652]
3344.4D51674652r77669q40187n78804l56178R7885m22516o62002q93746q81653J01510
3354.1D46261292O53228k88772j102486o92368m06341j47934l35350k02637L41187
3362.8D44079819k16294j000328r83619k17553O7940j97983o69899p82547m51240j41487
3372.4D39486809k36969p21016k04735k88734o58722j72081j8311o7215m50401m05121
3382.1D36263504l74756j98593k29874m63523K05268R1248j57242k54593J97067M20723
3391.7D35499229q78410j227264m33693K55508n7525m29917M959J16806K9717j93482
3401.3D32685928m04319o90499m56581J44653L96615m1733n76401m70772l22838K27089
3411D30491142K31819J2246J030k28615j55373m45976l30773J67618L94707k4681n5962
$$ y = [451674652, 450696983, 449856796, 449277992, 448921814, 449019699, 448597183, 447935181, 447041435, 446159782, 446261292, 446914520, 446625748, 445523262, 444830894, 444424553, 444276619, 443941269, 443738632, 444079819, 443863525, 442863197, 441879578, 441662025, 441729965, 441531982, 440862083, 440079536, 439628296, 439486809, 439249840, 438528824, 438324089, 438035355, 437376633, 437204552, 437186241, 437119026, 436668625, 436263504, 435888748, 435690155, 435460281, 434996758, 435202026, 435293274, 435136032, 434881439, 435078506, 435499229, 434620819, 433393555, 432959862, 433215370, 433157845, 432727928, 432732887, 432849693, 432879410, 432685928, 432281609, 431591110, 431134529, 431279182, 431675797, 431634064, 431057663, 430586891, 430264053, 430491142, 430722961, 430735207, 430736237, 430507622, 430352249, 429906273, 429575500, 429743118, 430137825, 430113144, 430057182]
3421.6D30057182M24843j77307j06049K70119K85645K24342m9248j65901k07672L3913
3431.2D30589867l50991k19192P36198N94864J12839M05807N83306K1972n18074J10360
3440.9D32066956J092491n5619l93257L60985O00433O05851j130410M11110J518860
3449.6D35077400J44386L97568J89972L25432L37677J37863L84178K98081O13670P65343
3459.2D38671570P07359k02522j06774Q79441R35821O20880L57857L78838j26343L31078
3468.8D42447205P38487N56068L96004L10135J016884N00145M1275M75235Q89015R31740
3478.5D48302193M89883M14353M65278K13585j52397J422501J530151K91252N42870
3487.2D53519669k37618L04222J166573O57768L46107O75278J283150J038055P60842
$$ y = [430057182, 430482025, 430304718, 430198669, 430468788, 430754433, 430978775, 430929527, 430763626, 430555954, 430589867, 430238876, 430019684, 430755882, 431350746, 431463585, 431869392, 432452698, 432474670, 431956596, 432066956, 433159447, 433103828, 432710571, 433071556, 433671989, 434277840, 433147430, 433558540, 435077400, 435221786, 435619354, 435809326, 436134758, 436472435, 436610298, 436994476, 437292557, 437906227, 438671570, 439378929, 439176407, 439069633, 439949074, 440884895, 441505775, 441863632, 442242470, 442116127, 442447205, 443185692, 443741760, 444137764, 444447899, 445464783, 445964928, 446006203, 446481438, 447370453, 448302193, 448792076, 449206429, 449671707, 449885292, 449732895, 451155396, 452685547, 452976799, 453519669, 453282051, 453586273, 454752846, 455410614, 455756721, 456431999, 457715149, 458753204, 459514046]
3495.8D59514046J63040O70967J031723L6430L84484J240158J053962K66877M23088
3504.5D64784775M65202J36070O68068J532708O72760K2315J444588Q27942O89926
3513.2D71244354O95076M70543J738472J107559M52004L81508K9220P43675K008057
3521.9D78870468J002121j007042J041985J994476J048584N41267N85900Q63418J462098
3530.6D86403275J341171K83203Q25539J042404J707573Q75053l49998J384391J313210
3539.2D94825821J215019P50923J173058J462936Q20046Q70323N83343K051735l83072
3547.9E03370132L92991K762718K176628J604690j170234J070366J261711J069145
3555.6E12538147K046089K63481J756058J369247Q78716Q08144J642761J879005J100121
$$ y = [459514046, 459677086, 460348053, 461379776, 461416206, 461800690, 463040848, 464094810, 464361687, 464784775, 465249977, 465386047, 466054115, 467586823, 468259583, 468281898, 469726486, 470554428, 471244354, 471939430, 472409973, 474148445, 475256004, 475708008, 476089516, 476118736, 476862411, 478870468, 479872589, 478865547, 479907532, 481902008, 482950592, 483491859, 484077759, 484941177, 486403275, 487744446, 488027649, 488853188, 489895592, 491603165, 492478218, 492128220, 493512611, 494825821, 496040840, 496791763, 497964821, 499427757, 500247803, 501118126, 501701469, 503753204, 503370132, 503763123, 506525841, 508702469, 510307159, 509136925, 510207291, 511469002, 512538147, 514584236, 514847717, 516603775, 517973022, 518851738, 519659882, 521302643, 523181648, 524281769]
3564.3E24281769M224891N87693r27964o37855q86116M066849K242317J668396J587601
3573E36207581J221923J325303J735839K090874j73607K445488K014466N29479J954499
3581.7E49351845J605835J788711J309777M570083J996880l416023P55729j51253L306809
3590.4E61118393L052368K768479J801071O73523L148384j356430J785202L307991
3598.1E76298981P49588K913627M22478J214829K683105J357307J814652L132057K570534
3606.8E93157158q35228L080330j879769j643371P775535J622391j729507M533653
3614.5F04081192j053352L526878N725861o1913L15018j385079R15642L885002K622986
3623.1F18572235J916542K933312K573700J642646O169052R10111j1905289L258286
$$ y = [524281769, 528506660, 529094353, 528166389, 527528534, 526642418, 530709267, 532951584, 534619980, 536207581, 537429504, 538754807, 540490646, 542581520, 542407913, 544853401, 546867867, 547397346, 549351845, 550957680, 552746391, 554056168, 558626251, 560623131, 557207108, 557962837, 557811584, 561118393, 564170761, 566939240, 568740311, 569413834, 572562218, 571205788, 572990990, 576298981, 577048569, 579962196, 580384674, 581599503, 584282608, 585639915, 587454567, 590586624, 593157158, 592321930, 595402260, 593522491, 591879120, 599654655, 601277046, 599547539, 604081192, 603027840, 606554718, 612280579, 612218666, 612533684, 611148605, 612064247, 615949249, 618572235, 620488777, 623422089, 625995789, 627638435, 633807487, 634717598, 622812309, 626070595]
3630.9F26070595N378952O451530K298126k251129J550789L093910K366257L68729
3638.6F45327759J462326J972885K465134J252899k40097K489471M259415P034683
3646.3F66024475O03867m573365L854142m64707k547073j078491N683365M762725M361115
3655F76626053N845413q626633O24390N535278J772309J912384O21032J914292J220703
3663.6F87445221J167908J368942N30624M301148K956695r43145l26539o786651J658859
3672.3F91373062R230652J1669846L882751k2210083j074524Q156967N619278k648849
3680G03999100j302033K720948K080078J530304N64880n0812M247818P790299q806382
3688.7G12774200n366287R307556o047287k427749N860214O31485N3787j14517R12933
$$ y = [626070595, 631449547, 637901077, 640199203, 637948074, 639498863, 642592773, 644959030, 645327759, 646790085, 648762970, 651228104, 652481003, 652240906, 654730377, 658989792, 666024475, 666628342, 662054977, 665909119, 665444412, 662897339, 661818848, 667502213, 672264938, 676626053, 682471466, 673844833, 674469223, 680004501, 681776810, 683689194, 684310226, 686224518, 687445221, 688613129, 689982071, 690512695, 694813843, 697770538, 696827393, 696500854, 689714203, 691373062, 700603714, 712273560, 716156311, 693946228, 692871704, 701028671, 706647949, 703999100, 702697067, 705418015, 707498093, 709028397, 709593277, 709542465, 713790283, 721580582, 712774200, 707407913, 716715469, 710668182, 708240433, 714100647, 714732132, 714785919, 714671402, 715584335]
3697.4G15584335J753617m66080K032318L047638n257721l505020M197693J886978
3705.1G19273758J38779K03170K470475N247879o949768J778869M273148j5546951
3712.8G10889359K709732N378570Q89893j59378K031326J669388m020386R79614O437989
3721.5G26806107m056778n849457N441894K241593l00446l614731j069412L773270
3729.2G23372040J275024N763321l192215q777008R660721J593933j0243301R9716
3736.9G19552231J354751r87472K476120M161148m022751J542664J2197494q170013
3744.7G28104172k1608963R676437P290115P061539l747711j1778488J2530365l109970
3752.4G24417496j0255509M857941N021515L193664o219940K120896O367416p678604
$$ y = [715584335, 717337952, 716871872, 718904190, 721951828, 716694107, 713189087, 717386780, 719273758, 719412537, 719615707, 722086182, 727334061, 720384293, 722163162, 726436310, 710889359, 713599091, 718977661, 719867554, 719708176, 721739502, 723408890, 719388504, 720368118, 726806107, 722749329, 716899872, 722341766, 724583359, 724282913, 720668182, 719598770, 723372040, 724647064, 730410385, 727218170, 718441162, 728101883, 729695816, 719452515, 719552231, 720906982, 719919510, 722395630, 726556778, 722534027, 724076691, 736274185, 728104172, 706495209, 716171646, 723461761, 730523300, 726775589, 714997101, 727527466, 724417496, 714161987, 719019928, 724041443, 727235107, 721015167, 723136063, 729503479, 721824875]
3760.1G21824875k262344L561401M71802J05514L177567k793808m384995L525162N538559
3768.8G28763733L20206r823456J511535L108521l59421O42166k12249O33163M02298
3777.4G24986496L065338M60587q609391J578598K284470R00192K258301l058472j577758
3786.1G22288361J238174J349411Q17184q94775r5138k7085M90113n92423P06100L697510
3795.8G28977432m039459m781036J867904M427338P149048n875702j2704544K685623
3803.5G17706604L523026N448074O518249r883728o133957M629364J632462O32095
3811.2G24072189O00129q78525J157608O380920m57001j5436401M438629O106110N405655
3819.9G31389313L507919j9685745Q34656N740127J570664K676467P74308m813385
$$ y = [721824875, 719562531, 723123932, 723595734, 723701248, 726878815, 724085007, 719700012, 723225174, 728763733, 729083939, 719260483, 720772018, 723880539, 723521118, 724163284, 723951035, 724584198, 724986496, 728051834, 728512421, 719903030, 721481628, 723766098, 724666290, 726924591, 723866119, 722288361, 723526535, 724875946, 725693130, 724798355, 724703217, 724676132, 725166245, 724573822, 725279922, 728977432, 724937973, 720156937, 722024841, 726452179, 733601227, 727725525, 715020981, 717706604, 721229630, 726677704, 733195953, 723312225, 717178268, 721807632, 723440094, 724072189, 724672318, 723793793, 724951401, 731332321, 730875320, 715438919, 719877548, 725983658, 731389313, 734897232, 715211487, 716046143, 721786270, 723356934, 726033401, 726807709, 721994324]
3827.6G21994324q85468K506561L846436J255341j0265732J558838P870407n509262
3835.3G22371445o33545Q751144r054870n574723Q626786m037552o63300O615219l905639
3844G22494965m984436L141861J681137L86352J943665j410981K497025Q185501k008667
3852.7G31926422M823837k0539703n618362J0900344j26647k675629K502441L010483
3860.4G24203186K867432n780335j048507O235122o419754n514831M491500N550843
3868.1G24584656P117080p324905j0643158L327637O345749M468384j1100846q11157
3875.8G15963440M374161N43060K984695N121003o529007r320984N946731J729660
3883.5G20812759J812134N531998j3763504P35702N014725J195984M125900j129761
$$ y = [721994324, 721108856, 723615417, 727461853, 728717194, 718451462, 720010300, 727880707, 722371445, 721737900, 730489044, 721434174, 715859451, 724486237, 720448685, 719785385, 726400604, 722494965, 717510529, 720652390, 722333527, 722719879, 724663544, 723252563, 725749588, 733935089, 731926422, 736750259, 716210556, 710592194, 721492538, 721365891, 718690262, 721192703, 724203186, 727070618, 721290283, 720241776, 726476898, 720057144, 714542313, 719033813, 724584656, 731701736, 724376831, 713733673, 717061310, 723407059, 727875443, 716774597, 715963440, 720337601, 720880661, 723865356, 728986359, 722457352, 713136368, 719083099, 720812759, 722624893, 728156891, 714393387, 715129089, 720143814, 721339798, 725465698, 724335937]
3891.2G24335937q551025J026611L335190j538849J263581J043701K196197K855759
3898.9G25967102j0323944M218063K378846n752259M882126l007431k004089j15815
3906.7G16242599P59583K482758j73188N28107n08652l280M02679l28293J666336K063828
3916.3G23132477m134827m536133N215073J187744m620514K050629K032165O80237
3924G21006851l048935k701950K534943J672058O54526j575241J93405K680588l321305
3932.7G18094940k494201J237106L94592Q51898N46341o99844n8670O4545J741104
3941.4G19677811J803589n002518j827469J653442Q57773J482697k623596l8453J375962
3950.1G17359238j993332J466064O55670k21939L39356k10877p0038q70895N81436
$$ y = [724335937, 715784912, 716811523, 720146713, 718607864, 719871445, 720915146, 723111343, 725967102, 715643158, 719861221, 722240067, 716487808, 721369934, 718362503, 716358414, 716242599, 717002182, 719484940, 719311752, 719839859, 719331207, 719327927, 719730606, 719402313, 721068649, 723132477, 718997650, 714461517, 719676590, 720864334, 716243820, 718294449, 720326614, 721006851, 717957916, 715255966, 717790909, 719462967, 720117493, 718542252, 718735657, 721416245, 718094940, 715600739, 716837845, 717232437, 718084335, 718630676, 717930832, 717872162, 717936707, 719677811, 721481400, 716478882, 714651413, 716304855, 717162628, 718645325, 716021729, 715983276, 717359238, 715365906, 716831970, 717487640, 717265701, 717605057, 717394180, 717324142, 716453247, 717034683]
3958.7G17034683k25067k83813L68347j548615J80664J167603J0910l10974O9046N15442
3968.4G16978226K7008o16760k45133O0806m16641j9379M12598j40457n42374j28326
3978G15369568O7444N04532P08999l02963l21121n02930o59103l49579L78036O49643
3987.7G15542526m84009O86722O46591q40225k72674j92719l73535o92749j13144N40009
3997.3G14446793K62451j15280J38015
4000.2G14731979
$$ y = [717034683, 716809616, 716525803, 716894150, 715345535, 715526199, 716693802, 716704712, 716393738, 716462784, 716978226, 717005234, 716388474, 716143341, 716204147, 715787506, 715768127, 716180725, 716040268, 715497894, 715369568, 715437012, 715941544, 716650543, 716347580, 716026459, 715523529, 714864426, 714514847, 714892883, 715542526, 715058517, 715745239, 716391830, 715551605, 715278931, 715086212, 714712677, 714019928, 713906784, 714446793, 714709244, 714593964, 714731979]
##END=$$ End of the data block
