##TITLE=$$ Begin of the data block
##JCAMP-DX=5.00 $$ ACD/SpecManager v 10.08
##SPECTROMETER/DATA SYSTEM=Varian
##DATE=21 Jan 2013 14:27:38
##DATA TYPE=INFRARED SPECTRUM
##DATA CLASS=XYDATA
##ORIGIN=
##OWNER=
##NPOINTS=3735
##FIRSTX=399.26403809
##LASTX=4000.35498047
##MAXX=4000.35498047
##MINX=399.26403809
##MAXY=78.44017029
##MINY=43.54967499
##XFACTOR=1.0000000000
##YFACTOR=0.000000100000000
##FIRSTY=63.96872711
##DELTAX=0.96440572
##XUNITS=1/CM
##YUNITS=TRANSMITTANCE
##XYDATA=(X++(Y..Y))
399.3 639687271 660156021 666031342 659289169 662769012 665136108 662506104 660975189 666063690
407 666063690 662863312 652689209 647830429 643848190 640998306 647186279 659583893 662602005
414.7 662602005 659884338 659162064 654463577 639061928 637002068 642582626 640463638 640770187 645927963
423.4 645927963 653043594 655808563 648608551 648884964 648466873 640927658 638264923 632963371 628989563
432.1 628989563 634093666 637372894 638389664 643963242 648345871 646029282 640921555 640437241 647359467
440.7 647359467 646409454 635896950 632305145 634443893 639317398 646112442 651327896 647547226
448.4 647547226 639905815 634690666 635090179 638887939 629646797 624678917 633167229 638265648 640001984
457.1 640001984 645115509 647565689 643550339 637648430 633131523 627906647 625549126 623981972
464.8 623981972 629864502 636147537 635778236 640022125 642380524 640097961 639708366 636135254 629906921
473.5 629906921 628131599 625141296 625298920 634560699 640363922 641244431 643332367 643285446 639557953
482.2 639557953 632750626 624999352 621022530 623084946 629099007 633775368 632316360 631264229
489.9 631264229 636420479 635562744 632793655 633082542 625093117 617333946 618426552 622228279 622909698
498.6 622909698 622527885 628589287 634672318 631491699 628796196 632384529 631735497 624339867 620156403
507.3 620156403 619499245 618108139 619560204 623692017 628082733 629700851 630090714 628010597 622470474
516 622470474 617753983 613548660 612492218 614747047 614999695 615535049 618857002 621736908 623686562
524.6 623686562 625718346 622553787 617376938 614348030 611528893 609675941 609224625 611858482 616009941
533.3 616009941 619053879 620621681 619446335 617437134 616106415 612982216 609906654 610055161 609136200
542 609136200 607506294 611179962 616175308 617017479 616857262 617074738 615161362 611482887 607678452
550.7 607678452 606470032 607596855 608087120 609121704 609961090 610869026 611880493 610930176 609508743
559.4 609508743 607233353 605820732 605034332 603579941 604513664 606519966 608996315 612040939 612899475
568 612899475 612963142 611746521 609021645 607436638 605750656 603376236 604895554 609184723 610815353
576.7 610815353 612093353 614393311 613888931 611738091 610097084 608036232 605672226 604088936 604083328
585.4 604083328 605177116 606591110 608356857 610075493 611137390 611283836 610184364 608440475 606454506
594.1 606454506 603453789 601123390 602099152 604953346 608125801 611864357 614089661 614247589 613484383
602.8 613484383 611392441 608278465 604573479 602500381 602484932 602498093 603913345 607478600 610465736
611.4 610465736 611194839 610232620 607436104 604497032 603057976 601184845 599926758 600620575 603258018
620.1 603258018 606860352 608821449 611058426 613375244 614382324 613564491 611395111 609237747 606967964
628.8 606967964 606284676 608141975 611222458 614180107 616914635 619124374 620159492 620341034 618743286
637.5 618743286 615377235 612499313 612165756 613073578 614523926 617295837 619691544 622921333 625027542
646.2 625027542 624003448 622045097 620635147 620051918 618558121 617572594 617875481 619216194 622297516
654.8 622297516 624494247 625843468 626586494 626398010 625306816 622860336 619776115 616719818 615881348
663.5 615881348 617054443 619415932 622894287 624774361 620932999 623207092 624948997 624230881 623519173
672.2 623519173 622264252 620950928 621682854 624192772 628147812 631123085 633065567 635189438 636383705
680.9 636383705 636909752 635743446 633697739 632609253 632946205 634298325 634809608 636343307 639243431
689.6 639243431 641520920 643074341 642809067 641445999 639470711 638478050 639221001 639271202 639884949
698.2 639884949 641628723 643730392 646296463 647343445 647540970 647518616 645522003 643479996 642518387
706.9 642518387 641822891 642953568 645273514 646946106 648320160 649969788 651110687 650886307 649545975
715.6 649545975 647940598 647302780 646602478 647087555 650100403 652760315 655270996 657493134 658177338
724.3 658177338 656981430 655081329 654969864 655628052 656010132 656246414 657618332 659657364 661168137
733 661168137 663341904 664923935 665748901 665823822 664196777 662223282 661324997 661174316 661024857 662028885
742.6 662028885 664456482 666583557 668542938 670700836 670872726 669248505 667712250 666309052 664871140
751.3 664871140 663341599 663855438 666267090 668980026 671905594 673727341 674298630 673438873 671634064
760 671634064 669973068 668570480 666988907 666237259 667158127 668614960 670864487 672923660 674860306
768.6 674860306 676346817 675673599 674636688 672859573 670061722 667927704 667515945 669075775 672198715
777.3 672198715 675168610 677276154 680016556 680520782 678557663 677180023 675752869 673761597 672087173
786 672087173 672624741 675066833 678246078 681919861 684658279 685618896 685331497 684174652 681766205
794.7 681766205 678768311 676722565 677468033 679042969 680086517 681881256 683436432 684847565 686000671
803.4 686000671 685611038 683314209 681143417 679817886 678440170 677238235 676754837 678748474 681311874
812 681311874 683479385 685348206 685835266 686317215 685353012 683589630 682982941 682768021 682351761 683228836
821.7 683228836 685869217 688431091 690362167 690855103 692140503 693331146 692031479 690669250 689533691
830.4 689533691 689182510 689893265 691564941 693838654 696444931 698470459 699694748 701526718 701340561
839 701340561 699667511 698090363 697507935 698139572 698516998 699620972 701034851 702834549 704169617
847.7 704169617 704036102 702827759 701384277 699629898 697245026 696447220 696469879 696972961 697815018
856.4 697815018 699451218 700785828 699833298 699503021 698681641 697231369 695703201 693782578 692911835
865.1 692911835 693096085 694502106 695257339 695462952 696348648 697280807 696406784 693906403 692224045
873.8 692224045 691271820 690927582 690542603 690588379 690624847 690847473 691733246 692368164 693416061 692735825
883.4 692735825 691136780 689017258 686513443 685314713 684359055 684531631 684563828 684495392 685448685
892.1 685448685 686061859 685328903 683754349 682824020 681537170 680722809 680296173 680431824 682370682
900.8 682370682 684645996 687340240 689598007 690915375 691293945 690663300 689992142 689241867 688517990
909.4 688517990 688881531 689806824 690467300 692322922 693640594 693746948 693282318 691528244 689705582
918.1 689705582 687468948 685820618 685414505 685903397 686793060 687095871 687171097 686862106 686340103 685047531
927.8 685047531 683609695 681961975 679574127 677150421 675250473 675124969 675294189 675260925 675171890
936.4 675171890 674358978 673037262 670999680 669219055 666750336 662937927 659751740 658796616 658906784
945.1 658906784 658039169 656899338 656219864 655538330 654259338 652455902 649830399 646287155 643289413
953.8 643289413 641111145 638955269 637098427 636170349 635500603 634707069 634149399 633205566 631376991
962.5 631376991 628820305 626388741 624839745 623008690 620506058 619131050 619119301 619396057 618949051
971.2 618949051 617611122 615974159 613841782 611481171 608959961 606245956 604211197 602571907
978.9 602571907 600787354 599197121 597699471 595905342 593539925 590952148 588612404 585789604
986.6 585789604 582324791 579018936 576828346 575409393 574076996 573133621 572326813 572032051 570950890
995.3 570950890 569272804 567613411 564919319 562452507 560344734 558741531 556863441 555015526
1003 555015526 554260139 553021965 551504555 549975662 548714676 546931725 544245415 541321335 539147758
1011.7 539147758 538019791 536017876 534213181 532912941 532503128 532493019 530942268 528408165 525769272
1020.3 525769272 523876343 522375755 522038536 521567535 521089439 521287003 520425034 519605217 518861694
1029 518861694 518394394 517073135 516018600 515693359 514678268 514423218 514610176 515805016 516340485
1037.7 516340485 517225037 518789520 519531326 520148773 519026718 518095512 517539062 516818008 515758247
1046.4 515758247 514746628 515566063 516297112 515787735 514412384 513962708 513235703 512083969 510973206
1055.1 510973206 510014534 510145569 509335785 509285812 509612732 510754967 512158623 513142776 514449425
1063.7 514449425 513346748 512943382 512882729 512765236 514052696 516053200 518706512 520292549 521027412
1072.4 521027412 521081657 522211647 522881508 522823181 523472023 523781815 524523354 524739723 526060524 528040047
1082.1 528040047 530199661 532325516 533519440 534783516 534849777 534531670 533716545 533483162 533939819
1090.7 533939819 533900490 534207497 534541054 535887032 537437744 538788948 539187508 538741035 537280617
1099.4 537280617 535312157 534719887 533783760 533602409 533418961 533450432 534426575 535327759 536683044
1108.1 536683044 536990356 537206650 536633568 536377563 536784973 536790161 538430099 540569458 542801590
1116.8 542801590 545138817 548091087 549791527 550567436 552406921 553499374 554432411 555275574 556068993
1125.5 556068993 557649384 560268517 562173958 563817940 566779137 568925552 570190277 570778427
1133.2 570778427 571455154 571637306 571805344 572902069 572830162 573377037 574639931 575579872 576321106
1141.9 576321106 577096252 577748680 576644859 575295334 574689598 574483452 574356613 574322090 574658012
1150.5 574658012 575190430 575927391 576063728 575471878 574140282 573799515 573372345 571626167 571215744
1159.2 571215744 571457443 572223167 573176308 574351463 576301460 577799072 579338646 581616821 584104996
1167.9 584104996 585929222 587719612 590303841 593979340 597838287 601609535 605379601 608720856
1175.6 608720856 611891403 613905220 615290031 616911240 618111496 619383659 622145576 624772873
1183.3 624772873 626354980 628598137 630613098 632025452 632838516 633223381 633264465 632335930 631093216
1192 631093216 630256081 630039902 629973946 630060387 630641708 630978279 630271378 628866158 627615013 626135292
1201.6 626135292 624089470 622562714 621775856 620957985 620928116 621606712 621907654 622188301 621807938
1210.3 621807938 621170731 620726013 619639206 618596153 617447853 616641159 616591187 616265564 616103058
1219 616103058 616469955 616681595 616184235 615491791 614364204 612867203 611690331 610124359 609046326
1227.7 609046326 608776665 608762627 609401207 610024490 610297890 610129051 609514427 608781281 608061256 607362213
1237.3 607362213 606682281 606204185 606335983 607192650 608184090 608789825 608571510 608006439 607074356 605860214
1247 605860214 605023041 604102020 603378448 602951355 602870369 603060722 603413658 603791313 603119240 602353477
1256.6 602353477 601356621 599587440 598103523 596893730 596208572 595902748 595868111 596044846 596750145
1265.3 596750145 597577209 597753067 597217522 596203766 595759201 595720253 595737228 595493736 595644913 596726303
1274.9 596726303 598158035 599848404 600762177 601050720 601169357 601486053 601403694 600871887 601558723
1283.6 601558723 602790604 604163780 606011047 608317108 610148659 611374817 612262459 612355614 612426033
1292.3 612426033 612567787 613155785 613996849 614438133 615296555 616626205 617692719 618324432 618809738
1301 618809738 618831291 618218613 617291908 616594315 616079597 615542145 615408745 615533142 615698738 615693665
1310.6 615693665 615573654 615574188 615197525 614109764 612979774 612303162 611672859 611829720 612747993 613548126
1320.3 613548126 614373131 615084343 616075401 616590309 616708984 616782608 616438599 616378593 616319008 616584969
1329.9 616584969 617155266 617565079 617909546 618233910 618959694 619229202 618550148 617840805 617684135 617837372
1339.6 617837372 617665672 617860680 618887215 620289154 621339684 622060432 622464066 622310371 621550179
1348.2 621550179 620486259 619413910 618679962 618332481 618066483 618057976 618336792 618225250 617958107 617642212
1357.9 617642212 616728477 615706291 614287605 612531509 611581650 610595322 609878197 609713211 609532928
1366.6 609532928 609608803 609206009 607760620 606746864 606099510 605712547 605415955 605599098 605988503
1375.2 605988503 606415596 607819748 609486923 610520668 610886536 611028671 611350098 611902351 612330360
1383.9 612330360 613112640 614800911 616644135 618728104 620876541 622803955 624167786 625298767
1391.6 625298767 625829201 626185455 625962105 625329933 625791512 626266479 627710648 627882271 627773590
1400.3 627773590 628288918 628138123 628616753 628545761 627057228 625424919 625117493 624822159 624219017
1409 624219017 624249382 624200516 624317513 623691635 622910881 621932449 621040573 619775314 617594910 617256165
1418.6 617256165 614329224 613672905 614606552 614607735 614924889 614279709 613953209 613449669 612649307 612526016
1428.3 612526016 612352982 611665649 610887909 612005272 613264236 614196129 616036568 618129082 616937027
1437 616937027 615212250 615852127 615246696 614804420 615064621 615212860 615508080 615630722 616097107 616135139
1446.6 616135139 616163254 614881248 614399261 614614410 613913422 613515701 613556633 615386963 617182045
1455.3 617182045 618844147 620709267 620727463 622972755 623057480 623805847 624000282 624132538 625196037
1464 625196037 625364227 626978569 629057732 632001038 634321861 637289581 640878677 644129715 646954956
1472.6 646954956 647566147 649287720 651617889 654156342 655800552 658332825 660716553 662800980
1480.3 662800980 664753189 665379715 666216888 666272736 666411362 667142639 667390747 667049103 668487244
1489 668487244 669825897 667518463 667257538 667095871 666454239 665421066 663895493 658902588 658014908
1497.7 658014908 656720352 651669464 650605469 649341888 646912079 644595108 644171219 644838409 638640022
1506.4 638640022 632551193 630002251 629302559 627571907 627713203 628156013 627277718 628609962 629967041
1515.1 629967041 631742325 634656944 634037399 636086922 639430199 643268661 644371643 645435791
1522.8 645435791 649456024 653310699 655769348 657035370 659499817 660352936 660887833 662845001 664465561
1531.5 664465561 666928558 669726486 670342712 670945969 672660065 675497437 678241806 678197632 673432846
1540.1 673432846 676757584 678101883 678102188 680272598 681268692 680228806 680535736 680606384 681153717 681664352
1549.8 681664352 679566574 679061584 679761810 681155319 680200424 679059906 681534119 686043167 687047272
1558.5 687047272 679781494 675209808 675717468 676033936 675229645 674565430 672528534 671061478 671152420
1567.1 671152420 671415482 672287064 667740402 665649490 664142075 661591721 659855728 658893585 658581543
1575.8 658581543 649619141 648343201 647424927 645699692 644262390 641774673 639732895 636373711
1583.5 636373711 633814659 630607605 627816734 625420685 622877502 621644249 619334145 618232231
1591.2 618232231 616458778 615419693 614024353 611680946 609808655 606755600 605083046 602600746
1599 602600746 601392136 600089111 599069023 598894081 597506485 596937790 595570908 595086403 592878036
1607.6 592878036 591548500 590763588 589022179 589045067 587876740 588011131 587777519 589129181 590301437
1616.3 590301437 586195908 587359543 586603699 586088753 585220451 586092072 587085266 585439911 586136971
1625 586136971 586734009 588483429 588196831 587858391 588495445 588658752 588625526 588273087 589337654 590477753
1634.6 590477753 591364021 591189880 593030167 593418541 593688965 594411888 594435310 595893593 596181259
1643.3 596181259 597286224 599043770 599763184 601626740 601080742 601895447 603174019 605865974 609751244
1652 609751244 612929306 603952980 604380341 606923141 608481560 609821091 610859604 612155991 613871727
1660.7 613871727 616672707 619189911 618764687 620304947 621715889 623441277 625902290 628943367
1668.4 628943367 630959396 632297401 635783539 637459717 639507790 642769089 645948868 646041641 647434692
1677.1 647434692 649648437 652092667 655580826 657498016 659859543 664119415 668108673 665751114
1684.8 665751114 666585541 669367523 672050171 673844376 675550461 677152328 678954697 680969925
1692.5 680969925 682402191 685196381 688655472 686951752 688000031 690328598 693977966 696429749
1700.2 696429749 691368637 693155212 695084152 696414108 696543808 697281723 696211090 694942474 695319595
1708.9 695319595 695483932 694475327 693904877 694174881 695144196 695191345 693635788 695272675 696591949
1717.6 696591949 690781937 688691406 688285294 688146744 687870560 687346802 686371765 686288910 686896362
1726.3 686896362 686734924 686566086 687227249 687031403 685062866 685199356 686991806 686894684 682496643
1734.9 682496643 683234024 685185013 686583786 688114853 689007416 687761002 689617767 691799774 691796341
1743.6 691796341 691488419 692674103 695075073 697647171 700196152 701912766 704715424 706816711
1751.3 706816711 707134705 709889221 711565857 713433914 716771393 718364792 719846268 722697296
1759 722697296 725901566 729936981 733158493 734337082 736889496 738781433 740366287 742322159 744206238
1767.7 744206238 744558334 746215973 749862595 752121124 753050232 753250732 755742340 758482132 758287430
1776.4 758287430 758494415 758680267 759770355 760613785 760240402 760424576 761599121 763816071 764695129
1785.1 764695129 765177841 766045151 766297913 765972672 766887436 768098373 768334579 768000107 766945267
1793.8 766945267 768703461 769935226 769566269 770310211 771855392 772930069 772157898 772849579 772512360
1802.4 772512360 771885147 772438354 772845612 773606110 774168625 775028534 775971298 777195816 776855240
1811.1 776855240 776317291 776761627 776801300 777140961 776719055 777082062 777461624 777540741 778144531 778532410
1820.8 778532410 779584045 779633789 780198364 781570663 780507431 779578094 780091095 781424332 782653809
1829.4 782653809 780607452 779745941 780974808 781158905 781423264 781879425 782092896 782373657 781768723
1838.1 781768723 782367554 782328796 781970901 782109909 782973557 784401703 781297607 781368027 782497940
1846.8 782497940 782811356 782876587 782775497 783013382 782677155 783037415 783037872 782689972 782279129 782095032
1856.4 782095032 782596512 782632141 783123169 783243408 783458557 783501205 783503189 783400269 782696075 782991943
1866.1 782991943 782686996 782935638 783080673 782166519 782616653 783343658 784166794 784338531 784355927 783901215
1875.7 783901215 783422623 782928848 782381363 782461548 782247543 782422638 782719040 783747025 784267426 783787994
1885.4 783787994 783905640 783477249 783726959 783796005 782330017 781767044 781797562 781685028 782106781 783003922
1895 783003922 783001328 783380127 783889389 783988190 783408966 782644501 782500000 782317123 782379761 781974792 782049637
1905.6 782049637 782527542 782831650 783638611 784323425 784251556 783236771 783043594 782754898 782229080 781746292
1915.3 781746292 781612930 782786789 782286072 782022171 782949600 783490677 784296875 784127808 783109207
1923.9 783109207 782285156 781415329 780554428 780425720 780585327 780808182 781454086 781968384 782288895 782142029
1933.6 782142029 782316818 781820602 780923920 780608139 780027542 779611359 779306107 780507050 781685791
1942.3 781685791 780926437 781154327 781634674 781656647 781351166 780915527 780139618 779259872 778709183 778501053
1951.9 778501053 778724594 779177094 779742355 779586792 779652023 779818878 779403152 779067230 778597946 778156738
1961.6 778156738 777642441 777721558 778267517 778616638 778816452 778708344 778572235 778362885 778303680 778141098
1971.2 778141098 777597351 776880341 776811447 776898804 776415176 776423035 776682358 777125092 777241211 777226791
1980.8 777226791 777226639 776644897 776578140 776465607 776026840 775683823 775642014 775567398 775138016 775212479 775545959
1991.5 775545959 775775299 775430679 775308228 775260468 774856720 774785309 774623795 774366150 773951492 773835526
2001.1 773835526 773922653 773793259 773774719 773860626 774011307 773572693 773147125 773166199 773224182 773260040 773245926
2011.7 773245926 773083725 772667847 772417221 772305908 772230759 771864090 771916275 772172089 771901093 771786270
2021.3 771786270 771763840 771791763 771285095 771051025 770823669 770182114 770235977 770176926 770465317 770459671 770232391
2032 770232391 770323410 770236359 770369797 769872131 769403763 768943024 768572769 768743210 768987961 768965683
2041.6 768965683 768399277 768478394 768621368 768873901 768973846 768521652 768245621 767562180 767368240 767566605
2051.2 767566605 767621307 767360382 767242203 767667542 768027344 768350143 768026962 767911224 767701645 767250824
2060.9 767250824 767038803 766405869 766307526 766222382 766122284 766474152 766978073 767478027 767568893 767403564
2070.5 767403564 766995010 766653061 766120605 765595551 765257263 765311890 766024704 766580811 766867676 767072678
2080.2 767072678 767283020 767069244 766911163 766701050 766004333 765487366 765203781 765540924 765866318 766185150
2089.8 766185150 766292496 766154709 766477432 766602631 766675262 766270218 765869064 765413742 764752426 764629593
2099.5 764629593 764424133 764693909 765153885 765555878 765778351 765630722 765616684 765344772 764864120 764301758
2109.1 764301758 764009781 763824387 763894119 764159775 764228134 764280624 764433365 765135651 765274658 764748764
2118.7 764748764 764128036 763698807 763565674 762989655 762609329 762594147 762993927 763455124 763828964 764108734
2128.4 764108734 764004059 763914032 763589325 763413162 762982635 762753906 762770538 762316055 762424316 762881927
2138 762881927 763509369 763707733 763588104 763314133 762708359 762493744 762313766 762279663 762147141 762124710
2147.7 762124710 762479477 763000412 763093567 762758942 763044968 763003006 762975845 763207855 763120422 762702560
2157.3 762702560 762219086 762398071 762743530 763146591 763011475 763009949 763437958 763587723 763693085 763369446
2167 763369446 763194580 762819901 762855606 763059540 762573624 762474594 762570648 762949982 763195724 763567123
2176.6 763567123 763680267 763300629 763328094 763394470 763685913 763669510 763623657 763424988 763389664 763794174
2186.3 763794174 763747406 763939285 763716965 763488464 763581619 763609619 763661957 763642731 763880844 763558502
2195.9 763558502 763285065 763301163 763313141 763296204 763451080 763995209 763903809 763930817 764259796 764559479
2205.5 764559479 764315033 763688736 763686218 763536224 763382874 763335114 763476715 763706894 763922043 764125824
2215.2 764125824 764086990 764041595 763666229 763666000 763551941 763144836 763064957 762976303 762957611 763010559 763662415
2225.8 763662415 763876572 763689957 763817978 763747559 763546600 762993088 762836838 762897873 762780380 762582321
2235.4 762582321 762753906 763244095 762997818 763034821 763507004 763831787 763854904 763465042 762824402 762356644
2245.1 762356644 762525558 762552185 762649536 762831268 762856979 762870483 762882538 763097916 763009949 762644348 762124557
2255.7 762124557 761897507 761957779 761958008 761688995 761638565 762458038 762702332 762745209 763025131 762929382 762697983
2266.3 762697983 762197800 761881027 761717072 761508331 761356430 761789780 762286606 762255325 762340851 762412872
2275.9 762412872 762509613 762437134 762138672 761517105 761241989 761395721 761220627 761423950 761538086 761532135
2285.6 761532135 761801910 762267380 762149353 761514969 761425171 760837250 760463257 760442657 760273666 760258560
2295.2 760258560 760419846 760872269 760606003 760530853 760545425 760122986 759632797 759377823 759775848 759345703
2304.9 759345703 758823318 758630524 758666077 759013824 758750992 758325806 758121490 758891220 759773941 759816742
2314.5 759816742 758804932 757687302 757475739 757054977 756925812 756408615 756032410 756035004 755596390 755558167
2324.2 755558167 755194626 754732590 754347763 754482269 754140625 753841476 754328842 754089127 754270248 754364243
2333.8 754364243 754040146 752709885 752030411 753475647 754323730 753820953 752230301 752359695 753156738
2342.5 753156738 752647705 752059708 751566391 751966553 752590561 753277664 753988266 754292831 753905563 752690964
2352.1 752690964 751805420 751837311 751049042 750213699 750735016 749883575 748734589 749046783 749078751 748468170
2361.8 748468170 747801514 747698212 748240967 749001160 748725891 749123993 750093231 750004120 749723206 749828949
2371.4 749828949 751095963 752366943 752628937 752261353 752388840 752492752 751890640 751863403 751854553 751880264
2381.1 751880264 752016754 752137222 752667236 752975922 753094559 753387299 753590927 753083801 752576981 752376022
2390.7 752376022 751952667 751637955 751463776 751613388 751482162 751386795 751681976 751654434 751649246 751586990
2400.3 751586990 751267548 750596466 750215225 750266342 749932098 749339523 749327621 749890137 749756241 749650879
2410 749650879 750045700 750020523 749587097 749224777 749130554 748684006 748190384 747809067 747454453 747422028
2419.6 747422028 747596207 747611618 747679443 747982712 747472534 747017899 746793213 746158142 745763550 745355682
2429.3 745355682 745275269 745471191 745640488 745662689 745771332 745698395 745444717 745764618 745196838 744346771
2438.9 744346771 744018707 743478088 743228226 743468552 743808975 743744507 743910751 743894577 743836365 743825455
2448.6 743825455 743134766 742704544 742212296 741968307 741739960 741276245 741418228 741325226 741140900 741331635
2458.2 741331635 741612396 741493073 741416550 741343079 740668182 740241776 739893417 739686890 739947891 740049362
2467.8 740049362 739874802 739865189 739958649 739909286 739877625 739413605 738750305 738213959 737720032 737670364 737692642
2478.5 737692642 737208099 736996231 737448349 737610550 737557373 737460632 737321548 736956940 736496735 736296539
2488.1 736296539 735664673 735553665 735661469 735247498 735298233 735435715 735230484 734895401 735070267 734841766
2497.7 734841766 734032516 733820419 733577881 733376007 733342438 733151855 732793579 732649231 732854767 732882385
2507.4 732882385 732845459 732626877 732270432 732179413 732107620 731395416 730540314 730378265 730605621 730717316
2517 730717316 730686646 730964966 730973511 730475311 730004883 729820786 729746704 729441299 729285278 728890533 728705139
2527.6 728705139 728704071 728612671 729093018 728872299 728317871 728342590 728497467 728468475 727935257 727526093
2537.3 727526093 727338943 727007751 726703873 726811371 726905899 726765594 726829681 726657410 726264114 726019669
2546.9 726019669 725810699 725487366 725257797 725076752 724846573 724852448 725088882 725296326 725150452 725062561
2556.6 725062561 725056076 724910202 724653854 724295502 723940811 723255768 722865982 722995911 723135605 722829132
2566.2 722829132 722376175 722636414 722928772 723097839 723049545 722682114 722263031 721747131 721591415 721481094
2575.9 721481094 721036911 720536499 720570526 720903625 721057892 720921936 720373764 720074692 720051117 719986191
2585.5 719986191 719546738 719137878 719023437 718840027 718955307 719076843 719074249 718627396 718236237 718361740
2595.1 718361740 718111420 717655945 717367630 717354050 717179184 717091141 717050476 716739044 716608582 716538162
2604.8 716538162 716793823 716614075 716174164 716006393 715679092 715301743 714544220 714226074 714251709 714055023
2614.4 714055023 713937378 713933029 714045029 713919907 713819733 713690720 713427277 712861938 712356186 712354279
2624.1 712354279 712224503 711990738 711569519 711407547 711557465 711362000 711125793 711171417 711273880 710916672
2633.7 710916672 710093002 709216843 708947754 709035950 709140015 709142990 708868103 708676224 708468857 708498154
2643.4 708498154 708291702 707947769 707630386 707073517 707094269 706792755 706094818 705756226 705941238 706149063
2653 706149063 705949860 706229782 706182480 705833817 705778351 705578461 704950790 704133453 703887100 703558655
2662.6 703558655 703337784 703565674 703639526 703418121 703173447 703154449 702947006 702638245 702014008 701368942
2672.3 701368942 701114655 700828552 700765305 700979156 700944366 700762100 700954971 700577469 699909897 699872437
2681.9 699872437 699863510 699753418 699185867 698538971 698094406 697727203 697571259 697532196 697870407 698130264
2691.6 698130264 697573090 696699829 696688309 696498642 695904694 695897751 695682449 695346909 694926529 694623642
2701.2 694623642 694257278 694052582 694645462 694585876 693963699 693450165 693198242 692929077 692267075 691746445
2710.9 691746445 691676865 692071228 691876068 691530914 691649017 691723022 691553497 690766449 690321884 690074768
2720.5 690074768 689421310 689051895 689290237 689714050 689811783 689707260 689053421 688514252 688437119 688119812
2730.2 688119812 687844009 687336121 686782532 686677170 686920090 687364120 687265778 686848907 686953735 687207870
2739.8 687207870 687126083 686548004 685842285 685739594 685975800 686159210 685963211 685428467 685406418 685790482
2749.4 685790482 685715637 685250244 685021210 684741821 684208679 683707581 683428726 683448410 683426437 683413696
2759.1 683413696 683427353 683427277 683300781 682925262 682686691 682613602 682857437 682998047 682242050 681521454 681638718
2769.7 681638718 681448669 680848160 680739288 680723953 680814819 680731201 680269699 679990692 679240036 678675537
2779.3 678675537 679124222 678949585 678423386 678552094 678309402 678062744 677925644 677602997 677639389 677347565
2789 677347565 676952896 676784897 676263657 675419540 674998016 675009995 674390182 674196472 674592285 673892899
2798.6 673892899 672881927 672615738 672245178 671622009 671198425 670530090 669956589 669306335 668522949
2807.3 668522949 668208389 667943420 667847824 667576904 666893921 666088867 665312119 664704514 664194794 663925400
2816.9 663925400 663227768 662281189 661574860 660984116 660673981 660232620 659482574 658483582 657494354 656672134
2826.6 656672134 656025085 655351791 654219818 653047409 652257080 651595306 650915680 650416565 649719620
2835.3 649719620 648682480 647642365 646939240 646155777 644662628 643388367 642260590 641196976 640353546
2843.9 640353546 639548454 639056740 638131981 636918678 635664482 634724617 634061813 633258705 632513695
2852.6 632513695 631335831 630633354 630065994 629310875 629204712 629045525 628441429 627548332 626920547
2861.3 626920547 626084061 625360565 624987526 624185257 623311119 622537766 622226906 621462975 620583725 620454559
2870.9 620454559 619922638 619345970 618754654 617822685 617045021 616494331 615985641 615857277 615625458 614783401
2880.6 614783401 614194183 613714333 613316498 612836113 612516365 612289047 611464424 611272507 611277618 610578766
2890.2 610578766 609589348 608879318 608621597 608430367 608282433 607699661 607184334 606712379 606155281 606279945
2899.9 606279945 606343460 605865631 605317879 604994545 604640923 604378281 604171638 603888130 603766823 603880844
2909.5 603880844 604225922 603984985 603200493 602573280 602331734 601863327 601584625 602045860 601479454 600466080
2919.2 600466080 600030975 599908829 599791412 599607544 599652634 599589882 600098648 600408554 600594139 600866966
2928.8 600866966 600465775 600304794 600252571 600453758 600124092 599647141 600068169 600699768 601258163 601072578
2938.5 601072578 601253586 601839027 602362556 603024025 603555946 604554138 605272255 605981369 606508942 606536293
2948.1 606536293 607279854 608510437 609731064 610442276 610780144 611146202 611723633 612291603 612838707
2956.8 612838707 613897095 614633713 615012894 615717087 616168633 615970459 615928421 616543198 617461472 618028564
2966.4 618028564 618470726 619408875 619988976 620520782 621451836 622500572 623549538 624075356 624845123
2975.1 624845123 625896912 626606293 626858292 627082710 627966537 628798790 628959351 628934593 629638214 630545349
2984.7 630545349 631029892 631597443 631880188 631594620 631438904 631833801 632149353 632325058 632575760 632682915
2994.4 632682915 632665329 632517242 632718315 633199921 633233910 632708817 632133904 631909103 631913795 631896477
3004 631896477 632033157 631965714 631084633 630667076 631237297 631626511 631235085 630848427 630915260 630555725
3013.7 630555725 630233269 630002098 629415016 628659096 628468018 629012680 628773766 628254776 627785683 627201767
3023.3 627201767 627053146 626837769 626292038 625381279 624822540 624379044 623780098 623585663 623525620 623388062
3033 623388062 623017082 622504463 621772842 621313591 620899963 620271835 619906044 619311295 619043808 619135475
3042.6 619135475 618945160 618098679 617136879 617032776 617017212 616483688 615332108 614605331 614308662 613256836
3052.2 613256836 612256165 612083664 612057571 611354866 610373230 609741669 609657631 609299889 608648529 608347473
3061.9 608347473 607646141 606875496 606071281 605576897 605207138 604396477 604136238 603709450 603083344 602815018
3071.5 602815018 602559776 601857605 600983124 600837860 600540619 599775352 599237251 598959961 598404655 598056488
3081.2 598056488 598108597 597353554 596401672 596006622 595863914 595214767 594316063 593731155 592951508 592123222
3090.8 592123222 591385956 591320648 591295929 590806885 590644264 590168457 589267273 588102684 586979141 586288147
3100.5 586288147 585954056 585913124 585564804 584684219 583927536 583656845 583188362 582687035 582169838 581164970
3110.1 581164970 580335922 580193520 580089226 579009857 578055801 577790146 577490311 577181702 576274261
3118.8 576274261 575027542 574229012 573805809 573335648 572889519 572274513 571061363 570260315 569924545
3127.5 569924545 569294815 568646545 568010368 567301445 567043991 566779823 565917969 565315628 564714317 563820992
3137.1 563820992 563059349 562257576 561539154 561049423 560281639 559366074 558997726 558723793 558420448 557710114
3146.8 557710114 556633072 556128006 555570869 555147438 554696579 553780060 553253975 552789688 552178268
3155.4 552178268 551518593 550436668 549314117 548568687 547766037 547282753 547309952 546850471 545738258
3164.1 545738258 544579926 544155998 543986015 543489609 542870369 541897583 541032181 540537491 540044212
3172.8 540044212 539433899 538689842 537739487 537138367 536985321 536241798 535160828 534794502 534874535 534200134
3182.4 534200134 533305054 532700768 531592026 530332832 529550514 529400864 528923836 528370743 528216629
3191.1 528216629 527442284 526520767 525700455 525206909 525024872 524411888 523367920 522479439 522078438
3199.8 522078438 521489525 520879135 520436974 520114288 519399185 518522263 518692856 518285866 517048721
3208.5 517048721 516409187 515780220 514518738 513470306 513505630 513373489 512733955 512400131 511889915
3217.2 511889915 511182899 510384369 509391136 508955536 508479233 507541428 507277527 507148933 506800652 505770187
3226.8 505770187 504518127 504331894 503998184 503945847 503938179 503164825 502589722 501993370 501400261 500754852
3236.4 500754852 500150681 499863167 499492798 498828964 498332329 497935867 497427864 497352600 496557961 495700874
3246.1 495700874 495729408 495224266 494705238 494302979 493618660 492946815 492686005 492551994 491547241 490686340
3255.7 490686340 490278816 489671364 489408188 489215813 488926277 488584328 487776108 487243080 486871643 486375351
3265.4 486375351 486398964 486178741 485489464 485024338 484897804 484408760 483715401 483296967 482364349 481811256
3275 481811256 481628075 480786781 480276909 480390892 480264282 480000687 480163994 479654350 478610573 478191910
3284.7 478191910 477598724 476735954 476632233 476873207 476727409 476602097 476059380 475508194 475501709 475343666
3294.3 475343666 474954147 474559898 474560204 473846474 472880936 472621384 472166328 472000999 471862793 471216125
3303.9 471216125 470547752 470668411 470861015 470298653 469652824 469058189 468877029 468211899 467383842 466956749
3313.6 466956749 466443367 466388931 466126404 465807228 465385017 464840775 464292831 463860092 463757133 462709618
3323.2 462709618 462044868 462091522 461824036 461542358 461005669 460438652 459823761 459220085 458022308 457146530
3332.9 457146530 457374115 457172127 456495247 455649109 455465469 455802879 455299683 454415321 454261055 454248962
3342.5 454248962 453533173 452857971 452226639 451866379 451771355 451271973 450948067 450701675 450361023 450101547
3352.2 450101547 449769478 449340630 448707695 448254166 448136024 447807884 447594566 447545853 447412109 447351570
3361.8 447351570 446783142 446319275 446328087 445977821 445200729 444880333 445029869 444337997 444059830 444376984
3371.4 444376984 444077530 443735619 443208809 442932472 443089905 443113174 442651825 442498703 442643051 441688995
3381.1 441688995 440816193 440448761 440361748 440957413 441451988 441258163 440647736 440334396 439901047 439558411
3390.7 439558411 439875908 439452934 438170547 437827568 438096275 438167381 438025322 437732658 437938843 438022537
3400.4 438022537 437811050 437451248 437332764 437508049 436848984 436883163 436925049 436232643 436497688 437067070
3410 437067070 437161179 436758118 436525688 436196785 435785599 435652313 435956154 436514969 436511002 436657791
3419.7 436657791 436278114 435947495 435862274 435496750 435854912 436367607 436976051 436539459 435842323 435890198
3429.3 435890198 436294937 437066994 436880302 436628532 436471062 436887550 437142563 436772919 437391739 437641068
3439 437641068 437573471 437391014 437875977 438232193 437614784 437992363 438817444 439844589 439259491 438484192
3448.6 438484192 439166527 439812393 440617409 440628738 440442200 440451889 440695076 440945015 440653572 440841408
3458.2 440841408 441399155 442359695 442820778 443360367 444160233 443825989 443936119 444316635 444011612 444188919
3467.9 444188919 444902153 445166130 445548782 445951767 446242256 447197952 448038406 448373375 448288345 448478088
3477.5 448478088 449313545 450161247 450647774 450810928 450801163 450803299 451660271 452246552 452383537 453400841
3487.2 453400841 454442139 454325905 454231377 455090485 455273628 455410919 456254463 457145691 457810555 458054886
3496.8 458054886 458634834 458991814 459899521 460955582 461735153 462358818 461498375 461435852 462043152 462632713
3506.5 462632713 463250999 464200211 465539818 466070824 466781235 466954575 467463570 468289871 468446541
3515.1 468446541 468860207 469426308 470549126 471410904 471916733 472107201 472995262 474804306 475146141
3523.8 475146141 475411148 476591530 477762032 477560959 477517242 478162994 478762589 479780655 480524406
3532.5 480524406 481690979 482293396 483243256 484034767 483737144 484654465 485213089 486040077 487142868
3541.2 487142868 488457375 489688148 490507851 491401901 491784363 493500099 493264313 493565063 495311317
3549.9 495311317 496400528 497948990 497137527 497537422 498333015 499202232 501446152 502090797 503375359
3558.5 503375359 505081291 505868874 505369720 506635742 508257523 508437004 512445679 513842545 513236084
3567.2 513236084 514299927 512998848 515113182 516572151 517170258 518027573 519204140 520185127 521039314
3575.9 521039314 523148384 523611526 525170479 526660118 526336784 527430763 529317207 530738411 531248360
3584.6 531248360 535181046 538486977 537175598 537754440 535739937 537336388 539906387 542167130
3592.3 542167130 544530716 545044708 547204247 546155853 547069511 550138855 550678406 552862778 553318558
3601 553318558 553308067 554705696 555935440 557526512 560079308 563036957 562563210 565875702 566334953
3609.6 566334953 563466835 569138565 572294502 570889168 573633270 573058357 575699806 579808731
3617.4 579808731 580271378 582381172 582107658 580582390 582303314 584593658 586534538 589170570 591525497
3626 591525497 593741684 600997810 606804771 595839462 595711517 598603745 603193283 605946884 604455872
3634.7 604455872 605567398 608316803 610677948 610870972 611983452 614486732 616981583 618744698
3642.4 618744698 619431992 621065483 624036827 630884972 633125114 630412521 637403107 638589554
3650.1 638589554 634907379 631665611 634356384 637332916 640316086 647155609 643296890 642990265
3657.9 642990265 646932983 648415298 650217209 650884247 652476730 653156052 654873581 657131577 657681427
3666.5 657681427 661274261 664844971 667594299 669120026 662199020 662211533 668455887 677775879 683728638
3675.2 683728638 668645859 665940475 670402603 674357681 673531647 672516632 674273224 676067886
3682.9 676067886 677070770 677074814 676845169 680578690 688353653 683792191 677660599 684424210 681168900
3691.6 681168900 678223801 682002716 682630081 683359680 683140106 682476883 683281555 683266678 685958099
3700.3 685958099 689970551 686502380 682553482 685507202 687223358 687135315 687494278 689303284 692923889
3709 692923889 686916428 689634933 697914963 686847610 686328735 688695831 688883209 689020996 690254135
3717.7 690254135 692695847 690597229 689540482 693777847 691843185 687019043 691317062 692584305
3725.4 692584305 691887665 690122147 688482742 691059570 691780319 696217804 696074600 689819260 696285400
3734 696285400 696842117 691613007 691961136 693050079 692598190 692724686 695971909 693569031 693899612
3742.7 693899612 703807831 701141434 683109741 689488449 694596863 700956726 702278137 690009689
3750.4 690009689 697013626 695542374 687215958 690375443 692969894 695488358 692265320 694014587
3758.2 694014587 699498138 693872604 690478287 692488785 693109436 693427658 697495575 697274323 692015305
3766.8 692015305 693225479 698147964 701033096 693038330 692260284 694548645 694157028 694213257 693521881
3775.5 693521881 693645172 694189377 697195358 698711395 691898117 691866837 692899323 693375015 696617508
3784.2 696617508 696102142 693825378 693948288 694338303 694192352 693761520 693993607 693907318 693709717 693008423
3793.8 693008423 693632355 696838760 695308990 691366196 691443405 694245148 701534500 702143326 691435623
3802.5 691435623 691314468 692305527 695536575 702062378 696839447 689940033 691965408 693351288 693729019
3811.2 693729019 693808746 693051147 693536530 698776855 701397095 690690155 692559052 696264038 699616699
3819.9 699616699 704149017 691635056 688636169 691887512 693238144 694633255 695518188 692563553
3827.6 692563553 691748962 692728653 695285950 698295517 690868454 691255646 698081207 693464127 691428299
3836.3 691428299 698808060 695152588 690578156 696533966 692423401 689673233 694821930 694726868 690658112
3844.9 690658112 691280899 692290573 692107239 693697281 693779907 695600357 701904526 699398880 701015015
3853.6 701015015 687717590 683719406 691941605 692379684 689973526 690766678 692211151 694615250
3861.3 694615250 691790161 691722641 697479019 693386841 686653442 688871460 693057556 700389328 698470001
3870 698470001 687492905 687553787 691839142 697626572 690993576 688574677 691081238 690640182 692075272
3878.7 692075272 696306686 694056473 685876770 688539963 690615616 692416153 698321762 688301163
3886.4 688301163 685745468 688799820 689720764 694164200 696457367 688829269 687509155 690215912
3894.1 690215912 688717270 688572693 689664459 691611404 693713303 685984192 689111176 692631149
3901.8 692631149 688211594 691562042 691240311 689941559 688184662 686720963 688254013 687887039 687916336
3910.5 687916336 688677216 689044647 688720245 688416519 689688187 691497269 689320755 684968948 687669830
3919.2 687669830 688519440 684532089 686149902 688571396 690117950 688614349 685343857 686106491 687289352
3927.9 687289352 688335953 687339859 686745987 689443436 688647079 686309433 686570435 686710434 686459656
3936.6 686459656 686633759 686547318 686253128 685929260 686832886 688780212 686644058 685016251 685289459
3945.2 685289459 685760727 687233124 685926895 686537781 687306137 684766312 685349884 685529633 684728699
3953.9 684728699 684813919 685266876 686296234 686279221 685767441 684792480 684743042 685372086 684444199 683739853
3963.6 683739853 683881607 684347916 684630127 684355850 684433975 685064697 685057373 684868011 684677277 683887939
3973.2 683887939 683913193 684667130 684597778 683811188 683204956 683208313 683736725 683544922 683549271 684245758 683459396
3983.8 683459396 682958145 682757492 682282333 682761230 682785873 682782669 682740021 682973099 683247986 682498245
3993.5 682498245 682625809 682857513 682556381 682653961 682971420 683451614 683286972
4000.2 683286972
##END=$$ End of the data block
